{
  "paperNumber": "76029",
  "recordNumber": "00384",
  "acessionNumber": "77086296",
  "authors": [
    "Lawson-D",
    "Porter-J."
  ],
  "title": "Serum precipitins against respiratory tract pathogens in 522 \"normal\" children, and 48 cases of cystic fibrosis treated with cloxacillin.",
  "source": "Arch-Dis-Child. 1976 Nov. 51(11). P 890-1.",
  "majorSubjects": [
    "CLOXACILLIN: tu",
    "CYSTIC-FIBROSIS: im",
    "PRECIPITINS: an.",
    "RESPIRATORY-TRACT-INFECTIONS: im."
  ],
  "minorSubjects": [
    "ADOLESCENCE",
    "AGE-FACTORS",
    "CHILD",
    "CHILD-PRESCHOOL.",
    "CYSTIC-FIBROSIS: dt",
    "HUMAN",
    "INFANT",
    "INFANT-NEWBORN."
  ],
  "abstractExtract": "Well children show a steady increase of staphylococcal precipitins throughout life.  Lower incidences are found for precipitins against H. influenzae, Pneumococcus, and haemolytic streptococcus. Precipitins against Proteus, Pseudomonas, and Klibsiella are rare. There are marked differences between the normal children and the cloxacillin-treated children with cystic fibrosis in respect to Pseudomonas and H. influenzae which rise to over 50% of cystic fibrosis children in the third quinquennium.  However, the development of staphylococcal precipitins can be prevented by continuous antistaphylococcal therapy.",
  "references": [
    "001   BURNS MW              LANCET                           1   223 968",
    "002   BURNS MW              LANCET                           1   354 967",
    "003   BURNS MW              LANCET                           1   270 968"
  ],
  "citations": [
    "1   PRESSLER T            ACTA PAEDIATR SCAND             73   541 984"
  ]
}