{
  "paperNumber": "78070",
  "recordNumber": "00851",
  "acessionNumber": "78063085",
  "authors": [
    "Brock-D-J",
    "Barron-L",
    "Manson-J",
    "McCrae-W-M."
  ],
  "title": "Serum alphafetoprotein in cystic fibrosis of the pancreas.",
  "source": "Clin-Chim-Acta. 1978 Jan 2. 82(1-2). P 101-3.",
  "majorSubjects": [
    "ALPHA-FETOPROTEINS: me",
    "CYSTIC-FIBROSIS: bl."
  ],
  "minorSubjects": [
    "HETEROZYGOTE",
    "HUMAN",
    "RADIOIMMUNOASSAY."
  ],
  "abstractExtract": "Serum alphafetoprotein concentrations were measured by three different types of radioimmunoassay in 30 patients with cystic fibrosis of the pancreas and in 55 controls. The highest value obtained in cystic patient was 10.2 ng/ml and in a control 10.8 ng/ml. These are within published normal limits. Previously reported large increases in serum AFP in patients with cystic fibrosis and in heterozygote carriers have not been confirmed.",
  "references": [
    "001   CHANDRA RK            BR MED J                         1   714 975",
    "002   BROCK DJH             BR MED J                         2   392 975",
    "003   WALLWORK JC           BR MED J                         2   392 975",
    "004   FITZSIMMONS JS        BR MED J                         3   544 975",
    "005   BELANGER L            BR MED J                         4   759 975",
    "006   BROCK DJH             CLIN CHIM ACTA                  57   315 974",
    "007   BROCK DJH             LANCET                           1   745 975",
    "008   VINCE JD              BR J OBSTET GYNAECOL            82   718 975",
    "009   FORRESTER PI          CLIN CHIM ACTA                  64   317 975",
    "010   HUNTER WM             IN: WEIR DM                              973"
  ],
  "citations": [
    "1   GOSDEN C              BR MED J                         2  1186 978",
    "2   GOSDEN C              J MED GENET                     15   262 978",
    "3   BROCK DJH             BR J OBSTET GYNAECOL            85   575 978",
    "4   RODECK CH             LANCET                           1   949 980",
    "5   BROCK DJH             BR J OBSTET GYNAECOL            87   582 980",
    "6   BROCK DJH             BR J OBSTET GYNAECOL            89   348 982"
  ]
}