{
  "paperNumber": "79196",
  "recordNumber": "01176",
  "acessionNumber": "79221570",
  "authors": [
    "Ryley-H-C."
  ],
  "title": "An evaluation of the meconium \u0027lactase test\u0027 for the detection of cystic fibrosis in the newborn.",
  "source": "Monogr-Paediatr. 1979. 10. P 151-4.",
  "majorSubjects": [
    "BETA-GALACTOSIDASES: an",
    "CYSTIC-FIBROSIS: di",
    "GALACTOSIDASES: an.",
    "MECONIUM: an."
  ],
  "minorSubjects": [
    "ALBUMINS: an",
    "HUMAN",
    "INFANT-NEWBORN."
  ],
  "abstractExtract": "Recently, Antonowicz et al. proposed a simple test for cystic fibrosis that could be used to verify the Boehringer-Mannheim meconium test result and thus reduce the false-positive incidence. The test is based on the detection of lactase activity in meconium. The \u0027lactase test\u0027 may be of some value as a confirmatory test when used with the BM-mec test although its specificity in this study was not as good as previously reported.",
  "references": [
    "001   ANTONOWICZ I          PEDIATRICS                      56   782 975",
    "002   ANTONOWICZ I          LANCET                           1   746 976",
    "003   BRUNS WT              AM J DIS CHILD                 131    71 977",
    "004   RYLEY HC              CLIN CHIM ACTA                  64   117 975",
    "006   STEPHAN U             PEDIATRICS                      55    35 975"
  ],
  "citations": [
    "1   MASTELLA G            RIV ITAL PEDIATR                 7   581 981",
    "2   PEDERZINI F           RIV ITAL PEDIATR                 9   445 983"
  ]
}