{
  "paperNumber": "78082",
  "recordNumber": "00863",
  "acessionNumber": "78238710",
  "authors": [
    "Endres-W",
    "Wuttge-B."
  ],
  "title": "Occurrence of secondary cystathioninuria in children with inherited metabolic disorders, liver diseases, neoplasms, cystic fibrosis and celiac disease.",
  "source": "Eur-J-Pediatr. 1978 Aug 17. 129(1). P 29-35.",
  "majorSubjects": [
    "CELIAC-DISEASE: ur",
    "CYSTATHIONINE: ur",
    "CYSTIC-FIBROSIS: ur.",
    "LIVER-DISEASES: ur",
    "METABOLISM-INBORN-ERRORS: ur",
    "NEOPLASMS: ur."
  ],
  "minorSubjects": [
    "ADOLESCENCE",
    "AGE-FACTORS",
    "BILE-DUCTS: ab",
    "CHILD",
    "CHILD-PRESCHOOL.",
    "CYTOMEGALIC-INCLUSION-DISEASE: ur",
    "HUMAN",
    "INFANT."
  ],
  "abstractExtract": "Secondary cystathioninuria was found in two of 46 children suffering from tumors, leukemia, liver disease, inherited metabolic disorders, cystic fibrosis and celiac disease. Of these two patients, one had congenital biliary atresia and the other cytomegalovirus infection. Seven further children had only moderately elevated excretion of cystathionine. It is suggested that secondary cystathioninuria is uncommon in the disease investigated.",
  "references": [
    "001   ENDRES W              Z KINDERHEILK                  110    46 971",
    "003   FOURMAN P             ARCH DIS CHILD                  41   273 966",
    "004   GEISER CF             CANCER                          22   856 968",
    "005   GJESSING LR           LANCET                           2  1281 963",
    "006   GJESSING LR           SCAND J CLIN LAB INVEST         17   513 965",
    "007   GJESSING LR           RECENT RESULTS CANCER RES        2    26 966",
    "008   LIEBERMAN E           PEDIATRICS                      40   828 967",
    "009   SCRIVER CR            PEDIATRICS                      31   240 963",
    "010   SHAW KNF              AM J DIS CHILD                 113   119 967",
    "011   STUDNITZ W            ACTA PAEDIATR SCAND             58   173 969",
    "012   STUDNITZ W            ACTA PAEDIATR SCAND             59    80 970",
    "013   VOUTE PA JR           CLIN CHIM ACTA                  22   373 968"
  ],
  "citations": [
    "1   SHIN YS               CLIN CHIM ACTA                 127    77 983"
  ]
}