{
  "queryNumber": "49",
  "queryText": "Is RNA methylation or polyamine metabolism normal in CF patients?",
  "relevantDocuments": "36",
  "results": [
    [
      "72",
      "0100"
    ],
    [
      "84",
      "0010"
    ],
    [
      "138",
      "2222"
    ],
    [
      "143",
      "2222"
    ],
    [
      "230",
      "2220"
    ],
    [
      "313",
      "2222"
    ],
    [
      "370",
      "0010"
    ],
    [
      "392",
      "1010"
    ],
    [
      "393",
      "2220"
    ],
    [
      "430",
      "0010"
    ],
    [
      "436",
      "2222"
    ],
    [
      "440",
      "1000"
    ],
    [
      "465",
      "0001"
    ],
    [
      "493",
      "2222"
    ],
    [
      "503",
      "0001"
    ],
    [
      "504",
      "1222"
    ],
    [
      "505",
      "0001"
    ],
    [
      "523",
      "2220"
    ],
    [
      "530",
      "0001"
    ],
    [
      "553",
      "0010"
    ],
    [
      "562",
      "2220"
    ],
    [
      "563",
      "2220"
    ],
    [
      "566",
      "1000"
    ],
    [
      "568",
      "1212"
    ],
    [
      "570",
      "1001"
    ],
    [
      "586",
      "0001"
    ],
    [
      "608",
      "0001"
    ],
    [
      "624",
      "2222"
    ],
    [
      "625",
      "1221"
    ],
    [
      "691",
      "2220"
    ],
    [
      "726",
      "0100"
    ],
    [
      "743",
      "2220"
    ],
    [
      "749",
      "0011"
    ],
    [
      "953",
      "1222"
    ],
    [
      "972",
      "2222"
    ],
    [
      "1198",
      "2222"
    ]
  ]
}