{
  "paperNumber": "79243",
  "recordNumber": "01223",
  "acessionNumber": "80122681",
  "authors": [
    "Mangos-J-A."
  ],
  "title": "Cystic fibrosis: potential management through manipulation of the secretory process in affected exocrine glands.",
  "source": "Prog-Clin-Biol-Res. 1979. 34. P 111-7.",
  "majorSubjects": [
    "CYSTIC-FIBROSIS: th",
    "EXOCRINE-GLANDS: se."
  ],
  "minorSubjects": [
    "ANIMAL",
    "CATS",
    "CYSTIC-FIBROSIS: pp",
    "EXOCRINE-GLANDS: de",
    "FERRETS.",
    "ISOPROTERENOL: pd",
    "MACROMOLECULAR-SYSTEMS",
    "MUCUS: se.",
    "PAROTID-GLAND: de",
    "RATS",
    "SALIVA: se",
    "SODIUM: se",
    "TRACHEA: de.",
    "WATER-ELECTROLYTE-BALANCE."
  ],
  "abstractExtract": "Ten years ago, we demonstrated that chronic administration of isoproterenol to rats results is structural and functional changes of their salivary glands similar to those seen in exocrine glands of patients with cystic fibrosis.  Recently, we began to study the cellular pathophysiology of these glands and managed to achieve pharmacological control of this abnormality.  We demonstrated that administration of a beta-adrenergic antagonist in these animals resulted in the correction of the electrolyte abnormality which is very similar to that seen in the sweat glands of patients with cystic fibrosis.  These two examples of manipulation of the secretory processes in exocrine glands of experimental animals demonstrate the feasibility of this approach in the therapy of patients with cystic fibrosis.",
  "references": [
    "001   MANGOS JA             IN: ANDREOLI TE                          978",
    "002   MANGOS JA             J DENT RES                      57   989 978",
    "004   MANGOS JA             CF PROJECTIONS INTO THE FUTUR            976",
    "007   MANGOS JA             AM J PHYSIOL                   225   683 973",
    "008   MANGOS JA             AM J PHYSIOL                   229   553 975",
    "009   MANGOS JA             AM J PHYSIOL                   229   560 975",
    "010   MANGOS JA             AM J PHYSIOL                   229   566 975",
    "011   MANGOS JA             IN: LAWSON D PROC 5TH INT CF          25 969",
    "012   NADEL JA              CIBA FOUND SYMP 54                       978",
    "013   STURGESS JM           BR J EXP PATHOL                 54   388 973"
  ],
  "citations": []
}