{
  "paperNumber": "77026",
  "recordNumber": "00608",
  "acessionNumber": "78058877",
  "authors": [
    "Lieberman-J",
    "Kaneshiro-W."
  ],
  "title": "Abnormal response of cultured lymphocytes to phytohemagglutinin and autologous serum in cystic fibrosis.",
  "source": "Am-Rev-Respir-Dis. 1977 Dec. 116(6). P 1047-55.",
  "majorSubjects": [
    "CYSTIC-FIBROSIS: im",
    "LYMPHOCYTE-TRANSFORMATION",
    "LYMPHOCYTES: im."
  ],
  "minorSubjects": [
    "ADOLESCENCE",
    "ADULT",
    "BLOOD-TRANSFUSION-AUTOLOGOUS",
    "CELLS-CULTURED.",
    "COMPARATIVE-STUDY",
    "CYSTIC-FIBROSIS: fg",
    "FEMALE",
    "GLUCURONIDASE: an.",
    "HETEROZYGOTE",
    "HOMOZYGOTE",
    "HUMAN",
    "IN-VITRO",
    "LYMPHOCYTES: an.",
    "MALE",
    "LECTINS",
    "PROTEINS: an",
    "SUPPORT-U-S-GOVT-P-H-S."
  ],
  "abstractExtract": "Lymphocytes from adults homozygous or heterozygous for cystic fibrosis show biochemical abnormalities when cultured for 48 hours in the presence of phytohemagglutinin and autologous serum. In contrast to the 45 per cent increase in total protein and beta-glucuronidase concentrations seen in healthy control subjects when measured per 10(10) cells, both concentrations decreased by 1 per cent in adults heterozygous for cystic fibrosis and by 18 per cent in adults homozygous for cystic fibrosis. The abnormal response of the lymphocytes from persons with cystic fibrosis was due to a serum factor and not to any intrinsic abnormality of the lymphocytes. An abnormal response to hytohemagglutinin occurred in only 14 per cent of 44 healthy control subjects, but in 100 per cent of 14 adults homozygous for cystic fibrosis and in 85 per cent of 26 adults presumed to be heterozygous for cystic fibrosis. As a result of this phenomenon, lymphocytic beta-glucuronidase concentrations were significantly lower than normal in patients with cystic fibrosis when the cells were cultured with phytohemagglutinin and autologous serum. The demonstration of this phenomenon in both homozygotes and presumed heterozygotes (parents) suggests a relationship to the genetic defect in cystic fibrosis.",
  "references": [
    "001   LIEBERMAN J           CHEST                           70   433 976",
    "002   WOOD RE               AM REV RESPIR DIS              113   833 976",
    "003   DI SANTAGNESE PA      N ENGL J MED                   295   481 976",
    "004   DANES BS              NATURE                         222   685 969",
    "005   DANES BS              LANCET                           2   437 969",
    "006   GRIFFIN GD            PROC SOC EXP BIOL MED          137   438 971",
    "007   ANTONOWICZ I          PEDIATR RES                      6   803 972",
    "008   RENNERT OM            CLIN PEDIATR                    11   351 972",
    "009   MARCHI AG             HELV PAEDIATR ACTA              28   427 973",
    "010   CONOVER JH            PEDIATR RES                      7   224 973",
    "011   STEELE WM             PEDIATR RES                      7   394 973",
    "012   BOZKOWA K             BOLL IST SIEROTER MILAN         53   266 974",
    "013   DANES BS              BIOCHEM GENET                   12   359 974",
    "014   SHAPIRO BL            LANCET                           2  1020 974",
    "015   OGRADY LR             CF CLUB ABST                          16 975",
    "016   BRAUNSTEIN M          CF CLUB ABST                          28 975",
    "017   BEUTLER E             J EXP MED                      143   975 976",
    "018   THURMAN GB            CLIN EXP IMMUNOL                15   289 973",
    "019   HIRSCHHORN K          SCIENCE                        166  1632 969"
  ],
  "citations": [
    "1   LIEBERMAN J           LANCET                           1   985 978",
    "2   MARCHI AG             HELV PAEDIATR ACTA              33   517 978",
    "3   SORENSEN RU           INFECT IMMUN                    23   398 979",
    "4   LIEBERMAN J           CHEST                           75   220 979",
    "5   HODSON ME             THORAX                          35   801 980",
    "6   WILSON GB             J CLIN INVEST                   66  1010 980",
    "7   SORENSEN RU           PEDIATR RES                     15    14 981",
    "8   SORENSEN RU           AM REV RESPIR DIS              123    37 981",
    "9   SEALE TW              ANN CLIN LAB SCI                12   415 982",
    "10   DISTELHORST CW        CELL IMMUNOL                    75   188 983",
    "11   LIEBERMAN J           AM J MED                        77   678 984",
    "12   SPEERT DP             SURV SYNTH PATHOL RES            4    14 985"
  ]
}