{
  "paperNumber": "75187",
  "recordNumber": "00353",
  "acessionNumber": "75199860",
  "authors": [
    "Dajani-A-M."
  ],
  "title": "Obscure bilateral calcified swellings of paratesticular tissues.",
  "source": "Urology. 1975 Jul. 6(1). P 101-4.",
  "majorSubjects": [
    "CALCINOSIS: pa",
    "SCROTUM: pa."
  ],
  "minorSubjects": [
    "CALCINOSIS: et",
    "CASTRATION",
    "CYSTIC-FIBROSIS: co",
    "HUMAN",
    "INFANT.",
    "MALE",
    "MECONIUM",
    "PERITONITIS: co."
  ],
  "abstractExtract": "A case of calcified swellings of the paratesticular tissues discovered in an infant at different ages is described.  The exact cause is obscure; and three pathologic conditions are suggested. Possibly it was due to an old reaction to meconium peritonitis through a patent processus vaginalis.",
  "references": [
    "004   OERTEL HB             JAMA                            49    32 907",
    "005   THANNHAUSER SJ        PHYSIOL REV                     26   275 946",
    "006   WILLIAMS G            BR J UROL                       51   332 969",
    "007   BERDON WE             N ENGL J MED                   277   585 967",
    "008   OLNICK HM             CITED IN: N ENGL J MED         277   585 967",
    "009   THOMPSON RB           J UROL                         110   364 973"
  ],
  "citations": [
    "1   FOROUHAR F            AM J CLIN PATHOL                78   208 982"
  ]
}