{
  "paperNumber": "77010",
  "recordNumber": "00592",
  "acessionNumber": "78057956",
  "authors": [
    "Reid-L."
  ],
  "title": "Treatment of mucus hypersecretion in human disease.",
  "source": "Adv-Exp-Med-Biol. 1977. 89. P 469-76.",
  "majorSubjects": [
    "BRONCHIAL-DISEASES: th",
    "MUCUS: se."
  ],
  "minorSubjects": [
    "AIRWAY-OBSTRUCTION: me",
    "ATROPINE: tu",
    "BRONCHIAL-DISEASES: me.",
    "COMPARATIVE-STUDY",
    "CYSTIC-FIBROSIS: th",
    "EXUDATES-AND-TRANSUDATES.",
    "GLYCOPROTEINS: an",
    "HUMAN",
    "SPUTUM: an",
    "SUPPURATION",
    "VISCOSITY."
  ],
  "abstractExtract": "Treatment of mucus hypersecretion in human disease should first be directed at prevention.  The hypersecretion of mucus, even in the absence of pus in the sputum or of other signs of infection, is of itself associated with significantly poor lung function.  Infection is probably the important stimulus in cystic fibrosis.  Certain anti-inflammatory agents are now known to cause retention of mucus within the secretory cells although the rate of synthesis is not raised.  It may be that this offers a new way of control.  On the other hand, the cells become larger and this may be undesirable.  I would prefer to see a study of the effect of drugs on the cellular stages of synthesis and discharge rather than concentration on mucolytic agents.",
  "references": [
    "001   BURGI H               MED THORAC                      21   156 964",
    "002   CHARMAN J             BIORHEOLOGY                     10   295 973",
    "003   GREGG I               PROC ASPEN EMPHYSEM CONF 9TH         235 968",
    "004   HILLIS BR             LANCET                           1  1230 952",
    "005   JONES R               BR J EXP PATHOL                 54   229 973",
    "006   KEAL EE               POSTGRAD MED J                  47   171 971",
    "007   LOPEZ-VIDRIERO MT     BULL PHYSIOPATH RESPIR NANCY     9   339 973",
    "008   LOPEZ-VIDRIERO MT     THORAX                          30   624 975",
    "009   LOPEZ-VIDRIERO MT     THORAX                          30   543 975",
    "010   MAY JR                IN: TAVERNER D                         6 968",
    "011   MILLER DL             AM REV RESPIR DIS               88   473 963",
    "012   REID L                BULL PHYSIOPATH RESPIR NANCY     9    15 973",
    "013   ROBERTS GP            ARCH BIOCHEM BIOPHYS           173   528 976",
    "014   STURGESS JM           CLIN SCI                        43   533 972",
    "015   WHITE JC              J PATHOL BACTERIOL              67   105 954"
  ],
  "citations": []
}