{
  "paperNumber": "75132",
  "recordNumber": "00298",
  "acessionNumber": "75176450",
  "authors": [
    "Kuzemko-J-A."
  ],
  "title": "Recurrent diarrhoea in children.",
  "source": "Nurs-Mirror. 1975 Jul 10. 141(2). P 55-8.",
  "majorSubjects": [
    "DIARRHEA: et",
    "DIARRHEA-INFANTILE: et",
    "INTESTINAL-DISEASES: co."
  ],
  "minorSubjects": [
    "CELIAC-DISEASE: co",
    "CHILD",
    "CHILD-PRESCHOOL.",
    "COLITIS-ULCERATIVE:  co",
    "CYSTIC-FIBROSIS: co",
    "ENTERITIS: co",
    "",
    "FOOD-HYPERSENSITIVITY: co",
    "GIARDIASIS: co",
    "HUMAN",
    "INFANT",
    "",
    "INTESTINAL-DISEASES-PARASITIC",
    "RECURRENCE."
  ],
  "abstractExtract": "Diarrhoea can be defined as the passage of loose stools and increased bowel frequency above the accepted norm for the individual and resulting in excess loss of water and electrolytes in the faeces.  It may or may not be associated with steatorrhea (fatty stools). History plays a vital part in the diagnosis of gastro-intestinal disease in children.  Time spent here is often more rewarding than a battery of specialised investigations.  One must be clear what the parent means by diarrhoea, as terminology among doctors, nurses, and parents is often confusing.  When dealing with children one must always adopt a comprehensive approach and consider the whole child and his family.  Common causes, mechanisms, and consequences are discussed.  Some of the common causes of diarrhoea are cystic fibrosis, gluten-induced enteropathy (coeliac disease), Giardia lamblia, sugar intolerance, gastro-intestinal allergy, and irritable bowel syndrome.",
  "references": [],
  "citations": []
}