{
  "paperNumber": "79212",
  "recordNumber": "01192",
  "acessionNumber": "80211288",
  "authors": [
    "Vawter-G-F",
    "Shwachman-H."
  ],
  "title": "Cystic fibrosis in adults: an autopsy study.",
  "source": "Pathol-Annu. 1979. 14 Pt 2. P 357-82.",
  "majorSubjects": [
    "CYSTIC-FIBROSIS: pa."
  ],
  "minorSubjects": [
    "ADULT",
    "ARTERIOVENOUS-ANASTOMOSIS: pa",
    "AUTOPSY",
    "BILIARY-TRACT: pa.",
    "BRONCHIAL-ARTERIES: pa",
    "BRONCHIECTASIS: pa",
    "ENDOCRINE-GLANDS: pa.",
    "EXOCRINE-GLANDS: pa",
    "FEMALE",
    "HOARSENESS: pa",
    "HUMAN.",
    "LIVER-CIRRHOSIS-BILIARY: pa",
    "LUNG: pa",
    "MALE",
    "NASAL-POLYPS: pa.",
    "PANCREAS: pa",
    "TRACHEITIS: pa",
    "UROGENITAL-SYSTEM: pa."
  ],
  "abstractExtract": "An annotated catalog of clinical and pathologic observations in an adult population with CF has been presented. The spectrum of disease is broad, and the diagnosis usually requires the demonstration of abnormalities in multiple systems. Tissues of each germ layer have been found involved in CF. Correlation of clinical and pathologic observations suggests that manifestations are essentially episodic and focal. In this population, the most characteristic abnormalities recognized by the pathologist are focal biliary cirrhosis, distinctive obstructive lesions of the male genital tract, prolonged staphylococcal or pseudomonas colonization of respiratory secretions, and obstructive bronchopulmonary disease. Some form of pancreatic atrophy is usually present.",
  "references": [
    "001   DANKS DM              ANN HUM GENET                   28   323 965",
    "002   SHWACHMAN H           MEDICINE (BALTIMORE)            56   129 977",
    "003   SHWACHMAN H           PEDIATRICS                      30   389 962",
    "004   GELLER A              NEUROLOGY (MINN)                27   185 977",
    "006   MELLINS RB            PEDIATRICS                      44   315 969",
    "007   WARING WW             PEDIATRICS                      39   166 967",
    "008   FIELD WEH             BR J DIS CHEST                  60    66 966",
    "009   LIEBOW AA             AM J PATHOL                     25   211 949",
    "010   LACK EE               HUM PATHOL                       8    39 977",
    "012   OPPENHEIMER EH        PERSPECT PEDIATR PATHOL          2   241 975",
    "013   BODIAN M              FIBROCYSTIC DIS OF THE PANCRE            952",
    "014   FARBER S              ARCH PATHOL                     37   238 944",
    "015   DI SANTAGNESE PA      PEDIATRICS                      18   387 956",
    "016   ROBERTS WC            AM J MED                        32   324 962",
    "017   BLANC WA              PEDIATRICS                      22   494 958",
    "018   ESTERLY NB            AM J DIS CHILD                 123   200 972",
    "019   KOPITO L              PROC AM PEDIATR SOC ANNU MTG             972",
    "020   DUNNILL MS            J PATHOL BACTERIOL              77   299 959",
    "021   DI SANTAGNESE PA      N ENGL J MED                   295   481 976",
    "022   DOLAN TF JR           J PEDIATR                       79   684 971",
    "024   HOLSCLAW DS           J UROL                         106   568 971",
    "025   GILLES FH             J NEUROPATH EX NEUROL           25   138 966",
    "026   SUNG JH               J NEUROPATH EXP NEUROL          23   567 964",
    "027   WALLWORK JC           CLIN EXP IMMUNOL                18   303 974",
    "028   KOPITO LE             PEDIATR RES                     10   742 976",
    "029   SHWACHMAN H           PEDIATRICS                      55    86 975"
  ],
  "citations": [
    "1   HOLSCLAW DS           CLIN CHEST MED                   1   407 980",
    "2   ROY CC                J PEDIATR GASTROENTEROL NUTR     1   469 982",
    "3   ABDULKARIM FW         GASTROENTEROLOGY                82   758 982",
    "4   IANNUCCI A            HUM PATHOL                      15   278 984",
    "5   MCCARTHY VP           GASTROENTEROLOGY                86   564 984",
    "6   DAVIS PB              SEM RESPIR MED                   6   314 985",
    "7   CASTILE R             AM J DIS CHILD                 139   728 985",
    "8   STERN RC              J PEDIATR GASTROENTEROL NUTR     5    35 986",
    "9   DISIS ML              PEDIATR RES                     20   385 986",
    "10   TRAVIS WD             AM J CLIN PATHOL                85   419 986",
    "11   ABDULKARIM FW         ARCH PATHOL LAB MED            110   602 986",
    "12   MCGLENNEN RC          ARCH PATHOL LAB MED            110   879 986",
    "13   HERNANZSCHULMAN M     RADIOLOGY                      158   629 986",
    "14   GRISCOM NT            AM J ROENTGENOL                148   691 987"
  ]
}