{
  "paperNumber": "75182",
  "recordNumber": "00348",
  "acessionNumber": "75199129",
  "authors": [
    "Ryland-D",
    "Reid-L."
  ],
  "title": "The pulmonary circulation in cystic fibrosis.",
  "source": "Thorax. 1975 Jun. 30(3). P 285-92.",
  "majorSubjects": [
    "CYSTIC-FIBROSIS: pp",
    "PULMONARY-CIRCULATION.",
    "PULMONARY-HEART-DISEASE: pa."
  ],
  "minorSubjects": [
    "ADOLESCENCE",
    "ADULT",
    "BODY-HEIGHT",
    "BODY-WEIGHT",
    "CHILD.",
    "CHILD-PRESCHOOL",
    "CYANOSIS",
    "ELECTROCARDIOGRAPHY.",
    "HEART-VENTRICLE:  pp",
    "HEART: ra",
    "HEMOGLOBINS: an",
    "HUMAN",
    "INFANT",
    "",
    "INFANT-NEWBORN",
    "LUNG-VOLUME-MEASUREMENTS",
    "LUNG: pa, ra.",
    "MYOCARDIUM: pa",
    "ORGAN-WEIGHT.",
    "OSTEOARTHROPATHY-SECONDARY-HYPERTROPHIC",
    "PSEUDOMONAS-INFECTIONS",
    "",
    "PULMONARY-ARTERY: pa",
    "PULMONARY-HEART-DISEASE: di",
    "PULMONARY-VEINS: pa."
  ],
  "abstractExtract": "The hearts and lungs of 36 patients dying of cystic fibrosis have been studied to establish the relationship between right ventricular hypertrophy (RVH), pathological changes in the pulmonary circulation, and the clinical features. The presence and degree of RVH were measured by Fulton\u0027s technique of weighing the ventricles separately. Of the subjects who died after the age of 3 years, one in six had no RVH, although the mean age of this group was not significantly different from that of the remainder. There was no correlation between duration of cyanosis, haemoglobin levels, and RVH. Although not statistically significant, the cases without RVH tended to have had clubbing of the finger-nails for longer periods before death. The electrocardiogram was useful in the diagnosis of RVH. Right ventricular hypertrophy was common in children with lungs of large volume as judged by the radiographic centile of lung length. Cases with RVH show reduced background haze in the arteriogram and fewer arteries per unit area of lung. For the first time thickening of the medial muscle layer proportional to the degree of RVH has been demonstrated, only in the smaller arteries. Arterial subintimal fibrosis is more common in cases with RVH, as is thickening of the walls of small pulmonary veins. The implications of these findings are discussed.",
  "references": [
    "001   ANDERSEN DH           AM J DIS CHILD                  56   344 938",
    "002   ANDERSEN DH           PEDIATRICS                       3   406 949",
    "003   BOWDEN DH             CIRCULATION                     28   693 963",
    "004   CAPLAN AH             J PEDIATR                       73   540 968",
    "005   DAVIES GM             IN: LAWSON D PROC 5TH INT CF         350 969",
    "006   DAVIES G              THORAX                          25   669 970",
    "007   DUNNILL MS            THORAX                          17   329 962",
    "008   ELLIOTT FM            THESIS                                   964",
    "009   ESTERLY JR            JOHNS HOPKINS MED J            122    94 968",
    "010   FULTON RM             BR HEART J                      14   413 952",
    "011   GOLDRING RM           J PEDIATR                       65   501 964",
    "012   HISLOP A              THESIS                                   971",
    "013   HISLOP A              THORAX                          25   682 970",
    "014   KELMINSON LL          PEDIATRICS                      39    24 967",
    "015   LAWSON D              IN: LAWSON D PROC 5TH INT CF         225 969",
    "016   MAY CD                J PEDIATR                       34   663 949",
    "017   MEARNS MB             ARCH DIS CHILD                  47   902 972",
    "018   MILLARD FJC           THESIS                                   965",
    "019   RECAVARREN S          BR HEART J                      26   187 964",
    "020   ROYCE SW              PEDIATRICS                       8   255 951",
    "021   SHWACHMAN H           AM J DIS CHILD                  96     6 958",
    "022   SHINEBOURNE E         MEDICINE                        16   999 973",
    "023   SIASSI B              J PEDIATR                       78   794 971",
    "024   SIMON G               ARCH DIS CHILD                  47   373 972",
    "025   SYMCHYCH PS           ARCH PATHOL                     92   409 971",
    "026   TANNER JM             ARCH DIS CHILD                  41   454 966",
    "027   WEIBEL ER             J APPL PHYSIOL                  17   343 962",
    "028   WIGLESWORTH FW        AM J MED SCI                   212   351 946",
    "029   ANON                  WHO TECH REP SER NO 213                  961"
  ],
  "citations": [
    "1   GAULTIER C            SEM HOP PARIS                   52   447 976",
    "2   HISLOP A              BR J EXP PATHOL                 57   542 976",
    "3   FISHMAN AP            AM REV RESPIR DIS              114   775 976",
    "4   HAWORTH SG            BR HEART J                      39    80 977",
    "5   SHELTON DM            CHEST                           71   303 977",
    "6   REID L                AM J ROENTGENOL                129   777 977",
    "7   POUKKULA A            SCAND J RESPIR DIS            1977     7 977",
    "8   MEYRICK B             LAB INVEST                      38   188 978",
    "9   GOLDSTEIN JD          AM J CARDIOL                    43   962 979",
    "10   ALLEN HD              CHEST                           75   428 979",
    "11   MEYRICK B             AM J PATHOL                     94    37 979",
    "12   MEYRICK B             AM J PATHOL                     96    51 979",
    "13   REID LM               AM REV RESPIR DIS              119   531 979",
    "14   MATTHAY RA            BR HEART J                      43   474 980",
    "15   LESTER LA             J PEDIATR                       97   742 980",
    "16   FRANCIS PWJ           AM J DIS CHILD                 134   734 980",
    "17   MATTHAY RA            MED CLIN NORTH AM               65   489 981",
    "18   MIGALLY N             J SUBMICROSC CYTOL              14   239 982",
    "19   HAWORTH SG            CARDIOVASC RES                  16   293 982",
    "20   RABINOVITCH M         AM J CARDIOL                    50   804 982",
    "21   REID L                ANN NY ACAD SCI                384     3 982",
    "22   KUZEMKO JA            LANCET                           1   448 983",
    "23   COTTON DJ             RESPIR PHYSIOL                  54    19 983",
    "24   GAULTIER C            EUR J RESPIR DIS                64   319 983",
    "25   GAULTIER C            AM REV RESPIR DIS              127   527 983",
    "26   BRIGHAM KL            CIRC RES                        54   623 984",
    "27   GAULTIER C            EUR J RESPIR DIS                65   460 984",
    "28   LESTER LA             SEM RESPIR MED                   6   285 985",
    "29   GAULTIER C            BULL EUR PHYSIOPATH RESP        21    55 985",
    "30   GAULTIER C            CHEST                           87   168 985",
    "31   MEYRICK B             CHEST                           88  S268 985",
    "32   GEGGEL RL             AM REV RESPIR DIS              131   531 985",
    "33   HAWORTH SG            INT J CARDIOL                   13   207 986",
    "34   THOMPSON BT           HEART LUNG                      15   457 986",
    "35   MEYRICK B             LAB INVEST                      55   164 986",
    "36   PERKETT EA            J APPL PHYSIOL                  61  1875 986",
    "37   REID LM               CHEST                           89   279 986",
    "38   HAWORTH SG            WIEN KLIN WOCHENSCHR            98   732 986",
    "39   BRIGHAM KL            AM REV RESPIR DIS              133   913 986",
    "40   GAULTIER C            BULL EUR PHYSIOPATH RESP        23    87 987",
    "41   LEBECQUE P            CHEST                           91   693 987"
  ]
}