{
  "paperNumber": "75065",
  "recordNumber": "00231",
  "acessionNumber": "75129766",
  "authors": [
    "van-Stekelenburg-G-J",
    "van-de-Laar-AJB",
    "van-der-Laag-J."
  ],
  "title": "Copper analysis of nail clippings.  An attempt to differentiate between normal children and patients suffering from cystic fibrosis.",
  "source": "Clin-Chim-Acta. 1975 Mar 10. 59(2). P 233-40.",
  "majorSubjects": [
    "COPPER: me",
    "CYSTIC-FIBROSIS: di",
    "NAILS: me."
  ],
  "minorSubjects": [
    "CHILD",
    "COPPER: an",
    "CYSTIC-FIBROSIS: me",
    "DIAGNOSIS-LABORATORY.",
    "FINGERS",
    "HUMAN",
    "METHODS",
    "SPECTROPHOTOMETRY-ATOMIC-ABSORPTION.",
    "TOES."
  ],
  "abstractExtract": "From 39 normal children and 36 patients, suffering from cystic fibrosis (C/F), the copper content of finger nail clippings and toe nail clippings were determined. From this study it can be concluded that, although the patients with cystic fibrosis (C/F) have a higher copper content, the determination of copper in nail samples cannot be used in order to differentiate between normal children and patients. Also higher mean copper concentrations were found in finger nail clippings in comparison with toe nails. This difference was significant for patients with cystic fibrosis.",
  "references": [
    "001   DI SANTAGNESE PA      PEDIATRICS                      12   549 953",
    "002   GIBSON LE             PEDIATRICS                      23   545 959",
    "003   BENDER SW             MUCOVISCIDOSE CYSTISCHE FIBR             970",
    "004   STEPHAN U             PADIATRISCHE PRAXIS             12   487 973",
    "005   WISER WC              PEDIATRICS                      33   115 964",
    "006   GREEN MN              PEDIATRICS                      41   989 968",
    "007   BABB AL               TRANS AM NUCL SOC                9   591 966",
    "008   FITE LE               PROC SYMP BLED INT AT ENE                972",
    "009   BARNETT WB            ATOMIC ABSORP APPL STUDY 474             971",
    "010   KOLLBERG H            ACTA PAEDIATR SCAND             63   405 974",
    "011   KOLLBERG H            ACTA PAEDIATR SCAND             63   411 974",
    "012   HARRISON GM           CF CLUB ABST                    11    26 970",
    "013   MARTIN GM             NATURE                         202   903 964",
    "014   KANABROCKI E          J NUCL MED                       9   478 968",
    "015   HARRISON WW           CLIN CHIM ACTA                  31    63 971",
    "016   BARNETT WB            CLIN CHEM                       18   923 972",
    "017   DIXON WJ              BIOMETRICS                       9    74 953"
  ],
  "citations": [
    "1   SOHLER A              CLIN CHIM ACTA                  70   391 976",
    "2   SOLOMONS NW           AM J CLIN NUTR                  32   856 979",
    "3   LANGMYHR FJ           ANALYST                        104   993 979",
    "4   SOLOMONS NW           AM J CLIN NUTR                  34   462 981",
    "5   LANGMYHR FJ           PROG ANALYT ATOM SPECTR          8   193 985"
  ]
}