{
  "paperNumber": "78174",
  "recordNumber": "00954",
  "acessionNumber": "79011612",
  "authors": [
    "Scholey-J",
    "Applegarth-D-A",
    "Davidson-A-G",
    "Wong-L-T."
  ],
  "title": "Detection of cystic fibrosis protein by electrofocusing [letter].",
  "source": "Pediatr-Res. 1978 Jul. 12(7). P 800.",
  "majorSubjects": [
    "BLOOD-PROTEINS: an",
    "CYSTIC-FIBROSIS: bl."
  ],
  "minorSubjects": [
    "HUMAN",
    "ISOELECTRIC-FOCUSING."
  ],
  "abstractExtract": "Wilson et al. reported a biophysical assay for cystic fibrosis that employed isoelectric focusing of serum proteins.  Their work appeared to establish the presence of a definitive marker for CF serum in the form of a protein band that was not present in normal serum.  We tried to repeat their work and found that the background color of the fresh electropherograms made it rather difficult to detect unequivocally the presence or absence of bands in the appropriate pH region in CF vs. control serum.  However, when the gels were photographed using Kodak Panatomic X film and a Wratten 25 A red filter, the color response and contrast of the film eliminated this interference to a great extent and it was much easier to detect the putative band.  We agree partially with the observations of Wilson and Fudenberg, but would like to stress that the technique is not a diagnostic test.",
  "references": [
    "001   SMITH QT              PEDIATR RES                     10   999 976",
    "002   THOMAS JM             PEDIATR RES                     11  1148 977",
    "003   WILSON GB             PEDIATR RES                     11   986 977",
    "004   WILSON GB             PEDIATR RES                     10  1001 976",
    "005   WILSON GB             PEDIATR RES                      9   635 975",
    "006   WILSON GB             PEDIATR RES                     11   139 977"
  ],
  "citations": [
    "1   TULLY GW              PEDIATR RES                     13  1078 979",
    "2   WILSON GB             PEDIATR RES                     13  1079 979",
    "3   MANSON JC             LANCET                           1   330 980",
    "4   WILSON GB             LANCET                           2   313 980",
    "5   NEVIN GB              HUM GENET                       56   387 981",
    "6   HALLINAN FM           CLIN CHIM ACTA                 117   103 981",
    "7   BULLOCK S             CLIN GENET                      21   336 982",
    "8   BROCK DJH             HUM GENET                       60    30 982",
    "9   BURY AF               CLIN CHIM ACTA                 118    45 982",
    "10   GRATAROLI R           PEDIATR RES                     18   130 984",
    "11   ANON                  LANCET                           2   249 985",
    "12   JAMIESON A            HUM GENET                       70   168 985",
    "13   QURESHI AR            J PEDIATR                      106   913 985",
    "14   HAYWARD C             J IMMUNOL METH                  91   117 986"
  ]
}