{
  "paperNumber": "76002",
  "recordNumber": "00357",
  "acessionNumber": "77062364",
  "authors": [
    "Baran-D",
    "Loeb-H",
    "Mozin-M-J."
  ],
  "title": "Efficiency of two pancreatic extracts in patients with cystic fibrosis.",
  "source": "Acta-Paediatr-Belg. 1976 Apr-Jun. 29(2). P 117-22.",
  "majorSubjects": [
    "CYSTIC-FIBROSIS: me",
    "INTESTINAL-ABSORPTION: de",
    "LIPIDS: me.",
    "NITROGEN: me",
    "PANCREATIC-EXTRACTS: tu."
  ],
  "minorSubjects": [
    "CHILD",
    "CHILD-PRESCHOOL",
    "CYSTIC-FIBROSIS: dt",
    "FEMALE",
    "HUMAN.",
    "INFANT",
    "MALE."
  ],
  "abstractExtract": "Nitrogen- and lipid absorption coefficients were studied in 62 patients with cystic fibrosis, aged 2/12 to 12 years, and compared with the results obtained in 20 normal children.  In 59 of the 62 patients nitrogen- and lipid absorption were grossly abnormal. Age-linked differences were not found.  The efficacy of two pancreatic enzymes preparations was found to be similar.  Both preparations produced the same significant improvement in the absorption of proteins and lipids.",
  "references": [
    "001   BEST EB               SOUTH MED J                     53  1091 960",
    "002   HAINES RD             JAMA                           180  1000 962",
    "003   HARRIS R              ARCH DIS CHILD                  30   424 955",
    "004   JENSEN SB             ACTA PAEDIATR SCAND             45    70 956",
    "005   LAPEY A               J PEDIATR                       84   328 974",
    "006   ROSS CAC              ARCH DIS CHILD                  30   316 955",
    "007   SHOHL AT              J PEDIATR                       23   267 943",
    "008   SNEDECOR GW           STATISTICAL METHODS                      967",
    "009   TREMOLIERES J         CAHIERS NUTR DIETET              1    13 966"
  ],
  "citations": [
    "1   MALMENDIER CL         HELV PAEDIATR ACTA              32   115 977",
    "2   ROGIERS V             PEDIATR RES                     14  1088 980",
    "3   ROGIERS V             CLIN CHIM ACTA                 105   105 980",
    "4   TOLCKMITT W           KLIN PAEDIATR                  193   365 981",
    "5   ROGIERS V             EUR J PEDIATR                  141    39 983"
  ]
}