{
  "paperNumber": "74022",
  "recordNumber": "00022",
  "acessionNumber": "74122409",
  "authors": [
    "Doershuk-C-F",
    "Fisher-B-J",
    "Matthews-L-W."
  ],
  "title": "Specific airway resistance from the perinatal period into adulthood. Alterations in childhood pulmonary disease.",
  "source": "Am-Rev-Respir-Dis. 1974 Apr. 109(4). P 542-7.",
  "majorSubjects": [
    "AGE-FACTORS",
    "AIRWAY-RESISTANCE",
    "CYSTIC-FIBROSIS: pp.",
    "LUNG-DISEASES: pp",
    "PULMONARY-DIFFUSING-CAPACITY."
  ],
  "minorSubjects": [
    "ADOLESCENCE",
    "ADULT",
    "CHILD",
    "CHILD-PRESCHOOL",
    "CYSTIC-FIBROSIS: ra.",
    "FEMALE",
    "HUMAN",
    "INFANT",
    "INFANT-NEWBORN",
    "LUNG: ra",
    "MALE.",
    "RESPIRATORY-FUNCTION-TESTS",
    "SEX-FACTORS.",
    "VENTILATION-PERFUSION-RATIO."
  ],
  "abstractExtract": "Airway resistance and lung volume were measured by a modification of the plethysmographic method of Briscoe and DuBois (1) to calculate specific airway resistance (SRaw) on 263 control subjects ranging in age from the newborn to 54 years.  the mean SRaw was lowest in the newborn period and increased rapidly to adult levels during the first years of life.  In each age group, the mean SRaw was lower for females than it was for males.  No control subject had an SRaw greater than 8 sec cm H2O.  A decrease in mean SRaw from 4.2 sec cm H2O for females 5 to 9 years of age to 3.5 sec cm H2O for those over 18 years of age paralleled sexual maturation, but similar changes were not observed in the males.  A direct correlation of SRaw with clinical observations was found in young patients with various degrees of pulmonary involvement because of cystic fibrosis.",
  "references": [
    "001   BRISCOE WA            J CLIN INVEST                   37  1279 958",
    "002   LLOYD TC JR           AM REV RESPIR DIS               87   529 963",
    "003   PAYNE CB              AM J MED                        42   554 967",
    "004   DOERSHUK CF           PEDIATR RES                      4   165 970",
    "005   DUBOIS AB             J CLIN INVEST                   35   322 956",
    "006   DUBOIS AB             J CLIN INVEST                   35   322 956",
    "007   DRAPER NR             APPLIED REGRESSION ANALYSIS              966",
    "008   DOERSHUK CF           J PEDIATR                       65   677 964",
    "009   SHWACHMAN H           AM J DIS CHILD                  96     6 958",
    "010   POLGAR G              J PEDIATR                       67   557 965",
    "011   KRIEGER I             PEDIATRICS                      33    45 964",
    "012   WOHL MEB              PEDIATRICS                      43   495 969",
    "013   PHELAN PD             ARCH DIS CHILD                  44   393 969"
  ],
  "citations": [
    "1   HATCH DJ              ARCH DIS CHILD                  51   859 976",
    "2   HIBBERT ME            J APPL PHYSIOL                  57   304 984"
  ]
}