{
  "paperNumber": "76083",
  "recordNumber": "00437",
  "acessionNumber": "76215365",
  "authors": [
    "Levison-H",
    "Godfrey-S."
  ],
  "title": "Pulmonary aspects of cystic fibrosis.  pp.  3-24.",
  "source": "In: Mangos JA, Talamo RC, ed. Cystic fibrosis: projections into the future. New York, Stratton, 1976. WI 820 C9995 1976. (REVIEW).",
  "majorSubjects": [
    "CYSTIC-FIBROSIS: pp",
    "RESPIRATION."
  ],
  "minorSubjects": [
    "ADOLESCENCE",
    "AIRWAY-RESISTANCE",
    "CHILD",
    "CYSTIC-FIBROSIS: th.",
    "EXERTION",
    "FEMALE",
    "HELIUM",
    "HUMAN",
    "MALE.",
    "MAXIMAL-EXPIRATORY-FLOW-RATE",
    "MAXIMAL-EXPIRATORY-FLOW-VOLUME-CURVES.",
    "MONOGRAPH",
    "OXYGEN",
    "PHYSICAL-FITNESS",
    "PHYSICAL-THERAPY.",
    "PLETHYSMOGRAPHY-WHOLE-BODY",
    "REVIEW",
    "SEX-FACTORS.",
    "VENTILATION-PERFUSION-RATIO."
  ],
  "abstractExtract": "Defective mucociliary transport has been implicated in the pathogenesis of the lung disease in cystic fibrosis, based on several observations.  First, patients with the disease secrete more mucus than normal subjects, as indicated by gland hypertrophy, and frequently retain it in the lung.  Second, the mucus is said to have altered biochemical and rheological properties; however, although the physiochemical properties of mucus are altered in all lung diseases, little histochemical or rheological difference has been found in mucus from patients with CF and other hypersecretory conditions such as chronic bronchitis and bronchiectasis.  Third, a factor in the serum of CF patients inhibits normal ciliary activity in explain glands of ciliated epithelium; and infection, which damages human ciliated epithelium in culture, could further reduce mucociliary transport.  Measurement of pulmonary function in cystic fibrosis, physical fitness and response to exercise in cystic fibrosis, control of breathing in patients with cystic fibrosis, regional lung function in cystic fibrosis, and therapy of cystic fibrosis are discussed.",
  "references": [
    "001   ZUELZER WW            PEDIATRICS                       4    53 949",
    "002   REID L                MOD PROBL PEDIATR               10   195 967",
    "003   ESTERLY JR            JOHNS HOPKINS MED J            122    94 968",
    "004   MATTHEWS LW           AM REV RESPIR DIS               88   199 963",
    "005   POTTER JL             ANN NY ACAD SCI                106   692 963",
    "006   DENTON R              PEDIATRICS                      25   611 960",
    "007   LAMB D                BR J DIS CHEST                  66   239 972",
    "008   STURGESS JM           IN: LAWSON D PROC 5TH INT CF         368 969",
    "009   CHARMAN J             BIORHEOLOGY                      9   185 972",
    "010   FEATHER EA            BR J DIS CHEST                  64   192 970",
    "011   SPOCK A               PEDIATR RES                      1   173 967",
    "012   CONOVER JH            PEDIATR RES                      7   220 973",
    "013   CAMNER P              AM REV RESPIR DIS              108   131 973",
    "014   CAMNER P              IN: HERS JFP                         236 973",
    "015   SAKAKURA Y            ANN OTOL RHINOL LARYNGOL        82   203 973",
    "017   SANCHIS J             N ENGL J MED                   288   651 973",
    "018   THOMSON ML            N ENGL J MED                   289   749 974",
    "019   WOOD RE               AM REV RESPIR DIS              111   733 975",
    "020   MACKLEM PT            PHYSIOL REV                     51   368 971",
    "021   LAMARRE A             PEDIATRICS                      50   291 972",
    "022   COOPER DM             AM REV RESPIR DIS              109   519 974",
    "023   MCCARTHY DS           AM J MED                        52   747 972",
    "024   MANSELL A             AM REV RESPIR DIS              109   190 974",
    "025   HUTCHEON M            AM REV RESPIR DIS              110   458 974",
    "026   LAPIERRE JG           CAN PAED SOC ANN MTG ABST             61 975",
    "027   EMIRGIL C             AM J MED                        51   504 971",
    "028   DOERSHUK CF           AM REV RESPIR DIS              109   452 974",
    "029   PHELAN PD             ARCH DIS CHILD                  44   393 969",
    "031   GOLDRING RM           J PEDIATR                       65   501 964",
    "032   GODFREY S             EXERCISE TESTING IN CHILDREN             974",
    "033   GODFREY S             ARCH DIS CHILD                  46   144 971",
    "034   JONES NL              CLIN SCI                        31    39 966",
    "035   DAVIES CT             HUM BIOL                        44   195 972",
    "036   ANDERSON SD           BR J DIS CHEST                  69     1 975",
    "037   DAY G                 ARCH DIS CHILD                  48   355 973",
    "039   LLOYD-STILL JD        PEDIATRICS                      53   678 974",
    "040   COUNAHAN R            ARCH DIS CHILD                  50   477 975",
    "041   WHITELAW WA           RESPIR PHYSIOL                  23   181 975",
    "044   FEATHERBY EA          CAN MED ASSOC J                102   835 970",
    "045   CHANG N               AM REV RESPIR DIS              107   672 973",
    "046   MOTOYAMA EK           IN: MANGOS JA                        335 973"
  ],
  "citations": [
    "1   BOWMAN BH             LIFE SCI                        19  1289 976",
    "2   WOOD RE               AM REV RESPIR DIS              113   833 976",
    "3   ORENSTEIN DM          AM J DIS CHILD                 131   973 977",
    "4   SEALE TW              J CLIN MICROBIOL                 9    72 979",
    "5   GUIDOTTI TL           RESPIRATION                     44   351 983",
    "6   WHEELER WB            J PEDIATR                      104   695 984",
    "7   EICHLER I             DTSCH MED WSCHR                111   896 986"
  ]
}