{
  "paperNumber": "75130",
  "recordNumber": "00296",
  "acessionNumber": "75216046",
  "authors": [],
  "title": "Vitamin E.",
  "source": "Med-Lett-Drugs-Ther. 1975 Aug 15. 17(17). P 69-70.",
  "majorSubjects": [
    "HEART-DISEASES: dt",
    "VITAMIN-E-DEFICIENCY",
    "VITAMIN-E: tu."
  ],
  "minorSubjects": [
    "ADULT",
    "ANEMIA-HEMOLYTIC: et",
    "CYSTIC-FIBROSIS: co",
    "HUMAN",
    "INFANT.",
    "LIVER-CIRRHOSIS-BILIARY: co",
    "PORPHYRIA: dt.",
    "VITAMIN-E-DEFICIENCY:  co",
    "VITAMIN-E: ad, ae."
  ],
  "abstractExtract": "Vitamin E has been claimed to prevent, ameliorate, or cure skin disease, warts, ulcers, strabismus, baldness, frostbite, arthritis, jaundice, muscular dystrophy, diabetes, liver dysfunction, thyroid disease, sexual impotence, and aging.  The vitamin has recently been added to cosmetics, used as a deodorant, and alleged to be an effective antidote to air pollution.  There is no evidence that large doses of vitamin E are effective for the prevention or treatment of heart disease or any other human disorder, except in premature infants and possibly in patients with diseases that impair fat absorption.  Adverse effects, though rare, have resulted from ingestion of large doses of vitamin E.",
  "references": [
    "001   HORWITT MK            AM J CLIN NUTR                  27  1182 974",
    "002   BIERI JG              NUTR REV                        33   161 975",
    "003   OSKI FA               J PEDIATR                       70   211 967",
    "004   WILLIAMS ML           N ENGL J MED                   292   887 975",
    "005   HORWITT MK            AM J CLIN NUTR                  12    99 963",
    "006   VOGELSANG A           NATURE                         157   772 946",
    "007   SHUTE WE              VITAMIN E FOR AILING AND HEAL            970",
    "008   BAILEY H              VITAMIN E YOUR KEY TO A HEALT            966",
    "009   LEVY H                ANN INTERN MED                  28  1117 948",
    "010   RAVIN IS              N ENGL J MED                   240   331 949",
    "011   MAKINSON DH           LANCET                           1   102 948",
    "012   RINZLER SH            CIRCULATION                      1   288 950",
    "013   ANDERSON TW           CAN MED ASSOC J                110   401 974",
    "014   HAEGER K              AM J CLIN NUTR                  27  1179 974",
    "015   ANON                  BR MED J                         4   251 971",
    "016   SHARMAN IM            BR J NUTR                       26   265 971",
    "017   LAWRENCE JD           AM J CLIN NUTR                  28   205 975",
    "018   NAIR PP               ARCH INTERN MED                128   411 971",
    "019   WATSON CJ             ARCH INTERN MED                131   698 973",
    "020   ANDERSON TW           CAN MED ASSOC J                110   401 974",
    "021   CORRIGAN JJ JR        JAMA                           230  1300 974"
  ],
  "citations": [
    "1   STEWART JA            SOUTH MED J                     73  1297 980"
  ]
}