{
  "paperNumber": "74015",
  "recordNumber": "00015",
  "acessionNumber": "74129630",
  "authors": [
    "Dooley-R-R",
    "Braunstein-H",
    "Osher-A-B."
  ],
  "title": "Polypoid cervicitis in cystic fibrosis patients receiving oral contraceptives.",
  "source": "Am-J-Obstet-Gynecol. 1974 Apr 1. 118(7). P 971-4.",
  "majorSubjects": [
    "CERVICITIS: ci",
    "CERVIX-NEOPLASMS: ci",
    "CONTRACEPTIVES-ORAL: ae.",
    "CYSTIC-FIBROSIS: co",
    "POLYPS: ci."
  ],
  "minorSubjects": [
    "ADULT",
    "BIOPSY",
    "CERVICITIS: co",
    "CERVIX-NEOPLASMS: co, pa.",
    "ETHINYL-ESTRADIOL: ae",
    "FEMALE",
    "HUMAN",
    "MEDROXYPROGESTERONE: ae.",
    "NEUTROPHILS",
    "NORETHINDRONE: ae",
    "POLYPS: co, pa.",
    "RESPIRATORY-INSUFFICIENCY: co."
  ],
  "abstractExtract": "Three of the 4 women in a cystic fibrosis clinic who used a combined form of oral contraceptive developed acute polypoid cervicitis.  In one woman, the polyp recurred on reinstitution of the medication. There was resolution of the polyp in each instance on discontinuation of the drugs.  In 2 of the 3 affected women, there was coincidental deterioration of respiratory status.  Therefore, it is suggested that cystic fibrosis patients who are using oral contraception be observed closely regarding pulmonary and gynecologic status.",
  "references": [
    "001   OPPENHEIMER EA        AM J OBSTET GYNECOL            108   673 970",
    "002   OPPENHEIMER EH        J PEDIATR                       77   991 970",
    "003   TAYLOR HB             JAMA                           202   637 967",
    "004   GOVAN ADT             J CLIN PATHOL                   22    84 969",
    "005   GALL SA               JAMA                           207  2243 969",
    "006   TALBERT JR            AM J OBSTET GYNECOL            105   117 969",
    "007   KYRIAKOS M            CANCER                          23    99 968",
    "008   GRAHAM J              OBSTET GYNECOL                  31   190 968",
    "009   MAQUEO M              AM J OBSTET GYNECOL             96   994 966",
    "010   BLAIR GWS             BIOCHEM J                       35  1039 941",
    "011   KOPITO LE             FERTIL STERIL                   24   499 973"
  ],
  "citations": [
    "1   GREENSTEIN JS         CONTRACEPTION                   11   105 975",
    "2   WOOD RE               AM REV RESPIR DIS              113   833 976",
    "3   ANASTASIADIS P        GEBURTSHILFE FRAUENHEILKD       38    45 978",
    "4   FITZPATRICK SB        CHEST                           86   863 984",
    "5   STEAD RJ              THORAX                          42    59 987"
  ]
}