{
  "paperNumber": "78184",
  "recordNumber": "00964",
  "acessionNumber": "78157375",
  "authors": [
    "Mellis-C-M",
    "Levison-H."
  ],
  "title": "Bronchial reactivity in cystic fibrosis.",
  "source": "Pediatrics. 1978 Mar. 61(3). P 446-50.",
  "majorSubjects": [
    "ASTHMA: co",
    "BRONCHI: de",
    "CYSTIC-FIBROSIS: co",
    "HISTAMINE: pd."
  ],
  "minorSubjects": [
    "ADOLESCENCE",
    "ADULT",
    "AEROSOLS",
    "AIRWAY-RESISTANCE",
    "BRONCHI: pp.",
    "CHILD",
    "COMPARATIVE-STUDY",
    "CYSTIC-FIBROSIS: pp",
    "FEMALE.",
    "FORCED-EXPIRATORY-VOLUME",
    "HISTAMINE: ad",
    "HUMAN",
    "MALE.",
    "MAXIMAL-MIDEXPIRATORY-FLOW-RATE",
    "SKIN-TESTS",
    "SPIROMETRY."
  ],
  "abstractExtract": "There is considerable dispute regarding the prevalence of asthma in patients with cystic fibrosis (CF). We studied 50 patients with CF and compared their responsiveness to inhaled histamine with that of asthmatic children. The incidence of positive responses to inhaled histamine was 24% in the patients with CF and more than 90% in the asthmatic patients. We found no correlation, in the patients with CF, between the histamine response and several indexes of atopy (clinical allergic disease and positive allergen skin tests). Positive responders to histamine were not evenly distributed over the disease spectrum of CF. Instead, positive responses occurred only in those patients whose prechallenge pulmonary function was abnormal. We conclude that the heightened bronchial reactivity in patients with CF reflects the severity of their underlying lung disease rather than the presence of coexistent asthma.",
  "references": [
    "001   COUNAHAN R            ARCH DIS CHILD                  50   477 975",
    "002   MCCARTHY DS           IN: LAWSON D PROC 5TH INT CF         194 969",
    "003   WARNER JO             ARCH DIS CHILD                  51   507 976",
    "004   ABBOTT V              CAN MED ASSOC J                 64   419 951",
    "005   DERBES VJ             J ALLERGY                       28   287 957",
    "006   LANDAU LI             J PEDIATR                       82   863 973",
    "007   HEIMLICH EM           J ALLERGY CLIN IMMUNOL          37   103 966",
    "008   DAY G                 ARCH DIS CHILD                  48   355 973",
    "009   SKORECKI K            ACTA PAEDIATR SCAND             65    39 976",
    "010   ITKIN IH              J ALLERGY CLIN IMMUNOL          40   245 967",
    "011   PARKER CD             ARCH INTERN MED                115   452 965",
    "012   DEKOCK MA             J APPL PHYSIOL                  21   185 966",
    "013   ANON                  LANCET                           2   691 975",
    "014   CHAI H                J ALLERGY CLIN IMMUNOL          56   323 975",
    "015   MERCER TT             ANN ALLERGY                     23   314 965",
    "016   DUBOIS AB             J CLIN INVEST                   35   322 956",
    "017   WENG TR               AM REV RESPIR DIS               99   879 969",
    "018   HALUSZKA J            RESPIRATION                     32   217 975",
    "019   ROTHSTEIN RJ          J ALLERGY CLIN IMMUNOL          53   100 974",
    "020   RUBINFELD AR          AM REV RESPIR DIS              115   381 977",
    "021   DOLOVICH MB           J APPL PHYSIOL                  40   468 976",
    "022   HOGG JC               N ENGL J MED                   278  1355 968",
    "023   EMPEY DW              AM REV RESPIR DIS              113   131 976",
    "024   GIMENO F              THORAX                          29    16 974"
  ],
  "citations": [
    "1   MITCHELL I            J PEDIATR                       93   744 978",
    "2   LEUPOLD W             MONOGR PAEDIATR                 10   119 979",
    "3   ZAMBIE MF             ANN ALLERGY                     42   290 979",
    "4   LARSEN GL             AM REV RESPIR DIS              119   399 979",
    "5   NELSON LA             AM REV RESPIR DIS              120   863 979",
    "6   BURDON JGW            MED J AUST                       2    77 980",
    "7   SLY PD                AUST PAEDIATR J                 16   205 980",
    "8   VANASPEREN PP         AUST PAEDIATR J                 16    53 980",
    "9   TOBIN MJ              THORAX                          35   807 980",
    "10   TABACHNIK E           AM REV RESPIR DIS              122    97 980",
    "11   LARSEN GL             AM J DIS CHILD                 134  1143 980",
    "12   PULLAN CR             BR MED J                       280   364 980",
    "13   DOLOVICH J            THORAX                          36   641 981",
    "14   HOLZER FJ             ARCH DIS CHILD                  56   455 981",
    "15   FANTA CH              MED CLIN NORTH AM               65   473 981",
    "16   FREEDMAN PM           J ALLERGY CLIN IMMUNOL          67    59 981",
    "17   SMYTH JA              PEDIATRICS                      68   336 981",
    "18   LEMANSKE RF           AM REV RESPIR DIS              123   622 981",
    "19   BECHTEL JJ            AM REV RESPIR DIS              124   759 981",
    "20   VANASPEREN P          AM J DIS CHILD                 135   815 981",
    "21   MYERS JR              JAMA                           246   225 981",
    "22   GEORGITIS JW          ANN ALLERGY                     48   175 982",
    "23   EIGEN H               PEDIATRICS                      70   698 982",
    "24   PULLAN CR             BR MED J                       284  1665 982",
    "25   NADEL JA              ADV INTERN MED                  28   207 983",
    "26   EASTON JG             ANN ALLERGY                     50   171 983",
    "27   NELSON HS             ANN ALLERGY                     51   488 983",
    "28   PRATTER MR            CHEST                           84    42 983",
    "29   LEE DA                BR MED J                       286  1256 983",
    "30   MOK JYQ               ARCH DIS CHILD                  59   299 984",
    "31   PEARLMAN DS           AM J DIS CHILD                 138   459 984",
    "32   HAIDER SA             BR MED J                       289   109 984",
    "33   RUBIN BK              PEDIATR INFECT DIS               4    88 985",
    "34   DAVIS PB              SEM RESPIR MED                   6   261 985",
    "35   WONNE R               CLIN ALLERGY                    15   455 985",
    "36   MAPP CE               ANN ALLERGY                     54   424 985",
    "37   MITCHELL I            ANN ALLERGY                     54   233 985",
    "38   KONIG P               ANN ALLERGY                     55    95 985",
    "39   RIVLIN J              EUR J RESPIR DIS                67   286 985",
    "40   CROPP GJA             CHEST                           87  S 55 985",
    "41   ENARSON DA            CHEST                           87   452 985",
    "42   HORDVIK NL            AM REV RESPIR DIS              131   889 985",
    "43   DARGA LL              PEDIATR PULMONOL                 2    82 986",
    "44   CHAY OM               AUST NZ J MED                   16   644 986",
    "45   MELILLO G             EUR J RESPIR DIS                69   282 986",
    "46   PIEDRA P              J PEDIATR                      108   817 986"
  ]
}