{
  "paperNumber": "77189",
  "recordNumber": "00770",
  "acessionNumber": "77195135",
  "authors": [
    "Haller-J-O",
    "Heffer-E-T",
    "Kassner-E-G",
    "Pinck-R-L."
  ],
  "title": "Unusual radiographic manifestations of cystic fibrosis.",
  "source": "Rev-Interam-Radiol. 1977 Jan. 2(1). P 41-2.",
  "majorSubjects": [
    "CYSTIC-FIBROSIS: ra."
  ],
  "minorSubjects": [
    "ACIDOSIS-DIABETIC: ra",
    "ADOLESCENCE",
    "ADULT",
    "CASE-REPORT.",
    "DIABETES-MELLITUS: ra",
    "DIAGNOSIS-DIFFERENTIAL.",
    "ESCHERICHIA-COLI-INFECTIONS: ra",
    "FEMALE",
    "HUMAN.",
    "PNEUMATOSIS-CYSTOIDES-INTESTINALIS: ra."
  ],
  "abstractExtract": "The authors report 2 radiographic findings that have not previously been described in patients with cystic fibrosis: (1) the linear form of pneumatosis coli (2) large pancreatic concretions which resembled the pancreatic calcificaitons of hereditary pancreatitis. The patient with pancreatic calcification also had labile diabetes and episodes of ketoacidosis, unusual complications of cystic fibrosis.",
  "references": [
    "001   ELLIOTT GB            AM J ROENTG RAD THER NUCL MED   89   720 963",
    "002   HUNT CE               PEDIATR RES                      7   292 973",
    "003   KEYTING WS            RADIOLOGY                       76   733 961",
    "004   NELSON SW             AM J ROENTG RAD THER NUCL MED  115   225 972",
    "005   RING EJ               AM J ROENTG RAD THER NUCL MED  117   446 973",
    "006   ROSAN RC              AM J DIS CHILD                 104   625 962",
    "007   SMITH BH              AM J CLIN PATHOL                48   455 967",
    "008   WHITE H               RADIOL CLIN NORTH AM             1   539 963",
    "009   WOOD RE               AM J DIS CHILD                 129   246 975"
  ],
  "citations": []
}