{
  "paperNumber": "78151",
  "recordNumber": "00931",
  "acessionNumber": "79072550",
  "authors": [
    "Moses-R-G",
    "Bowen-T",
    "Edwards-R."
  ],
  "title": "Cystic fibrosis and fast moving haemoglobin [letter].",
  "source": "Med-J-Aust. 1978 Aug 12. 2(4). P 160-1.",
  "majorSubjects": [
    "CYSTIC-FIBROSIS: bl",
    "HEMOGLOBINS: an."
  ],
  "minorSubjects": [
    "CHILD",
    "CHILD-PRESCHOOL",
    "HUMAN",
    "INFANT."
  ],
  "abstractExtract": "We have measured fast moving components of haemoglobin (FMH) in nine children with cystic fibrosis without any clinical evidence of diabetes mellitus.  The nine patients with cystic fibrosis had a mean FMH of 9.3 which differed significantly from 97 controls with a mean FMH of 7.6.  There was no correlation between FMH and age or FMH and duration of disease.  The above results raise the question as to what extent the FMH is a reflection of hyperglycaemia or insulinopenia.",
  "references": [
    "001   PAULSEN EP            DIABETES                        25   890 976",
    "002   KOENIG RJ             N ENGL J MED                   295   417 976",
    "003   MILNER AD             ARCH DIS CHILD                  44   351 969"
  ],
  "citations": []
}