{
  "paperNumber": "79028",
  "recordNumber": "01008",
  "acessionNumber": "80086311",
  "authors": [
    "Stagg-B-H",
    "Wood-T-P."
  ],
  "title": "Radioimmunoassay of trypsin.  A new aid in the assessment of pancreatic function.",
  "source": "Ann-Clin-Biochem. 1979 May. 16(3). P 147-51.",
  "majorSubjects": [
    "PANCREAS: en",
    "PANCREATIC-DISEASES: di",
    "TRYPSIN: an."
  ],
  "minorSubjects": [
    "CYSTIC-FIBROSIS: di",
    "DIABETES-MELLITUS-INSULIN-DEPENDENT: di.",
    "HUMAN",
    "PANCREATIC-DISEASES: en",
    "PANCREATIC-NEOPLASMS: di.",
    "PANCREATITIS: di",
    "RADIOIMMUNOASSAY: mt."
  ],
  "abstractExtract": "This review describes the development and application of a novel test to determine levels of human immunoreactive trypsin, an enzyme produced solely by the pancreas, in biological fluids. Being organ- specific, the assay of immunoreactive trypsin should be an ideal marker of pancreatic function, and this is supported by the results of a number of clinical and research investigations. Use of this assay in studies of chronic pancreatitis, juvenile-onset diabetes, and cystic fibrosis has yielded much valuable data, and it is expected that further research will lead to an improved understanding of these and other conditions associated with the pancreas in health and disease.",
  "references": [
    "001   ADRIAN TE             GUT                             19  A960 978",
    "002   ADRIAN TE             CLIN SCI MOL MED                54   13P 978",
    "004   BAMBULE-DICK J        IR J MED SCI SUPPL 1           146     3 978",
    "005   BRAY PT               CLIN CHIM ACTA                  80   333 977",
    "006   CROSSLEY JR           LANCET                           2  1093 977",
    "007   CROSSLEY JR           LANCET                           1   472 979",
    "008   DANDONA P             BR MED J                         2  1125 978",
    "009   DOMSCHKE S            AM J DIG DIS                    20   309 975",
    "010   ELIAS E               LANCET                           2    66 977",
    "011   FEDAIL SS             GUT                             19  A445 978",
    "012   FRIER BM              GUT                             17   685 976",
    "013   GOWENLOCK AH          ANN CLIN BIOCHEM                14    61 977",
    "014   GREENE LJ             IN: FRITZ H                          188 974",
    "016   KOOP H                PROC EUROP PANCREAS 11TH SYM             978",
    "017   LAKE-BAKAAR G         GUT                             19  A446 978",
    "018   LAKE-BAKAAR G         GUT \"CLEARANCE OF\"              19  A960 978",
    "019   LAKE-BAKAAR G         GUT                             19  A445 978",
    "020   LAKE-BAKAAR G         GUT \"URINE TRYPSIN\"             19  A960 978",
    "021   LIEBOW C              SCIENCE                        189   472 975",
    "023   PROSSER R             ARCH DIS CHILD                  49   597 974",
    "024   SMALLEY CA            LANCET                           2   415 978",
    "025   TEMLER RS             BIOCHIM BIOPHYS ACTA           236    72 971",
    "026   TEMLER RS             BIOCHIM BIOPHYS ACTA           445   720 976",
    "027   TEMLER RS             ENZYME                          22   249 977",
    "028   WOOD TP               LANCET                           1   781 979"
  ],
  "citations": [
    "1   BURLINA A             SCAND J GASTROENTEROL           15    35 980",
    "2   FAHRENKRUG J          CLIN CHEM                       26  1573 980",
    "3   ODONNELL MD           CLIN CHIM ACTA                 104   265 980",
    "4   BUTTERWORTH J         ANAL BIOCHEM                   106   156 980",
    "5   FIEDLER F             HOPPE SEYLERS Z PHYSIOL CHEM   361  1661 980",
    "6   FAHRENKRUG J          CLIN CHEM                       27  1655 981",
    "7   KOEHN HD              CLIN CHEM                       27   502 981",
    "8   OCONNOR CM            CLIN CHIM ACTA                 114    29 981",
    "9   LAWRENCE CH           BIOCHIM BIOPHYS ACTA           657    13 981",
    "10   BECKER H              LANGENBECKS ARCH CHIR            S    47 983",
    "11   HAFKENSCHEID JCM      J CLIN CHEM CLIN BIOCHEM        21   167 983",
    "12   BOHNER J              J CLIN CHEM CLIN BIOCHEM        22   943 984",
    "13   LEUNG FY              CLIN CHEM                       30  1361 984",
    "14   ASH KO                J MED TECHNOL                    2   427 985",
    "15   LESI C                CLIN BIOCHEM                    18   317 985",
    "16   LESI C                DIG DIS SCI                     30   552 985"
  ]
}