{
  "paperNumber": "78102",
  "recordNumber": "00883",
  "acessionNumber": "78067357",
  "authors": [
    "Reitman-A-A",
    "Faber-R-D."
  ],
  "title": "A cephalometric study of patients with cystic fibrosis.",
  "source": "J-Am-Dent-Assoc. 1978 Jan. 96(1). P 83-7.",
  "majorSubjects": [
    "CYSTIC-FIBROSIS",
    "MAXILLOFACIAL-DEVELOPMENT."
  ],
  "minorSubjects": [
    "ADOLESCENCE",
    "ADULT",
    "CEPHALOMETRY",
    "CHILD",
    "CHILD-PRESCHOOL.",
    "COMPARATIVE-STUDY",
    "FEMALE",
    "HUMAN",
    "MALE",
    "SKULL: gd."
  ],
  "abstractExtract": "Children with cystic fibrosis have skeletal maturation and epiphyseal anomalies similar to those in children with nutritional problems. However, these patients have been found to have normal somatic development if treatment is begun early. In a group of children with cystic fibrosis undergoing medical treatment, cephalometric measurements compared favorably with those established by normal standards.",
  "references": [
    "001   HUANG NN              AM J DIS CHILD                 120   289 970",
    "002   SHWACHMAN H           AM J DIS CHILD                  96     6 958",
    "003   GORLIN RJ             THOMAS ORAL PATHOLOGY                995 970",
    "004   SPROUL A              J PEDIATR                       65   664 964",
    "005   KREISSL T             Z KINDERHEILK                  113    93 972",
    "006   GREEN OC              ENDOCRINOL METAB J CLIN         27  1059 967",
    "007   MILUNSKY A            AM J DIS CHILD                 121    15 971",
    "008$  DENNIS JL             JAMA                            94   855 965",
    "009   SNODGRASS RM          AM J ROENTG RAD THER NUCL MED   74     6 955",
    "010   TAUSSIG LM            AM J DIS CHILD                 125   495 973"
  ],
  "citations": []
}