{
  "queryNumber": "74",
  "queryText": "What are the results of mechanical ventilation in CF patients with respiratory failure?",
  "relevantDocuments": "7",
  "results": [
    [
      "148",
      "2220"
    ],
    [
      "370",
      "1000"
    ],
    [
      "724",
      "1001"
    ],
    [
      "910",
      "2122"
    ],
    [
      "914",
      "2222"
    ],
    [
      "1000",
      "0001"
    ],
    [
      "1093",
      "0002"
    ]
  ]
}