{
  "paperNumber": "79186",
  "recordNumber": "01166",
  "acessionNumber": "79221559",
  "authors": [
    "Super-M."
  ],
  "title": "Factors influencing the frequency of cystic fibrosis in South West Africa.",
  "source": "Monogr-Paediatr. 1979. 10. P 106-13.",
  "majorSubjects": [
    "CYSTIC-FIBROSIS: oc."
  ],
  "minorSubjects": [
    "CHILD",
    "CONSANGUINITY",
    "CYSTIC-FIBROSIS: fg",
    "FEMALE.",
    "GENE-FREQUENCY",
    "HUMAN",
    "MALE",
    "NAMIBIA",
    "PEDIGREE."
  ],
  "abstractExtract": "Drift, chance effect in a small community and consanguinity have resulted in South West Africa\u0027s high cystic fibrosis incidence. Isolated communities generations ago in Europe, e.g. Bad Gastein, where this congress was held, surrounded by its Alpine peaks, could have resulted in gene enrichment, which together with the increased fertility of the heterozygote could still be responsible for most of the CF seen wherever Europeans live today.",
  "references": [
    "001   SUPER M               S AFR MED J                     49   818 975",
    "002   SUPER M               S AFR MED J                     54    18 978",
    "003   FALCONER DS           INTRO TO QUANTITAT GENET             100 960",
    "004   GOLDBLATT I           HIST SW AFRICA FROM BEGINNING            971",
    "005   SUPER M               LANCET                           2  1288 977",
    "006   KULCZYCKI LL          AM J DIS CHILD                 127    64 974",
    "007   DANKS DM              ANN HUM GENET                   28   323 965"
  ],
  "citations": [
    "1   KLINGER KW            HUM GENET                       65    94 983",
    "2   KLINGER KW            SEM RESPIR MED                   6   243 985"
  ]
}