{
  "paperNumber": "79095",
  "recordNumber": "01075",
  "acessionNumber": "80005196",
  "authors": [
    "Cusack-D",
    "Cannon-D",
    "Skrabanek-P",
    "Powell-D."
  ],
  "title": "Substance P plasma levels in pregnancy and in various clinical disorders.",
  "source": "Horm-Metab-Res. 1979 Jul. 11(7). P 448-51.",
  "majorSubjects": [
    "PREGNANCY",
    "SUBSTANCE-P: bl."
  ],
  "minorSubjects": [
    "CYSTIC-FIBROSIS: bl",
    "FEMALE",
    "HUMAN",
    "INTESTINAL-DISEASES: bl.",
    "NEOPLASMS: bl",
    "RADIOIMMUNOASSAY",
    "THYROID-DISEASES: bl."
  ],
  "abstractExtract": "Using radioimmunoassay, immunoreactive SP (iSP) has been measured in the plasma of 162 hospital patients with various disorders and in the plasma of 67 pregnant women. In pregnancy, iSP was undetectable in 40% women as compared to 12% in other hospital patients. The mean iSP plasma level in pregnancy was 37.8 +/- 4.6 (SEM) as compared to 77.1 +/- 4.9 (SEM) pg/ml in other hospital patients. The results support earlier observations based on bioassay, suggesting that the blood of pregnant women contains higher concentrations of a SP-inactivating factor. Of the hospital patients, elevated levels of iSP were found in patients with chronic leukaemia, in one patient with a basaloid carcinoma of the anus, and in one patient with toxic liver damage and pancreatic insufficiency. No correlation was found between thyroid function and iSP plasma levels. ISP plasma levels in various gastrointestinal disorders were similar to those found in normal subjects.",
  "references": [
    "001   ALUMETS J             HISTOCHEMISTRY                  52   217 977",
    "002   CANNON D              BIOCHEM SOC TRANS                5  1776 977",
    "003   EHRENPREIS T          ACTA PHYSIOL SCAND              27   380 953",
    "004$  HARKINS J             BRAIN RES                      147   405 978",
    "005   KOCIC-METROVIC D      PROC SCI SOC BOSNIA HERZEGOVI    1   113 961",
    "006   NAKANO T              JAPAN J PHARMACOL               25   43P 975",
    "007   OCONNELL R            IR J MED SCI                   145   392 976",
    "008   PARTINGTON MW         ARCH DIS CHILD                  52   386 977",
    "009$  PEARSE AGE            HISTOCHEMISTRY                  41   373 975",
    "010   PERNOW B              PROC SCI SOC BOSNIA HERZEGOVI    1    57 961",
    "011   POLAK JM              IN: FUJITA T                         103 976",
    "013   SKRABANEK PD          IR J MED SCI                   145   399 976",
    "014   SKRABANEK PD          IR J MED SCI                   147    47 978",
    "015   SKRABANEK PD          SUBSTANCE P                              978",
    "016   STERN PI              PROC SCI SOC BOSNIA HERZEGOVI    1   139 961"
  ],
  "citations": [
    "1   SKRABANEK P           EUR J OBSTE GYNECOL REPR BIOL   11   157 980",
    "2   KAIYA  H              PSYCHIATRY RES                   5    11 981",
    "3   POLLOCK M             NEUROLOGY                       32  1311 982",
    "4   VERMA PS              EUR J PHARMACOL                 86   275 982",
    "5   SKRABANEK P           OBSTET GYNECOL                  61   641 983",
    "6   SKRABANEK P           IR J MED SCI                   153    47 984",
    "7   ZHANG CL              ACTA ZOOL SINICA                31   106 985"
  ]
}