{
  "paperNumber": "76177",
  "recordNumber": "00531",
  "acessionNumber": "76101889",
  "authors": [
    "Cheung-A-T",
    "Jahn-T-L."
  ],
  "title": "High speed cinemicrographic studies on rabbit tracheal (ciliated) epithelia: cytolytic effect of cystic fibrosis serum on tracheal epithelial cells.",
  "source": "Pediatr-Res. 1976 Feb. 10(2). P 144-47.",
  "majorSubjects": [
    "CILIA: ph",
    "CYSTIC-FIBROSIS: bl",
    "TRACHEA: cy."
  ],
  "minorSubjects": [
    "ANIMAL",
    "CELL-MOVEMENT",
    "EPITHELIUM: cy",
    "MOTION-PICTURES.",
    "PHOTOMICROGRAPHY",
    "RABBITS",
    "TRACHEA: ph",
    "EPITHELIUM: cy."
  ],
  "abstractExtract": "High speed cinemicrographs are made on the ciliary activity of rabbit tracheal cilia with the aid of Nomarski optics. The detailed nature of the ciliary beat pattern is determined from slow motion analysis of the high speed cinemicrographs (1-3). Such documented forms of ciliary beat pattern and the physiologic state of the tracheal epithelia are utilized as basic reference controls to investigate the physiologic effects of cystic fibrosis serum on ciliated epithelia and the cystic fibrosis tracheal mucus stagnation phenomenon. Careful analyses of the high speed cinemicrographs reveal that cystic fibrosis serum has no effect on the rhythm and beat pattern of rabbit tracheal cilia. However, it is shown in controlled procedures that cystic fibrosis serum has a cytolytic effect on the tracheal epithelial cells and also at the cell junctions. Ciliary dyskinesis, as described in previous reports (6-9), is actually a secondary effect of cytolysis and cell destruction.",
  "references": [
    "001   CHEUNG ATW            DISSERTATION                             973",
    "006   CONOVER JH            PEDIATR RES                      7   220 973",
    "007   KOPEL FB              CF CLUB ABST                          32 972",
    "008   SPOCK A               PEDIATR RES                      1   173 967",
    "009   SPOCK A               MOD PROBL PEDIATR               10   200 967"
  ],
  "citations": [
    "1   MARTINEZ JR           MO MED                          73   173 976",
    "2   WILSON GB             PEDIATR RES                     11   143 977",
    "3   BOGART BI             PEDIATR RES                     12    15 978",
    "4   GABRIDGE MG           PEDIATR RES                     13    31 979",
    "5   VERDUGO P             PEDIATR RES                     13   131 979",
    "6   JAKEL HP              BIOL ZENTRALBL                  98    55 979",
    "7   BOROVIKOVA TM         TER ARKH                        52   125 980",
    "8   TEGNER H              ACTA PAEDIATR SCAND             70   629 981",
    "9   MARUYAMA I            JAP J PHARMACOL                 32   237 982",
    "10   RUTLAND J             AM REV RESPIR DIS              128  1030 983",
    "11   CHEUNG ATW            J MED PRIMATOL                  15    37 986",
    "12   HENNESSY SJ           J APPL PHYSIOL                  60  2109 986"
  ]
}