{
  "paperNumber": "77050",
  "recordNumber": "00632",
  "acessionNumber": "78062991",
  "authors": [
    "Warner-J-O."
  ],
  "title": "The variability of skin test hypersensitivity reactions in cystic fibrosis and asthma.",
  "source": "Clin-Allergy. 1977 Jul. 7(4). P 385-9.",
  "majorSubjects": [
    "ASTHMA: co",
    "CYSTIC-FIBROSIS: co",
    "HYPERSENSITIVITY-IMMEDIATE: di."
  ],
  "minorSubjects": [
    "ADOLESCENCE",
    "CHILD",
    "CHILD-PRESCHOOL",
    "FEMALE",
    "HUMAN.",
    "HYPERSENSITIVITY-IMMEDIATE: co",
    "MALE",
    "SKIN-TESTS."
  ],
  "abstractExtract": "Cystic fibrosis (CF) children had a greater variability of skin prick test response compared with asthmatic children, when the tests were performed on two occasions. This suggests that there is a different cause for the allergy in the two groups, perhaps because the asthmatics have a transient period of susceptibility to sensitization in infancy and the CF children a persistent vulnerability. Amongst the asthmatic children, clinical improvement was associated with loss of some skin prick test reactions, and clinical deterioration with an increase in the number of positive reactions. Thus continuing allergic reactions may maintain a mucosal defect, resulting in a persistence of susceptibility to allergen sensitization, and control of the reactions may re-establish normal mucosal defence mechanisms.",
  "references": [
    "001   ALLAN JD              CLIN ALLERGY                     5   255 975",
    "002   LEVINE BB             SCIENCE                        178  1201 972",
    "003   SOOTHILL JF           CLIN ALLERGY                     3   511 973",
    "004   TAYLOR B              LANCET                           2   111 973",
    "005   WARNER JO             ARCH DIS CHILD                  51   507 976",
    "006   WARNER JO             ARCH DIS CHILD                  51   507 976",
    "007   WARREN CPW            CLIN ALLERGY                     5     1 975"
  ],
  "citations": [
    "1   TOBIN MJ              THORAX                          35   807 980",
    "2   HOLZER FJ             ARCH DIS CHILD                  56   455 981",
    "3   CLARKE CW             CLIN ALLERGY                    12     1 982"
  ]
}