{
  "paperNumber": "75084",
  "recordNumber": "00250",
  "acessionNumber": "76045098",
  "authors": [
    "Cunningham-D-G",
    "Gatti-W-M",
    "Eitenmiller-A-M",
    "Van-Gorder-P-N."
  ],
  "title": "Cystic fibrosis: involvement of the ear, nose, and paranasal sinuses.",
  "source": "Ill-Med-J. 1975 Oct. 148(4). P 470-1, 474.",
  "majorSubjects": [
    "CYSTIC-FIBROSIS: co",
    "DEAFNESS: et",
    "NASAL-POLYPS: et."
  ],
  "minorSubjects": [
    "ADOLESCENCE",
    "ADULT",
    "CHILD",
    "CHILD-PRESCHOOL",
    "FRONTAL-SINUS: ab.",
    "HUMAN",
    "INFANT",
    "PSEUDOMONAS-AERUGINOSA: ip",
    "SINUSITIS: mi."
  ],
  "abstractExtract": "Twenty-six patients with cystic fibrosis all exhibited disease of the paranasal sinuses, consisting of opacification of the maxillary sinuses either alone or as part of a parasinusitis.  Symptoms of sinusitis seldom occurred and treatment was not generally required. Agenesis or delayed development of frontal sinuses was also seen in the majority of patients.  Nasal polyps occurred in 27% of the patients, all of whom were over five years of age.  Excluding those patients under five years of age, none of whom had polyps, the incidence was 36%.  In general, polyps were not observed in those patients with severe disease.  Mild degrees of conductive hearing loss were noted in the younger age groups especially, but no instance of severe hearing loss or nerve conduction disturbance was encountered.  Such mild degrees of hearing loss may merely reflect the application of standards too stringent for this age group. Throat and nose cultures on 26 patients revealed pseudomonas aeruginosa in eighteen cases, reflecting the flora of the tracheobronchial tree.  Other organisms were encountered on an unpredictable basis with findings consistent with those anticipated in this age group of patients.",
  "references": [
    "001   DI SANTAGNESE PA      AM FAM PHYSICIAN                 7   102 973",
    "002   SHWACHMAN H           PEDIATRICS                      46   335 970",
    "003   SHWACHMAN H           AM J DIS CHILD                  96     6 958",
    "004   GIBSON LE             PEDIATRICS                      23   545 959",
    "005   DOGGETT RG            INFECT IMMUN                     6   628 972",
    "006   WILLIAMS RJ           J MED MICROBIOL                  6   409 972",
    "007   CUNNINGHAM DG         ILL MED J                      145   493 974",
    "008   JERGER J              ARCH OTOLARYNGOL                93   111 971",
    "009   NEELY JG              TRANS AM ACAD OPHTHALMOL OTOL   76   313 972",
    "010   PENNINGTON CL         ARCH OTOLARYNGOL                63   576 956",
    "011   SHWACHMAN H           PEDIATRICS                      30   389 962",
    "012   KULCZYCKI LL          ARCH OTOLARYNGOL                92    54 970"
  ],
  "citations": [
    "1   FRIED MP              LARYNGOSCOPE                    94   192 984",
    "2   DAVID TJ              J ROY SOC MED                   79    23 986"
  ]
}