{
  "queryNumber": "55",
  "queryText": "What are the interactions between proteases (endogenous or bacterial origin) and antiproteases in the lungs of CF patients?",
  "relevantDocuments": "24",
  "results": [
    [
      "70",
      "0100"
    ],
    [
      "232",
      "1100"
    ],
    [
      "305",
      "0100"
    ],
    [
      "347",
      "1000"
    ],
    [
      "358",
      "0002"
    ],
    [
      "391",
      "2110"
    ],
    [
      "430",
      "0001"
    ],
    [
      "432",
      "2122"
    ],
    [
      "463",
      "1100"
    ],
    [
      "505",
      "1001"
    ],
    [
      "521",
      "2222"
    ],
    [
      "530",
      "2122"
    ],
    [
      "640",
      "1010"
    ],
    [
      "675",
      "1000"
    ],
    [
      "749",
      "0010"
    ],
    [
      "779",
      "1010"
    ],
    [
      "820",
      "1122"
    ],
    [
      "828",
      "1210"
    ],
    [
      "847",
      "0010"
    ],
    [
      "890",
      "1001"
    ],
    [
      "1056",
      "1000"
    ],
    [
      "1070",
      "1100"
    ],
    [
      "1156",
      "0001"
    ],
    [
      "1205",
      "2110"
    ]
  ]
}