{
  "queryNumber": "23",
  "queryText": "What congenital or hereditary diseases or conditions have been found in association with CF?",
  "relevantDocuments": "35",
  "results": [
    [
      "9",
      "2221"
    ],
    [
      "10",
      "2122"
    ],
    [
      "11",
      "1100"
    ],
    [
      "12",
      "2212"
    ],
    [
      "34",
      "2222"
    ],
    [
      "42",
      "2222"
    ],
    [
      "99",
      "1112"
    ],
    [
      "162",
      "1000"
    ],
    [
      "163",
      "0001"
    ],
    [
      "167",
      "1000"
    ],
    [
      "198",
      "1000"
    ],
    [
      "248",
      "1000"
    ],
    [
      "285",
      "0010"
    ],
    [
      "322",
      "0101"
    ],
    [
      "350",
      "1001"
    ],
    [
      "370",
      "1002"
    ],
    [
      "426",
      "2122"
    ],
    [
      "434",
      "1212"
    ],
    [
      "464",
      "1000"
    ],
    [
      "509",
      "2222"
    ],
    [
      "541",
      "2222"
    ],
    [
      "582",
      "0002"
    ],
    [
      "583",
      "1000"
    ],
    [
      "598",
      "0002"
    ],
    [
      "716",
      "1002"
    ],
    [
      "780",
      "1000"
    ],
    [
      "859",
      "2120"
    ],
    [
      "883",
      "0001"
    ],
    [
      "888",
      "1002"
    ],
    [
      "979",
      "2222"
    ],
    [
      "984",
      "0002"
    ],
    [
      "1096",
      "0011"
    ],
    [
      "1114",
      "2222"
    ],
    [
      "1156",
      "0010"
    ],
    [
      "1163",
      "1000"
    ]
  ]
}