{
  "paperNumber": "79067",
  "recordNumber": "01047",
  "acessionNumber": "79126767",
  "authors": [
    "Hirschfeld-S-S",
    "Fleming-D-G",
    "Doershuk-C",
    "Liebman-J."
  ],
  "title": "Echocardiographic abnormalities in patients with cystic fibrosis.",
  "source": "Chest. 1979 Mar. 75(3). P 351-5.",
  "majorSubjects": [
    "CYSTIC-FIBROSIS: pp",
    "ECHOCARDIOGRAPHY",
    "HEART: pp."
  ],
  "minorSubjects": [
    "ADOLESCENCE",
    "ADULT",
    "CHILD",
    "CHILD-PRESCHOOL",
    "CYSTIC-FIBROSIS: co.",
    "FEMALE",
    "HEART-FAILURE-CONGESTIVE: di, et, pp",
    "HEART-VENTRICLE: pp.",
    "HUMAN",
    "INFANT",
    "MALE",
    "MYOCARDIAL-CONTRACTION",
    "RESIDUAL-VOLUME.",
    "SYSTOLE",
    "VITAL-CAPACITY."
  ],
  "abstractExtract": "An echographic study was undertaken to evaluate left (LV) and right ventricular (RV) function in 30 patients with cystic fibrosis. Echographic recording of the pulmonary and aortic valve echogram permitted measurement of the phases of right and left ventricular systole. The ratio of the LV preejection period/LV ejection time (LPEP/LVET) and shortening of the LV internal dimension %SID was employed to reflect LV function, while RV preejection period/RV ejection time (RPEP/RVET) has excellent correlation with pulmonary artery diastolic pressure. RPEP/RVET and two other echographic measurements, right ventricular wall (RVW) and internal dimension (RVD) were compared with pulmonary function tests and clinical scores. RPEP/RVET correlated well with percent vital capacity(%VC), r \u003d -0.73, percent residual volume (%RVol) r \u003d +0.72, and clinical score, r \u003d -0.77. Multilinear regression of RPEP/RVET, RVD, and RVW improved correlation for %VC (r \u003d -0.80), %RVol, r \u003d +0.82, and clinical score, r \u003d -0.84. Patients in overt right heart failure exhibited elevated RPEP/RVET (mean \u003d 0.48) when compared to patients not in right heart failure (mean \u003d .33). Marked diminution of LV function was present in two patients. A variety of cardiovascular abnormalities were demonstrated echographically and were valuable in assessing the degree of cardiac involvement in patients with cystic fibrosis.",
  "references": [
    "001   LIEBMAN J             IN: MANGOS JA                         41 976",
    "002   WOOD RE               AM REV RESPIR DIS              113   833 976",
    "003   SIASSI B              J PEDIATR                       78   794 971",
    "004   GOLDRING RM           J PEDIATR                       65   501 964",
    "005   THOMAS AJ             BR HEART J                      34   653 972",
    "006   LIEBMAN J             CIRCULATION                     35   552 967",
    "007   ROSENTHAL A           PEDIATR CLIN NORTH AM           23   327 976",
    "008   RYSSING E             ACTA PAEDIATR SCAND             66   753 977",
    "009   GEWITZ M              AM J DIS CHILD                 131   275 977",
    "010   HIRSCHFELD S          CIRCULATION                     51   304 975",
    "011   HIRSCHFELD S          CIRCULATION                     52   641 975",
    "012   RIGGS T               CIRCULATION                     57   939 978",
    "013   WEISSLER AM           IN: YU PN                        1   155 972",
    "014   FORTUIN NJ            CIRCULATION                     46    26 972",
    "015   HELLIESEN PJ          PEDIATRICS                      22    80 958",
    "016   DUBOIS AB             J CLIN INVEST                   35   322 956",
    "017   SHWACHMAN H           AM J DIS CHILD                  96     6 958",
    "018   GALANT SP             PEDIATRICS                      61    46 978",
    "019   MEYER RA              ECHOCARDIOGRAPHY                     257 977",
    "020   GUTGESELL HP          CIRCULATION                     56   457 977"
  ],
  "citations": [
    "1   MATTHAY RA            BR HEART J                      43   474 980",
    "2   LESTER LA             J PEDIATR                       97   742 980",
    "3   FRANCIS PWJ           AM J DIS CHILD                 134   734 980",
    "4   BERGER HJ             AM J CARDIOL                    47   950 981",
    "5   JACOBSTEIN MD         CHEST                           80   399 981",
    "6   NEWTH CJL             AM REV RESPIR DIS              124   463 981",
    "7   MOSS AJ               PEDIATRICS                      70   728 982",
    "8   HIRSCHFELD SS         CHEST                           82   524 982",
    "9   MATTHAY RA            CLIN CHEST MED                   4   269 983",
    "10   MATTHAY RA            CRIT CARE MED                   11   329 983",
    "11   MACDONALD NE          J PEDIATR                      103   985 983",
    "12   KELLY HW              DRUG INTEL CLIN PHARM           18   772 984",
    "13   BENSON LN             AM REV RESPIR DIS              130   987 984",
    "14   MOSKOWITZ WB          PEDIATR PHARMACOL                5   139 985",
    "15   LESTER LA             SEM RESPIR MED                   6   285 985",
    "16   PANIDIS IP            J AM COLL CARDIOL                6   701 985",
    "17   PIEPSZ A              PEDIATR PULMONOL                 3    24 987"
  ]
}