{
  "paperNumber": "75038",
  "recordNumber": "00204",
  "acessionNumber": "78143452",
  "authors": [
    "Goodchild-M-C",
    "Banks-A-J",
    "Drolc-Z",
    "Anderson-C-M."
  ],
  "title": "Liver scans in cystic fibrosis.",
  "source": "Arch-Dis-Child. 1975 Oct. 50(10). P 813-5.",
  "majorSubjects": [
    "CYSTIC-FIBROSIS: ri",
    "LIVER: ri."
  ],
  "minorSubjects": [
    "ADOLESCENCE",
    "CHILD",
    "COMPARATIVE-STUDY",
    "FEMALE",
    "HUMAN.",
    "LIVER-FUNCTION-TESTS",
    "MALE."
  ],
  "abstractExtract": "Liver scans were performed on 16 cystic fibrosis patients. Most scans were considered abnormal. In most patients, the results of serological liver function tests were normal. Liver scanning in cystic fibrosis is unlikely to make a significant contribution to an assessment of prognosis.",
  "references": [
    "001   BODIAN M              FIBROCYSTIC DIS OF THE PANCRE            952",
    "002   COLOMBETTI LG         J NUCL MED                      10   597 969",
    "003   DI SANTAGNESE PA      PEDIATRICS                      18   387 956",
    "004   FEIGELSON J           ACTA PAEDIATR SCAND             61   337 972",
    "005   KATTWINKEL J          J PEDIATR                       82   234 973",
    "006   LIEWENDAHL K          ACTA MED SCAND                 192   395 972",
    "007   LUDBROOK J            GASTROENTEROLOGY                62  1013 972",
    "008   SHWACHMAN H           AM J DIS CHILD                  96     6 958"
  ],
  "citations": [
    "1   SMITH AL              ARCH DIS CHILD                  52   633 977",
    "2   SCHWARZ HP            HELV PAEDIATR ACTA              33   351 978",
    "3   GIUNTA A              RIV ITAL PEDIATR                 9   171 983"
  ]
}