{
  "paperNumber": "78098",
  "recordNumber": "00879",
  "acessionNumber": "78170950",
  "authors": [
    "OHalloran-E-T."
  ],
  "title": "Cystic fibrosis--an eleven year survey.",
  "source": "Ir-Med-J. 1978 Apr 21. 71(6). P 184-7.",
  "majorSubjects": [
    "CYSTIC-FIBROSIS."
  ],
  "minorSubjects": [
    "CHILD",
    "CHILD-PRESCHOOL",
    "CYSTIC-FIBROSIS: di, oc, th",
    "FEMALE.",
    "HUMAN",
    "INFANT",
    "IRELAND",
    "MALE",
    "PROGNOSIS",
    "TIME-FACTORS."
  ],
  "abstractExtract": "The purpose of this communication is to review our experiences with children with cystic fibrosis seen from January 1964 to January 1975 and to analyse the factors which have contributed to the improved prognosis which has occurred in this period.  The numbers of new patients have increased from six in 1964 to 12 in 1974.  Both sexes have been equally affected.  Respiratory infections, failure to thrive and diarrhoea were the predominant presenting features in that order, and thus any one of these presenting features should indicate that cystic fibrosis should at least be considered and excluded. Each patient was assessed monthly at the clinic during which attendance formal physiotherapy was carried out and the parents were instructed in the techniques of percussion and drainage.  Forty-two of our sixty-four patients are still alive and thirty-three of those fall into the excellent category, seven into the good and one each into the fair and poor.  During the period of this review there has been an obvious improvement with a fall in morbidity and mortality and with the increasing proportion of patients now in the \"excellent\" group.  We attribute these facts to earlier diagnosis, regular and careful follow-up and a supervised therapeutic programme including parent education and participation.  It would seem, therefore, that early diagnosis and active treatment prolong life and give better health.",
  "references": [
    "001   ANDERSEN DH           AM J DIS CHILD                  56   344 938",
    "002   ANDERSEN DH           PEDIATRICS                       3   406 949",
    "003   DODGE JA              BR MED J                         2   192 975",
    "004   GEORGE L              ARCH DIS CHILD                  46   139 971",
    "005   MITCHELL-HEGGS PF     Q J MED                         45   479 976",
    "006   MEARNS MB             ARCH DIS CHILD                  46   139 972",
    "007   ROBINSON MJ           ARCH DIS CHILD                  50   962 975",
    "008   SHWACHMAN H           ADV PEDIATR                      7   249 955",
    "009   SHWACHMAN H           PEDIATRICS                      46   335 970",
    "010   SHWACHMAN H           AM J DIS CHILD                  96     6 958",
    "011   WARWICK WJ            MOD PROBL PEDIATR               10   353 967"
  ],
  "citations": []
}