{
  "paperNumber": "77135",
  "recordNumber": "00716",
  "acessionNumber": "77098975",
  "authors": [
    "Gyurkovits-K",
    "Markus-V",
    "Bittera-I."
  ],
  "title": "Cystic-fibrosis heterozygosity in childhood bronchial asthma [letter].",
  "source": "Lancet. 1977 Jan 22. 1(8004). P 203.",
  "majorSubjects": [
    "ASTHMA: co",
    "CYSTIC-FIBROSIS: fg",
    "HETEROZYGOTE."
  ],
  "minorSubjects": [
    "ASTHMA: et",
    "BROMIDES: du",
    "CHILD",
    "CHLORIDES: an",
    "HUMAN.",
    "SODIUM: an",
    "SWEAT: an."
  ],
  "abstractExtract": "We found that the Szczepanski bromide test, which we simplified with the aid of ion-sensitive electrode, is suitable for the detection of C.F. heterozygosity in most cases.  We examined the sweat of 74 randomly selected children with respiratory asthma during the past 2 years, the sodium and chloride concentrations and bromide index being determined.  Sodium and chloride concentrations in the sweat of the asthma children were slightly but significantly higher (P \u003c 0.05) than those of the controls.  The difference in bromide index was even more significant (P \u003c 0.01).  This suggests that C.F. gene carriers are unusually prevalent among children with bronchial asthma.  One possibility is that enhanced ion loss in various diseases with allergic pathological mechanisms is secondary in nature.  However, this seems unlikely since in our material high sweat-electrolyte concentrations were observed in only a proportion of control children whose illness was similar in severity to that of the asthmatic children, and normal sweat values were obtained even when the child\u0027s condition was very serious.",
  "references": [
    "001   WARNER JO             LANCET                           1   990 976",
    "002   MCFARLANE H           LANCET                           1  1241 976",
    "003   SZCZEPANSKI Z         Z KINDERHEILK                  113   297 972",
    "004   GYURKOVITS K          ACTA PAEDIATR ACAD SCI HUNG     15    49 974"
  ],
  "citations": []
}