{
  "paperNumber": "77155",
  "recordNumber": "00736",
  "acessionNumber": "84192886",
  "authors": [
    "Matthew-D-J",
    "Warner-J-O",
    "Chrispin-A-R",
    "Norman-A-P."
  ],
  "title": "The relationship between chest radiographic scores and respiratory function tests in children with cystic fibrosis.",
  "source": "Pediatr-Radiol. 1977. 5(4). P 198-200.",
  "majorSubjects": [
    "CYSTIC-FIBROSIS: ra",
    "RESPIRATORY-FUNCTION-TESTS.",
    "THORACIC-RADIOGRAPHY."
  ],
  "minorSubjects": [
    "ADOLESCENCE",
    "CHILD",
    "CYSTIC-FIBROSIS: pp",
    "FORCED-EXPIRATORY-VOLUME.",
    "FUNCTIONAL-RESIDUAL-CAPACITY",
    "HUMAN",
    "VITAL-CAPACITY."
  ],
  "abstractExtract": "Chest radiographic scores and respiratory function on 80 sets of results from 50 patients with Cystic Fibrosis were analyzed. Chest radiographic scores were assessed independently using the method of Chrispin and Norman. Respiratory function tests were found to correlate well with the chest radiographic score, the best correlation being with the forced expiratory volume in 0.75 sec. to forced vital capacity ratio F.E.V. 0.75/ F.V.C. (r \u003d -0.674 n \u003d 80 p less than 0.001).",
  "references": [
    "001   BEIER FR              AM REV RESPIR DIS               94   430 966",
    "002   COGSWELL JJ           BR J DIS CHEST                  69   177 975",
    "003   COGSWELL JJ           BR J DIS CHEST                  69   177 975",
    "004   COGSWELL JJ           BR J DIS CHEST                  69   177 975",
    "005   COOPERMAN EM          CAN MED ASSOC J                105   580 971",
    "006   CHRISPIN AR           PEDIATR RADIOL                   2   101 974",
    "007   DOERSHUK CF           J PEDIATR                       65   677 964",
    "008   DUBOIS AB             J CLIN INVEST                   35   322 956",
    "009   FEATHERBY EA          AM REV RESPIR DIS              102   737 970",
    "010   GODFREY S             ARCH DIS CHILD                  46   144 971",
    "011   KARLSBERG P           ACTA PAEDIATR SCAND             49   345 960",
    "012   MEARNS MB             ARCH DIS CHILD                  43   528 968",
    "013   REILLY BJ             RADIOLOGY                       98   281 971",
    "014   SHWACHMAN H           AM J DIS CHILD                  96     6 958",
    "015   TAUSSIG LM            J PEDIATR                       82   380 973",
    "016   WOOD RE               AM REV RESPIR DIS              113   833 976"
  ],
  "citations": [
    "1   KRAEMER R             HELV PAEDIATR ACTA              34   417 979",
    "2   BRASFIELD D           PEDIATRICS                      63    24 979",
    "3   KRAEMER R             SCHWEIZ MED WOCHENSCHR         109    39 979",
    "4   BRASFIELD D           AM J ROENTGENOL                134  1195 980",
    "5   VANDERPUT JM          PEDIATR RADIOL                  12    57 982",
    "6   KRAEMER R             EUR J PEDIATR                  138   172 982",
    "7   GOODING CA            J PEDIATR                      105   384 984"
  ]
}