{
  "paperNumber": "78060",
  "recordNumber": "00841",
  "acessionNumber": "79126049",
  "authors": [
    "Treton-J",
    "Boucays-A",
    "Dersakissian-H",
    "Boue-A",
    "Courtois-Y."
  ],
  "title": "The repair of DNA single strand breaks in human cells with genetical disorders.",
  "source": "Cell-Biol-Int-Rep. 1978 Jul. 2(4). P 403-10.",
  "majorSubjects": [
    "DNA-REPAIR",
    "DNA: re",
    "DNA-SINGLE-STRANDED: bi."
  ],
  "minorSubjects": [
    "ADULT",
    "CELL-LINE",
    "CHILD-PRESCHOOL",
    "COMPARATIVE-STUDY.",
    "CYSTIC-FIBROSIS",
    "FIBROBLASTS",
    "HUMAN",
    "LESCH-NYHAN-SYNDROME.",
    "RETINOBLASTOMA",
    "TRISOMY",
    "X-RAYS."
  ],
  "abstractExtract": "The aim of this work was to make a preliminary examination of some hereditary diseases, related to precocious aging in order to determine whether the defects involved resulted from an impairment of the DNA repair capacity. To test for an impairment in DNA single strand capacity, in cells from patients with different diseases, we have followed the rate of the DNA after X-irradiation by sedimentation on alkaline sucrose gradients. It was found that all cells observed from Lesh Nyhan, cystic fibrosis, trisomy 15 et 21, retinoblastoma, were able to repair the single strand breaks in their DNA to the same extent and at the same initial rate.",
  "references": [
    "001   BOUE A                IN VITRO                        11   409 975",
    "002   BRADLEY MO            MUTATION RES                    37   279 976",
    "003   CLEAVER JE            PROC NAT ACAD SCI USA           63   428 969",
    "004   COUNIS MF             DEVELOP BIOL                    57    47 977",
    "005   CURE S                MOLEC CELLUL MECH AGING         27    47 973",
    "006   EPSTEIN JL            PROC NAT ACAD SCI USA           70   977 973",
    "007   EPSTEIN J             BIOCHEM BIOPHYS RES COMMUN      59   850 974",
    "008   GIANNELLI F           NATURE                         265   446 977",
    "009   HART RN               IN: CUTLER RG                    9   134 976",
    "010   HIGURASHI M           PEDIATR RES                      6   514 972",
    "011   KATO H                NATURE                         260   447 976",
    "012   LAMBERT B             ACTA MED SCAND                 200   433 976",
    "013   LINN S                PROC NAT ACAD SCI USA           73  2818 976",
    "014   LITTLE JB             GERONTOLOGY                     22    28 976",
    "015   PATERSON MC           NATURE                         260   444 976",
    "016   STRAUSS BS            LIFE SCI                        15  1685 974",
    "017   TAYLOR AMR            NATURE                         258   427 975",
    "018   TAYLOR AMR            NATURE                         260   441 976",
    "019   TICE RR               IN: CUTLER RG                    9    60 976",
    "020   TRETON JA             EXP CELL RES                   102   410 976",
    "021   TRETON JA             IN: COURTOIS Y                  60   193 976",
    "022   TROSKO JE             IN: CUTLER RG                    9   168 976",
    "023   WEICHSELBAUM RR       NATURE                         266   726 977"
  ],
  "citations": [
    "1   LEONARD JC            MUTATION RES                   105   417 982"
  ]
}