{
  "paperNumber": "78053",
  "recordNumber": "00834",
  "acessionNumber": "78145446",
  "authors": [
    "Benghial-A."
  ],
  "title": "Meconium ileus equivalent an adult: a case report.",
  "source": "Br-J-Surg. 1978 Mar. 65(3). P 215.",
  "majorSubjects": [
    "CYSTIC-FIBROSIS: co",
    "INTESTINAL-OBSTRUCTION: co.",
    "INTESTINE-SMALL."
  ],
  "minorSubjects": [
    "ACETYLCYSTEINE: tu",
    "ADULT",
    "CASE-REPORT",
    "HUMAN.",
    "INTESTINAL-OBSTRUCTION: dt",
    "MALE."
  ],
  "abstractExtract": "A case is described of meconium ileus equivalent presenting as a small bowel obstruction in an adult patient with cystic fibrosis. The importance of conservative management with acetylcysteine and intravenous fluids is emphasized.",
  "references": [
    "001   FISHER OD             ARCH DIS CHILD                  29   262 954",
    "002   GRACEY M              ARCH DIS CHILD                  44   404 969",
    "003   HODSON ME             BR MED J                         2   790 976",
    "004   HUNTON DB             GASTROENTEROLOGY                50    99 966",
    "005   LILLIBRIDGE CB        J PEDIATR                       71   887 967"
  ],
  "citations": []
}