{
  "paperNumber": "76151",
  "recordNumber": "00505",
  "acessionNumber": "76242784",
  "authors": [
    "di-SantAgnese-P-A",
    "Davis-P-B."
  ],
  "title": "Research in cystic fibrosis (third of three parts).",
  "source": "N-Engl-J-Med. 1976 Sep 9. 295(11). P 597-602. (REVIEW).",
  "majorSubjects": [
    "CYSTIC-FIBROSIS: me."
  ],
  "minorSubjects": [
    "ALPHA-FETOPROTEINS: me",
    "ANIMAL",
    "CILIA: pp.",
    "CYSTIC-FIBROSIS: di, im, mi, pp",
    "ELECTROLYTES: me.",
    "ENDOCRINE-GLANDS: pp",
    "FEMALE",
    "HETEROZYGOTE",
    "HUMAN",
    "INFECTION: im.",
    "KALLIKREIN: me",
    "KININS: me",
    "MUCUS: se",
    "PEPTIDE-HYDROLASES: ai.",
    "PREGNANCY",
    "PRENATAL-DIAGNOSIS",
    "PSEUDOMONAS-AERUGINOSA: ip.",
    "RESPIRATORY-SYSTEM: mi",
    "REVIEW",
    "SALIVARY-GLANDS: me",
    "SODIUM: me.",
    "STAPHYLOCOCCUS-AUREUS: ip",
    "TEARS:  me",
    "TRACHEA: pp."
  ],
  "abstractExtract": "Recent autonomic nervous system studies in cystic fibrosis are outlined.  Miscellaneous observations regarding salivary and tear glands, calcium, the kallikrein-kinin system, protease inhibitor, alpha-fetoprotein, and endocrine glands are discussed.  Because more than 90 per cent of patients with cystic fibrosis die of progressive pulmonary involvement, complicated by infection with Staphylococcus aureus or Pseudomonas aeruginosa (or both), the question of immunologic deficit is frequently raised.  Extensive investigations have shown the immune system in cystic fibrosis to be intact. Studies regarding pulmonary ciliary clearance and bacteriology are also outlined.  Despite extensive investigations, the basic defect of cystic fibrosis is still unknown.  What then is the explanation of the two defects in homozygotes that lead to most clinical manifestations - the sweat electrolyte defect and the abnormality in physiochemical behavior of mucous secretions?  The former is satisfactorily explained by a sodium-reabsorption-inhibitory factor present in sweat and saliva of patients.  As for the mucous-secretion abnormality, the effect of the increasing calcium concentration in decreasing the solubility of glycoproteins suggests that this mechanism might be responsible for the precipitation and obstruction of organ passages, which gives rise to most symptoms in cystic fibrosis.  Although there is an excellent diagnostic test for homozygotes (sweat test), one cannot rely on any of the present biologic assays for determination of heterozygosity or antenatal diagnosis.",
  "references": [
    "143   BOLANDE RP            ARCH PATHOL                     95   172 973",
    "144   STURGESS JM           BR J EXP PATHOL                 54   388 973",
    "145   MARTINEZ JR           PEDIATR RES                      9   463 975",
    "146   MARTINEZ JR           PEDIATR RES                      9   470 975",
    "147   MANGOS JA             IN: LAWSON D PROC 5TH INT CF          25 969",
    "148   BUCHWALD M            AM J HUM GENET                  27   22A 975",
    "149   WIESMANN UN           J PEDIATR                       76   444 970",
    "150   BLOMFIELD J           ARCH DIS CHILD                  48   267 973",
    "151   BOTELHO SY            J PEDIATR                       83   601 973",
    "152   SIMOPOULOS AP         PROC AM PEDIATR SOC ANNU MTG         201 971",
    "153   FITZPATRICK DF        NATURE NEW BIOL                235   173 972",
    "154   SMITH QT              NATURE NEW BIOL                240    56 972",
    "155   DUFFY MJ              NATURE NEW BIOL                246   151 973",
    "156   HORTON CR             BIOCHEM BIOPHYS RES COMMUN      40   505 970",
    "157   MCEVOY FA             CLIN CHIM ACTA                  54   195 974",
    "158   RAO GJS               J PEDIATR                       80   573 972",
    "159   RAO GJS               SCIENCE                        177   610 972",
    "160   COBURN MD             AM REV RESPIR DIS              110   368 974",
    "161   LIEBERMAN J           PEDIATR RES                      3   571 969",
    "162   LIEBERMAN J           AM REV RESPIR DIS              109   399 974",
    "163   TALAMO RC             PEDIATR RES                      6   430 972",
    "164   WEISS AS              J CLIN INVEST                   53   622 974",
    "165   SCHWARTZ RH           CF CLUB ABST                          19 972",
    "166   SHARP HL              IN: MANGOS JA                        229 973",
    "167   TALAMO RC             PEDIATRICS                      56    91 975",
    "168   SCHWARTZ RH           PEDIATR RES                      9   299 975",
    "169   TALAMO RC             IN: MANGOS JA                        195 976",
    "170   CHANDRA RK            BR MED J                         1   714 975",
    "171   SMITH JA              BR MED J                         2   392 975",
    "172   WALLWORK JC           BR MED J                         2   392 975",
    "173   BROCK DJH             BR MED J                         2   392 975",
    "174   DOLAN TF JR           J PEDIATR                       79   684 971",
    "175   ROSEN SW              J CLIN ENDOCRINOL METAB         32   410 971",
    "176   HANDWERGER S          N ENGL J MED                   281   451 969",
    "177   SIMOPOULOS AP         PEDIATR RES                      5   626 971",
    "178   MURAD F               J CLIN ENDOCRINOL METAB         40   552 975",
    "179   ROSAN RC              AM J DIS CHILD                 104   625 962",
    "180   WILMSHURST EG         PEDIATRICS                      55    75 975",
    "181   MILUNSKY A            AM J DIS CHILD                 121    15 971",
    "182   KJELLMAN NIM          ARCH DIS CHILD                  50   205 975",
    "183   STAHL M               J PEDIATR                       84   821 974",
    "184   HOIBY N               ACTA PATH MICROBIOL SCAND (B)   82   559 974",
    "185   WALLWORK JC           CLIN EXP IMMUNOL                18   303 974",
    "186   SCHWARTZ RH           AM J DIS CHILD                 120   432 970",
    "187   PENNINGTON JE         AM J MED                        58   629 975",
    "188   DI SANTAGNESE PA      DIS CHEST                       27   654 955",
    "189   MCFARLANE H           BR MED J                         1   423 975",
    "190   GUGLER EC             J PEDIATR                       73   548 968",
    "191   MARTINEZ-TELLO FJ     J IMMUNOL                      101   989 968",
    "192   FALCHUK ZM            PEDIATRICS                      51    49 973",
    "193   BIGGAR WD             PROC NAT ACAD SCI USA           68  1716 971",
    "194   BOXERBAUM B           AM REV RESPIR DIS              108   777 973",
    "195   ROSSMAN CM            PEDIATR RES                      8   469 974",
    "196   SANCHIS J             N ENGL J MED                   288   651 973",
    "197   ASPIN NA              PEDIATR RES                      9   393 975",
    "198   WOOD RE               AM REV RESPIR DIS              111   733 975",
    "199   MAY JR                ARCH DIS CHILD                  47   908 972",
    "200   ZIERDT CH             J CLIN MICROBIOL                 1   521 975",
    "201   DOGGETT RG            APPL MICROBIOL                  18   936 969",
    "202   CONOVER JH            LIFE SCI                        14   253 974"
  ],
  "citations": [
    "1   POLONOVSKI C          PEDIATRE                        12   379 976",
    "2   AZIZI F               N ENGL J MED                   295  1381 976",
    "3   RAMIREZ P             N ENGL J MED                   295  1381 976",
    "4   HOIBY N               ACTA PATH MICROBIOL SCAND (C) S262     3 977",
    "5   ANON                  BR MED J                         1   596 977",
    "6   THOMAS JM             PEDIATR RES                     11  1148 977",
    "7   LONGNECKER DS         ENVIRON HEALTH PERSPECT         20   105 977",
    "8   SCANLIN TF            BIOCHEM BIOPHYS RES COMMUN      79   869 977",
    "9   LIEBERMAN J           AM REV RESPIR DIS              116  1047 977",
    "10   DOERING KM            EUR J PEDIATR                  126   185 977",
    "11   FIGARELLA C           GASTROENTEROL CLIN BIOL          2   343 978",
    "12   OWEN E                J MOL MED                        3   203 978",
    "13   DAVIS PB              PEDIATR RES                     12   703 978",
    "14   IMPERO JE             PEDIATR RES                     12   108 978",
    "15   PEARSON RD            HEALTH LAB SCI                  15    32 978",
    "16   MARKOWITZ SM          INFECT IMMUN                    22   530 978",
    "17   RAO GJS               ENZYME                          23   314 978",
    "18   SCHWARZ HP            HELV PAEDIATR ACTA              33   351 978",
    "19   KOLLBERG H            SCAND J RESPIR DIS              59   297 978",
    "20   NEUTRA MR             GASTROENTEROLOGY                75   701 978",
    "21   VAUGHAN WJ            SCIENCE                        199   783 978",
    "22   BRESLOW JL            SCIENCE                        201   180 978",
    "23   RAO GJS               BIOCHIM BIOPHYS ACTA           541   435 978",
    "24   HOSLI P               LANCET                           2   543 979",
    "25   SEALE TW              J CLIN MICROBIOL                 9    72 979",
    "26   DISANTAGNESE PA       MONOGR PAEDIATR                 10    66 979",
    "27   GABRIDGE MG           PEDIATR RES                     13    31 979",
    "28   THOMASSEN MJ          PEDIATR RES                     13  1085 979",
    "29   LAM LFH               LIFE SCI                        24  2483 979",
    "30   SORDELLI DO           LIFE SCI                        24  2003 979",
    "31   COX DW                PEDIATR CLIN NORTH AM           26   467 979",
    "32   STURGESS JM           PEDIATR CLIN NORTH AM           26   481 979",
    "33   BROOKS FP             MAYO CLIN PROC                  54   475 979",
    "34   SANTAGNESE PAD        AM J MED                        66   121 979",
    "35   KOLLBERG H            ACTA PAEDIATR SCAND             68   639 979",
    "36   WOOD RE               SOUTH MED J                     72   189 979",
    "37   SHAPIRO BL            PROC NAT ACAD SCI USA           76  2979 979",
    "38   SCANLIN TF            CLIN CHIM ACTA                  91   197 979",
    "39   CHASE HP              J PEDIATR                       95   337 979",
    "40   WEISMAN Y             J PEDIATR                       95   416 979",
    "41   JAKEL HP              BIOL ZENTRALBL                  98    55 979",
    "42   HOSLI P               FEBS LETTERS                   104   271 979",
    "43   LEPRAT R              ANN MICROBIOL (PARIS)         B131   209 980",
    "44   HOLSCLAW DS           CLIN CHEST MED                   1   407 980",
    "45   SCANLIN TF            CLIN CHEST MED                   1   424 980",
    "46   IANNACCONE G          PEDIATR RADIOL                   9    85 980",
    "47   BUCHWALD M            ADV CYCLIC NUCLEO RES           12   243 980",
    "48   CASSINO RJJ           PEDIATR RES                     14  1212 980",
    "49   DAVIS PB              PEDIATR RES                     14    83 980",
    "50   GILLARD BK            PEDIATR RES                     14  1168 980",
    "51   WILL PC               PEDIATR RES                     14  1245 980",
    "52   WOODS DE              INFECT IMMUN                    30   694 980",
    "53   PRIMOSCH RE           ORAL SURG                       50   301 980",
    "54   SHIMAMOTO K           J CLIN ENDOCRINOL METAB         51   840 980",
    "55   GLORIABOTTINI F       HUM GENET                       54    79 980",
    "56   WILSON GB             J CLIN INVEST                   66  1010 980",
    "57   DAVIS PB              J LAB CLIN MED                  96    75 980",
    "58   ROSENSTEIN BJ         JOHNS HOPKINS MED J            147   188 980",
    "59   BYLUND DB             NATURE                         285   229 980",
    "60   DAVIS PB              N ENGL J MED                   302  1453 980",
    "61   MATTHEWS WJ           N ENGL J MED                   302   245 980",
    "62   SCHIOTZ PO            ACTA PATH MICROBIOL SCAND (C) S276     1 981",
    "63   FICK RB               CLIN CHEST MED                   2    91 981",
    "64   REYNOLDS HY           CLIN CHEST MED                   2   103 981",
    "65   ANTONELLI M           RIV ITAL PEDIATR                 7   769 981",
    "66   BANCHINI G            PEDIATR RES                     15  1073 981",
    "67   IMPERO JE             PEDIATR RES                     15   940 981",
    "68   SANDERSON MJ          PEDIATR RES                     15   219 981",
    "69   PIVETTA OH            LIFE SCI                        28  2207 981",
    "70   FERNANDES PB          INFECT IMMUN                    33   527 981",
    "71   OHMAN DE              INFECT IMMUN                    33   142 981",
    "72   THOMASSEN MJ          INFECT IMMUN                    33   512 981",
    "73   ANON                  NUTR REV                        39    14 981",
    "74   FICK RB               J CLIN INVEST                   68   899 981",
    "75   WILSON GB             J CLIN INVEST                   68   171 981",
    "76   TEGNER H              ACTA PAEDIATR SCAND             70   629 981",
    "77   CLARKE CW             BR J DIS CHEST                  75    15 981",
    "78   JACOBS WH             AM J GASTROENTEROL              76   342 981",
    "79   LIEBERMAN J           J LAB CLIN MED                  97   646 981",
    "80   MARKS MI              J PEDIATR                       98   173 981",
    "81   LLOYDSTILL JD         J PEDIATR                       99   580 981",
    "82   JAKEL HP              BIOL ZENTRALBL                 100   273 981",
    "83   LEMANSKE RF           AM REV RESPIR DIS              123   622 981",
    "84   SORENSEN RU           AM REV RESPIR DIS              123    37 981",
    "85   ROSCHER AA            J PHARMACOL EXP THER           216   419 981",
    "86   BYLUND DB             J PHARMACOL EXP THER           218   134 981",
    "87   BRESLOW JL            N ENGL J MED                   304     1 981",
    "88   VANGEFFEL R           ANN IMMUNOL (PARIS)           D133   293 982",
    "89   SORSCHER EJ           LANCET                           1   368 982",
    "90   STERN RC              LANCET                           1  1401 982",
    "91   HOOGENRAAD TU         NEUROOPHTHALMOL                  2   267 982",
    "92   VANGEFFEL R           IMMUNOL LETTERS                  5   155 982",
    "93   PALING MR             SKELETAL RADIOL                  8    63 982",
    "94   TABAK LA              J ORAL PATHOL                   11     1 982",
    "95   MORIARTY CM           J MED                           13   257 982",
    "96   JAGGER KS             J CLIN MICROBIOL                15  1054 982",
    "97   BLITZER MG            PEDIATR RES                     16   203 982",
    "98   PATTON CJ             PEDIATR RES                     16  1035 982",
    "99   MITCHELL EA           AUST PAEDIATR J                 18    40 982",
    "100   SHAPIRO BL            AM J HUM GENET                  34   846 982",
    "101   BOYCE JR              INFECT IMMUN                    37   695 982",
    "102   OHMAN DE              INFECT IMMUN                    37   662 982",
    "103   WINNIE GB             INFECT IMMUN                    38  1088 982",
    "104   DODGE JA              ARCH DIS CHILD                  57   774 982",
    "105   KOLLBERG H            EUR J RESPIR DIS                63   101 982",
    "106   KOLLBERG H            ACTA PAEDIATR SCAND             71   197 982",
    "107   HUBBARD VS            J AM DIET ASSOC                 80   127 982",
    "108   KEMP T                ARCH INT PHYSIOL BIOCHIM        90  B123 982",
    "109   STURGESS J            AM J PATHOL                    106   303 982",
    "110   KRAEMER R             EUR J PEDIATR                  138   172 982",
    "111   ROSENSTEIN BJ         JOHNS HOPKINS MED J            150   113 982",
    "112   KATZ SM               JAMA                           248  2284 982",
    "113   HOIBY N               ACTA PAEDIATR SCAND SUPPL 301 1982    33 982",
    "114   HOIBY N               ACTA PAEDIATR SCAND SUPPL 301 1982    75 982",
    "115   NEU HC                J ANTIMICROB CHEMOTHER          11     1 983",
    "116   CERQUETTI MC          IMMUNOL COMMUN                  12   375 983",
    "117   HARD R                TISSUE CELL                     15   217 983",
    "118   FRATES RC             PEDIATR RES                     17    30 983",
    "119   JAGGER KN             J CLIN MICROBIOL                17    55 983",
    "120   SCHILLER NL           PEDIATR RES                     17   747 983",
    "121   FICK RB               BULL EUR PHYSIOPATH RESP        19   151 983",
    "122   CEDER O               CLIN GENET                      23   298 983",
    "123   DAVIS PB              J CHRON DIS                     36   269 983",
    "124   NEVE J                ACTA PAEDIATR SCAND             72   437 983",
    "125   BARDON A              CLIN CHIM ACTA                 133   311 983",
    "126   HANNE LF              J BACTERIOL                    154   383 983",
    "127   ROSENBERG E           KLIN PAEDIATR                  195   323 983",
    "128   CEDER O               ACTA PAEDIATR SCAND SUPPL 309 1983     1 983",
    "129   ANDERSON CM           J PEDIATR GASTROENTEROL NUTR     3    15 984",
    "130   SHAWKER TH            J ULTRASOUND MED                 3   267 984",
    "131   VLADUTIU GD           IRCS MED SCI BIOCHEM            12   515 984",
    "132   RABKIN CS             ANN NEUROL                      15   608 984",
    "133   BOYD RL               PEDIATR RES                     18  1028 984",
    "134   KELLY HW              DRUG INTEL CLIN PHARM           18   772 984",
    "135   SPEERT DP             PEDIATR RES                     18   431 984",
    "136   ANWAR H               FEMS MICROBIOL LETTERS          24   235 984",
    "137   MCCLURE HM            ADV VET SCI COMP MED            28   267 984",
    "138   TAWARA K              RES COMMUN CHEM PATH PHARM      43   515 984",
    "139   HODSON ME             POSTGRAD MED J                  60   225 984",
    "140   BARDON A              ACTA PAEDIATR SCAND             73   263 984",
    "141   SATO K                J CLIN INVEST                   73  1763 984",
    "142   MCNEILL WF            AM J CLIN PATHOL                81   742 984",
    "143   DAVIS PB              CHEST                           85   802 984",
    "144   GILLARD BK            AM J DIS CHILD                 138   577 984",
    "145   HANCOCK REW           J INFECT DIS                   149   220 984",
    "146   GOLDBERG JB           J BACTERIOL                    158  1115 984",
    "147   SATO K                AM J PHYSIOL                   247  R646 984",
    "148   CASSANO WF            MED HYPOTHESES                  18    51 985",
    "149   MITCHELL EA           AUST PAEDIATR J                 21   127 985",
    "150   REYNOLDS HY           DISEASE A MONTH                 31     1 985",
    "151   JACQUOT J             INFECT IMMUN                    47   555 985",
    "152   LUZAR MA              INFECT IMMUN                    50   577 985",
    "153   LUZAR MA              INFECT IMMUN                    50   572 985",
    "154   FRIEDMAN HZ           GASTROENTEROLOGY                88   808 985",
    "155   TABLAN OC             J PEDIATR                      107   382 985",
    "156   MENDELMAN PM          AM REV RESPIR DIS              132   761 985",
    "157   FICK RB               J INFECT DIS                   151   589 985",
    "158   MUALLEM S             BIOCHIM BIOPHYS ACTA           819   143 985",
    "159   BRIDGES MA            PEDIATR RES                     20   356 986",
    "160   RUPP GM               MED HYPOTHESES                  20   245 986",
    "161   KUZEMKO JA            J ROY SOC MED                   79     2 986",
    "162   SULLIVAN MM           CHEST                           90   239 986",
    "163   DASGUPTA MK           J CLIN IMMUNOL                   7    51 987",
    "164   DAVIS PB              J DENT RES                      66   667 987",
    "165   TANDLER B             J DENT RES                      66   398 987",
    "166   GEDSCHOLD J           HUM GENET                       75   277 987",
    "167   EMMETT M              PROC SOC EXP BIOL MED          184    74 987"
  ]
}