{
  "paperNumber": "75082",
  "recordNumber": "00248",
  "acessionNumber": "76189166",
  "authors": [
    "Hook-E-B",
    "Bonenfant-R."
  ],
  "title": "Parathenar palmar pattern: a dermatoglyphic sign of possible clinical significance.",
  "source": "Hum-Hered. 1975. 25(6). P 509-12.",
  "majorSubjects": [
    "CYSTIC-FIBROSIS: fg",
    "DERMATOGLYPHICS",
    "HEART-DEFECTS-CONGENITAL:  fg."
  ],
  "minorSubjects": [
    "FEMALE",
    "HUMAN",
    "MALE."
  ],
  "abstractExtract": "The frequency of a \u0027double proximal axial triradius\u0027 (DPAT), which results in a palmar parathenar pattern, has been reported to be increased in those with ventricular septal defect (BSD). We scored the presence of this pattern in 313 patients with congenital heart defects (including 86 with isolated VSD), 176 with cystic fibrosis (CF) or relatives of those with CF, and 333 with no known clinical disease who were unrelated to individuals with CF. The frequencies in these three groups were 1.6, 2.3, and 0.6%, respectively. None of those with isolated VSD defect had a DPAT. All five individuals in the heart defect group with a DPAT had pulmonic stenosis. Of the total of eleven individuals in our series with DPAT patterns, eight were affected only on the right hand. The frequency of DPAT in individuals with no known disease in this series was 4/406\u003d1.0%, more than double the frequency in a control series, published previously by DAVID, 5/1,129\u003d0.4%. If the 73 relatives of those with CF are excluded from our own \u0027control\u0027 group, the frequency of DPAT in this group is then 0.6%, closer to the results in DAVID\u0027s control series.",
  "references": [
    "001   DAVID TJ              J PEDIATR                       79   343 971",
    "002   CUMMINS H             FINGER PRINTS PALMS AND SOLES        103 961",
    "003   HOOK EB               TERATOLOGY                       9   233 974"
  ],
  "citations": [
    "1   DENNIS RLH            ANN HUM BIOL                     5   269 978",
    "2   DAVID TJ              J MED GENET                     18   344 981"
  ]
}