{
  "paperNumber": "75144",
  "recordNumber": "00310",
  "acessionNumber": "75176052",
  "authors": [
    "Beratis-N-G",
    "Turner-B-M",
    "Weiss-R",
    "Hirschhorn-K."
  ],
  "title": "Arylsulfatase B deficiency in Maroteaux-Lamy syndrome: Cellular studies and carrier identification.",
  "source": "Pediatr-Res. 1975 May. 9(5). P 475-80.",
  "majorSubjects": [
    "ARYLSULFATASES: df",
    "MUCOPOLYSACCHARIDOSIS-6: en.",
    "MUCOPOLYSACCHARIDOSIS: en",
    "SULFATASES: df."
  ],
  "minorSubjects": [
    "AMNIOTIC-FLUID: en",
    "ARYLSULFATASES: an",
    "CELL-LINE",
    "CELLS-CULTURED.",
    "CHILD-PRESCHOOL",
    "CHONDROITIN",
    "CYSTIC-FIBROSIS: en",
    "FEMALE.",
    "FIBROBLASTS: en",
    "GALACTOSEMIA: en",
    "GAUCHERS-DISEASE: en.",
    "GLYCOGENOSIS-2: en",
    "HETEROZYGOTE",
    "HOMOZYGOTE",
    "HUMAN.",
    "LEUKOCYTES:  en",
    "LEUKODYSTROPHY-METACHROMATIC: en.",
    "LIPOCHONDRODYSTROPHY: en",
    "LYMPHOID-TISSUE: en",
    "LYSOSOMES: en",
    "MALE.",
    "METABOLISM-INBORN-ERRORS: en",
    "MUCOPOLYSACCHARIDOSIS-6: fg.",
    "PREGNANCY",
    "SKIN."
  ],
  "abstractExtract": "Arylsulfatase B deficiency was demonstrated in peripheral leukocytes, cultured skin fibroblasts, and a lymphoid line derived from a patient with MLS. The patient\u0027s parents demonstrated levels of arylsulfatase B that were intermediate between those found in patient and those in control subjects. The activity (mean plus or minus SD) in leukocytes from normal subjects, the patient\u0027s parents, and the patient was 113.7 plus or minus 36.2, 31.0, and 5.2 nmol 4-nitrocatechol/mg protein/hr, respectively. In skin fibroblasts of the same subjects the activity was 145.2 plus or minus 41.6, 58.5, and 7.0, respectively. Nine other lysosomal enzymes were normal in skin fibroblasts of the patient. No arylsulfatase B activity was detected in a lymphoid line established from the patient with MLS. The arylsulfatase B activity in cultured amniotic fluid cells from 10 normal pregnancies was 203.2 plus or minus 49.9.",
  "references": [
    "001   BARTON RW             J PEDIATR                       80   114 972",
    "002   BAUM H                CLIN CHIM ACTA                   4   453 959",
    "003   BERATIS NG            ANN HUM GENET                   38   485 975",
    "004   BERATIS NG            BIRTH DEF ORIG ART SER           9   247 973",
    "005   BERATIS NG            MAMM CHROM NEWSL                14   114 973",
    "006   CHOI KW               SCIENCE                        170    89 970",
    "007   CONOVER JH            PEDIATR RES                      7   224 973",
    "008   FLEISHER LD           PEDIATR RES                      8   388 974",
    "009   FLUHARTY AL           BIOCHEM BIOPHYS RES COMMUN      59   455 974",
    "010   GLASSER JH            J LAB CLIN MED                  82   969 973",
    "011   HALL CW               ARCH BIOCHEM BIOPHYS           158   817 973",
    "012   HO MW                 AM J HUM GENET                  24    37 972",
    "013   KABACK MM             N ENGL J MED                   282  1336 970",
    "014   KINT JA               SCIENCE                        167  1268 970",
    "015   LOWRY OH              J BIOL CHEM                    193   265 951",
    "016   MAROTEAUX P           B PRESSE MED                    71  1849 963",
    "017   MCKUSICK VA           HERITABLE DISORDERS OF CONNEC            972",
    "018   NITOWSKY HM           J LAB CLIN MED                  69   472 967",
    "019   OBRIEN J              BIOCHEM BIOPHYS RES COMMUN      60  1170 974",
    "020   PERCY AK              SCIENCE                        161   594 968",
    "021   SPECTOR EB            PEDIATR RES                      7   700 973",
    "022   SPRANGER JW           HELV PAEDIATR ACTA              25   337 970",
    "023   STUMPF DA             TRANS AMER SOC NEUROCHEM         3   125 972",
    "024   STUMPF DA             AM J DIS CHILD                 126   747 973",
    "025   ZIELKE K              J EXP MED                      136   197 972"
  ],
  "citations": [
    "1   BERATIS NG            CYTOGENET CELL GENET            15   195 975",
    "2   KIM HJ                AM J HUM GENET                  27   755 975",
    "3   KLEIJER WJ            LANCET                           2    50 976",
    "4   CORTNER JA            PEDIATR RES                     10   927 976",
    "5   BERATIS NG            CYTOGENET CELL GENET            17   236 976",
    "6   CANTZ M               HUM GENET                       32   233 976",
    "7   ROY AB                AUST J EXP BIOL MED SCI         54   111 976",
    "8   DORFMAN A             PROC NAT ACAD SCI USA           73   630 976",
    "9   DELVIN EE             BIOCHEM J                      157   353 976",
    "10   DYGGVE HV             NEUROPADIATRIE                   8   429 977",
    "11   BERATIS NG            PEDIATR RES                     11   862 977",
    "12   ZUFFARDI O            ANN GENET (PARIS)               20   191 977",
    "13   MACPHEE GB            J CLIN PATHOL                   30   278 977",
    "14   VANBIERVLIET JPGM     ARCH FR PEDIATR                 34   362 977",
    "15   RASTOGI SC            ACTA NEUROL SCAND               56   389 977",
    "16   FAROOQUI AA           CLIN CHIM ACTA                  74    93 977",
    "17   CHRISTOMANOU H        CLIN CHIM ACTA                  79   527 977",
    "18   JEZYK PF              SCIENCE                        198   834 977",
    "19   TURNER BM             BIOCHIM BIOPHYS ACTA           480   442 977",
    "20   BERATIS NG            J CLIN INVEST                   62  1264 978",
    "21   MOFFITT KD            ARCH BIOCHEM BIOPHYS           190   247 978",
    "22   JOLLY RD              AM J MED GENET                   4   293 979",
    "23   PILZ H                ANN NEUROL                       6   315 979",
    "24   HULTBERG B            J CLIN CHEM CLIN BIOCHEM        17   795 979",
    "25   GONCERZEWICZ M        GENET POLON                     20   265 979",
    "26   TALLAN HH             BIOCHEM MED                     21   129 979",
    "27   KAIBARA N             HUM GENET                       53    37 979",
    "28   HABUCHI H             J BIOL CHEM                    254  7570 979",
    "29   BERATIS NG            DEVELOP PHARM THER               1   305 980",
    "30   LEVY LA               AM J CLIN PATHOL                73   416 980",
    "31   FAROOQUI AA           CLIN CHIM ACTA                 100   285 980",
    "32   VANDYKE DL            AM J MED GENET                   8   235 981",
    "33   MCGOVERN MM           ENZYME                          26   206 981",
    "34   SHAFITZAGARDO B       AM J HUM GENET                  33   564 981",
    "35   VINE DT               AM J HUM GENET                  33   916 981",
    "36   DANESINO C            HUM GENET                       56   371 981",
    "37   RAPRAEGER AC          DEVELOP BIOL                    88   269 981",
    "38   PATTERSON DF          ADV HUM GENET                   12   263 982",
    "39   GRABOWSKI GA          METH CELL BIOL                  26    95 982",
    "40   GLEW RH               AM J CLIN NUTR                  35   236 982",
    "41   GLEW RH               COMP BIOCHEM PHYSIOL (B)        72   581 982",
    "42   GRAVEL RA             ANAL BIOCHEM                   119   360 982",
    "43   MCGOVERN MM           J BIOL CHEM                    257  2605 982",
    "44   BERATIS NG            ISOZYMES                        11    25 983",
    "45   BERATIS NG            AM J HUM GENET                  35    21 983",
    "46   BERATIS NG            CLIN CHIM ACTA                 134    11 983",
    "47   DANESINO C            CLIN GENET                      26   462 984",
    "48   DANESINO C            ANN GENET (PARIS)               27   162 984",
    "49   KRIVIT W              N ENGL J MED                   311  1606 984",
    "50   BETREMIEUX P          ANN PEDIATR (PARIS)             32   639 985",
    "51   MCGOVERN MM           GENETICS                       110   733 985",
    "52   BERATIS NG            CLIN GENET                      29   129 986"
  ]
}