{
  "paperNumber": "76133",
  "recordNumber": "00487",
  "acessionNumber": "76173255",
  "authors": [
    "Lipson-A."
  ],
  "title": "Letter: Infecting dose of Salmonella.",
  "source": "Lancet. 1976 May 1. 1(7966). P 969.",
  "majorSubjects": [
    "SALMONELLA: py."
  ],
  "minorSubjects": [
    "CYSTIC-FIBROSIS: dt",
    "DRUG-CONTAMINATION",
    "GASTROENTERITIS: mi.",
    "CROSS-INFECTION: mi",
    "HUMAN",
    "INFANT",
    "PANCREATIN: ae.",
    "SALMONELLA-INFECTIONS: mi."
  ],
  "abstractExtract": "An outbreak of salmonellosis in patients consuming pancreatin in the U.K. prompted a study at this hospital which included determination of the infecting dose in children with cystic fibrosis known to have contracted a S. schwarzengrund enteritis from contaminated porcine powdered pancreatin.  We found that infection was especially prevalent in very young cystic-fibrosis patients who were receiving broad-spectrum antibiotic treatment for chest infection.  All had their pancreatin added to meals immediately before consumption. Susceptibility to most infections depends on many factors and variables.  It is necessary to take into account such things as age and condition of the patient when discussing the actual number of organisms causing an infection.",
  "references": [
    "000   DAOUST JY             LANCET                           1   866 976",
    "004   ROWE B                BR MED J                         4    51 975",
    "006   LANG DJ               N ENGL J MED                   276   829 967",
    "007   MCCULLOUGH NB         J INFECT DIS                    88   276 951",
    "008   MCCULLOUGH NB         J INFECT DIS                    89   209 951",
    "009   MCCULLOUGH NB         J INFECT DIS                    89   259 951",
    "010   HORNICK RB            N ENGL J MED                   288   686 973",
    "011   BOHNHOFF M            J INFECT DIS                   111   117 962",
    "012   BENNETT IL            ANNU REV MED                    10     1 959"
  ],
  "citations": [
    "1   CRAUN GF              J WATER POLLUT CONTROL FED      49  1268 977",
    "2   DICKINSON RJ          SCOTT MED J                     23    23 978",
    "3   TURNBULL PCB          CLIN GASTROENTEROL               8   663 979",
    "4   SILLIKER JH           J FOOD PROTECT                  43   307 980",
    "5   PALMER SR             LANCET                           1   881 981",
    "6   BLASER MJ             REV INFECT DIS                   4  1096 982",
    "7   SCOTT E               J HYG LOND                      89   279 982",
    "8   LEE A                 ADV MICROB ECOL                  8   115 985"
  ]
}