{
  "paperNumber": "77001",
  "recordNumber": "00583",
  "acessionNumber": "78099755",
  "authors": [
    "Kaiser-G-I",
    "Laszlo-A",
    "Gyurkovits-K."
  ],
  "title": "Cystic fibrosis: a HLA associated hereditary disease?.",
  "source": "Acta-Paediatr-Acad-Sci-Hung. 1977. 18(1). P 27-9.",
  "majorSubjects": [
    "CYSTIC-FIBROSIS: fg",
    "HLA-ANTIGENS."
  ],
  "minorSubjects": [
    "CYSTIC-FIBROSIS: im",
    "HETEROZYGOTE",
    "HOMOZYGOTE",
    "HUMAN."
  ],
  "abstractExtract": "Twelve homozygote patients and thirty-two heterozygote gene carriers from families with cystic fibrosis were HLA-typed. Diagnostic criteria were sweat electrolyte concentration, pancreatic enzyme levels from duodenal juice and stool, Szczepanski\u0027s bromide test in the group of homozygotes, and the latter only in the cases of heterozygotes. In comparison with 130 healthy blood donors typed for 29 HLA antigens. B18 proved to be more frequent in the group of patients and gene carriers, with 50 and 31%, respectively, and 14% in the normal population. The association seems to be stronger in the homozygotes than in the heterozygotes (p less than 0.02, respectively).",
  "references": [
    "001   DAUSSET J             PRESSE MED                      76  1397 968",
    "002   DAUSSET J             NOUV REV FR HEMATOL              7   161 967",
    "003   DAUSSET J             CLIN IMMUNOL IMMUNOPATHOL        3   127 974",
    "004   GOTZ M                Z KINDERHEILK                  117   183 974",
    "005   POLYMENIDIS Z         LANCET                           2  1452 973",
    "006   VAN ROOD JJ           TRANSPLANT REV                  22    75 975",
    "007   SNELL GD              FOLIA BIOL                      14   335 968",
    "008   SVEJGAARD A           TRANSPLANT REV                  22     3 975",
    "009   SZCZEPANSKI Z         Z KINDERHEILK                  113   297 972",
    "010   WOODROW JC            PROC R SOC MED                  68   802 975",
    "011   ANON                  EUR J IMMUNOL                    5   889 975"
  ],
  "citations": [
    "1   RUSH PJ               SEM ARTHRITIS RHEUM             15   213 986"
  ]
}