{
  "paperNumber": "77055",
  "recordNumber": "00637",
  "acessionNumber": "78022900",
  "authors": [
    "Bray-P-T",
    "Clark-G-C",
    "Moody-G-J",
    "Thomas-J-D."
  ],
  "title": "Sweat testing for cystic fibrosis: errors associated with the in-situ sweat test using chloride ion selective electrodes.",
  "source": "Clin-Chim-Acta. 1977 Oct 15. 80(2). P 333-8.",
  "majorSubjects": [
    "CHLORIDES: an",
    "CYSTIC-FIBROSIS: di",
    "SWEAT: an."
  ],
  "minorSubjects": [
    "ELECTRODES",
    "HUMAN",
    "HYDROGEN-ION-CONCENTRATION",
    "METHODS.",
    "SKIN-ABSORPTION",
    "TEMPERATURE."
  ],
  "abstractExtract": "The in-situ sweat test is prone to errors from various sources. This paper examines errors due to evaporation, absorption of water into the skin, and pressure of the electrode on the skin. Only evaporation caused serious errors. The accuracy and precision when measuring small chloride/sweat samples on the skin are not significantly worse than when measuring bulk solutions.",
  "references": [
    "001   DI SANTAGNESE PA      N ENGL J MED                   295   481 976",
    "002   ANDERSON CM           CF A MANUAL OF DIAGNOSIS AND             976",
    "003   ANON                  J PEDIATR                       88   711 976",
    "004   DI SANTAGNESE PA      GAP CONF REP PROB SWEAT TESTI          6 975",
    "005   WARWICK WJ            JAMA                           198    59 966",
    "006   WARWICK WJ            PEDIATRICS                      36   261 965",
    "007   HANSEN L              AM J CLIN PATHOL                49   834 968",
    "008   GURSON CT             HELV PAEDIATR ACTA              28   165 973",
    "009   BRAY PT               PROC EWGCF 5TH ANNU MTG                  974",
    "010   ANDERSON CM           CF A MANUAL OF DIAGNOSIS AND             976",
    "011   TARNOKY AL            CLIN CHIM ACTA                  69   505 976",
    "012   SZABO L               CLIN CHEM                       19   727 973",
    "013   BRAY PT               CLIN CHIM ACTA                  77    69 977",
    "014   BRAY PT               PERSPECTIVE OF SODIUM AND CHL            975",
    "015   BLANK IH              J INVEST DERMATOL               18   433 952",
    "016   SPOCK A               GAP CONF REP PROB SWEAT TESTI         12 975"
  ],
  "citations": [
    "1   BARNES GL             AUST PAEDIATR J                 14    78 978",
    "2   WARWICK WJ            CLIN CHEM                       24  2050 978",
    "3   BUCK RP               ANAL CHEM                       50  R 17 978",
    "4   BRAY PT               ARCH DIS CHILD                  53   483 978",
    "5   ROSENSTEIN BJ         JAMA                           240  1987 978",
    "6   STAGG BH              ANN CLIN BIOCHEM                16   147 979",
    "7   SHIRAMIZU B           ANAL CHIM ACTA                 108   161 979",
    "8   BENSON RG             CLIN CHEM                       28  2447 982",
    "9   WEBSTER HL            CRC CRIT REV CLIN LAB SCI       18   313 983"
  ]
}