{
  "paperNumber": "76127",
  "recordNumber": "00481",
  "acessionNumber": "77054785",
  "authors": [
    "Czegledy-Nagy-E",
    "Sturgess-J-M."
  ],
  "title": "Cystic fibrosis: effects of serum factors on mucus secretion.",
  "source": "Lab-Invest. 1976 Dec. 35(6). P 588-95.",
  "majorSubjects": [
    "CYSTIC-FIBROSIS: pp."
  ],
  "minorSubjects": [
    "ANIMAL",
    "CILIA: pa",
    "CYSTIC-FIBROSIS: bl, pa",
    "HUMAN",
    "RABBITS.",
    "TRACHEA: pa, ul."
  ],
  "abstractExtract": "The effects of serum from children with cystic fibrosis and from normal children on the mucus-secreting, ciliated epithelium have been investigated in vitro using explanted tissue from rabbit lung. By optical and scanning electron microscopy, a sequence of structural changes is observed after incubation with cystic fibrosis serum; this sequence does not occur with normal serum. The earliest changes involve swelling of the goblet cells, with subsequent discharge of mucus onto the epithelial surface. This is followed by disruption of the normally rapid and synchronized ciliary activity. Mucus gradually extends over the surface entangling cilia. Finally, some shedding of ciliated cells occurs from the epithelium. These findings suggest that factors in cystic fibrosis serum cause discharge of mucus leading to a disturbance of the normal ciliary activity in the rabbit lung. It is postulated that such changes result in dysfunction of the mucociliary clearance mechanism and that this dysfunction may be a contributory factor to the pathogenesis of lung disease.",
  "references": [
    "001   ADSHEAD PC            ANN NY ACAD SCI                253   192 975",
    "002   BARNETT DR            TEX REP BIOL MED                31   703 973",
    "003   BOWMAN BH             IN: MANGOS JA                         29 973",
    "004   BOWMAN BH             SCIENCE                        164   325 969",
    "005   CONOVER JH            PEDIATR RES                      7   220 973",
    "006   CONOVER JH            LANCET                           1  1194 973",
    "007   CONOVER JH            LIFE SCI                        14   253 974",
    "008   CRAWFURD MDA          IN: LAWSON D PROC 5TH INT CF          42 969",
    "009   CZEGLEDY-NAGY E       PROC MICROSC SOC CAN             2    76 975",
    "010   FORSTNER GG           CAN MED ASSOC J                113   550 975",
    "011   KILBURN KH            AM REV RESPIR DIS               98   449 968",
    "012   RAO GJS               PEDIATR RES                      8   684 974",
    "013   SANCHIS J             N ENGL J MED                   289   749 974",
    "014   SPOCK A               PEDIATR RES                      1   173 967",
    "015   STANNERS CP           NATURE NEW BIOL                230    52 971",
    "017   YEATES DB             ARCH DIS CHILD                  51    28 976"
  ],
  "citations": [
    "1   SCHWACHMAN H          N ENGL J MED                   296  1519 977",
    "2   FORSTNER JF           DIGESTION                       17   234 978",
    "3   NAGY EC               PEDIATR RES                     13   729 979",
    "4   STURGESS JM           PEDIATR CLIN NORTH AM           26   481 979",
    "5   JAKEL HP              BIOL ZENTRALBL                  98    55 979",
    "6   NICOSIA SV            SCIENCE                        206   698 979",
    "7   KENNEDY JR            PEDIATR RES                     14  1173 980",
    "8   KURLANDSKY LE         PEDIATR RES                     14  1263 980",
    "9   BATTISTA SP           ARCH ENVIRON HEALTH             35   239 980",
    "10   PEATFIELD AC          THORAX                          35   232 980",
    "11   BOWMAN BH             FED PROC                        39  3195 980",
    "12   WILSON GB             J CLIN INVEST                   66  1010 980",
    "13   FLEMING N             EXPERIENTIA                     37   139 981",
    "14   SPECIAN RD            AM J ANAT                      160   461 981",
    "15   BERGAN T              SCAND J INFECT DIS            1981     7 981",
    "16   MORIARTY CM           J MED                           13   257 982",
    "17   BOAT TF               PEDIATR RES                     16   792 982",
    "18   REID L                ADV EXP MED BIOL               144   369 982",
    "19   ROOMANS GM            SCANN ELECTRON MICROSC        1982   229 982",
    "20   CEDER O               ULTRASTRUCTURAL PATHOL           4   305 983",
    "21   VONEULER AM           ULTRASTRUCTURAL PATHOL           5    37 983",
    "22   QUISSELL DO           PEDIATR RES                     17   899 983",
    "23   RUTLAND J             AM REV RESPIR DIS              128  1030 983",
    "24   MCPHERSON MA          CLIN CHIM ACTA                 135   181 983",
    "25   ROOMANS GM            SCANN ELECTRON MICROSC        1983   697 983",
    "26   WOOTEN MW             J CELL PHYSIOL                 121   490 984",
    "27   VONEULER AM           LIFE SCI                        37  2399 985",
    "28   VONEULER AM           EXP MOL PATH                    43   142 985"
  ]
}