{
  "paperNumber": "77070",
  "recordNumber": "00651",
  "acessionNumber": "78042532",
  "authors": [
    "Harrisson-S-P."
  ],
  "title": "Dysfunctional aspects of a supportive group.",
  "source": "Community-Health (Bristol). 1977 Aug. 9(1). P 17-9.",
  "majorSubjects": [
    "STRESS-PSYCHOLOGICAL",
    "VOLUNTARY-HEALTH-AGENCIES."
  ],
  "minorSubjects": [
    "CHILD",
    "CYSTIC-FIBROSIS: px",
    "HUMAN."
  ],
  "abstractExtract": "A number of voluntary organizations exist for the support of patients and their relatives suffering from specific medical conditions.  It is usually assumed that membership will provide positive emotional and social support but membership may provide dysfunctional responses.  A small-scale study of parents of fibrocystic children provides some evidence of dysfunctional aspects of membership of one specific organization.  Further research into the effects of formal and informal reference group activity and the types of support most acceptable to patients and their families is suggested.",
  "references": [
    "001   BURTON L              PRACTITIONER                   210   247 973",
    "002   BURTON L              FAMILY LIFE OF SICK CHILDREN             975",
    "003   HARRISSON SP          THESIS                                   975",
    "004   HEWETT S              FAMILY AND HANDICAPPED CHILD             970",
    "005   MCCOLLUM AT           J PEDIATR                       77   571 970",
    "006   MERTON RK             SOCIAL THEORY AND SOCIAL STRU        343 968"
  ],
  "citations": []
}