{
  "paperNumber": "78088",
  "recordNumber": "00869",
  "acessionNumber": "79109072",
  "authors": [
    "Marchi-A-G",
    "Marchi-M-A",
    "Cigui-I",
    "Uxa-F",
    "Perticarari-S",
    "Nordio-S."
  ],
  "title": "Further studies on lymphocyte beta-glucuronidase abnormality in cystic fibrosis.  Possible relations to carboxypeptidase B-like activity.",
  "source": "Helv-Paediatr-Acta. 1978 Dec. 33(6). P 517-25.",
  "majorSubjects": [
    "CARBOXYPEPTIDASES: bl",
    "CYSTIC-FIBROSIS: en",
    "GLUCURONIDASE: bl.",
    "LYMPHOCYTES: en."
  ],
  "minorSubjects": [
    "CHILD",
    "CYSTIC-FIBROSIS: di, fg",
    "FEMALE",
    "HETEROZYGOTE",
    "HOMOZYGOTE.",
    "HUMAN",
    "LYMPHOCYTE-TRANSFORMATION",
    "MALE",
    "PHYTOHEMAGGLUTININS: pd."
  ],
  "abstractExtract": "The presence in the serum of both cystic fibrosis (CF) homozygotes and heterozygotes of a factor inhibiting the response of lymphocyte lysosome beta-glucuronidase activity to in vitro phytohaemagglutinin (PHA) stimulation is confirmed. Studying lymphocyte beta- glucuronidase activity on PHA stimulation represents a way to confirm CF diagnosis and to screen CF heterozygotes. For technical complexity, however, the method cannot be used for mass screening, but it can be useful for confirming the diagnosis in suspected cases. Relationships between serum factor inhibiting the effect of PHA on beta-glucuronidase, ciliary dyskinesia factor and carboxypeptidase B- like activity are discussed.",
  "references": [
    "001   CONOVER JH            LANCET                           2  1501 973",
    "002   CONOVER JH            PEDIATR RES                      7   220 973",
    "003   CONOVER JH            PEDIATR RES                      7   224 973",
    "004   CONOVER JH            LIFE SCI                        14   253 974",
    "005   DI SANTAGNESE PA      N ENGL J MED                   295   481 976",
    "006   ERDOS EG              BIOCHEM PHARMACOL               13   893 964",
    "007   FOLK JE               J BIOL CHEM                    235  2272 960",
    "008   LIEBERMAN J           AM REV RESPIR DIS              111   100 975",
    "009   LIEBERMAN J           AM REV RESPIR DIS              116  1047 977",
    "010   MANGIAROTTI-MARCHI MA MINERVA PEDIATR                 23  1847 971",
    "011   MARCHI AG             MINERVA PEDIATR                 23  1842 971",
    "012   MARCHI AG             HELV PAEDIATR ACTA              28   427 973",
    "013   MARCHI AG             ACTA PAEDIATR BELG              29    67 976",
    "014   NORDIO S              ACTA PAEDIATR SCAND             63   664 974"
  ],
  "citations": [
    "1   JAKEL HP              BIOL ZENTRALBL                 100   273 981"
  ]
}