{
  "paperNumber": "77087",
  "recordNumber": "00668",
  "acessionNumber": "78065932",
  "authors": [
    "Sorensen-R-U",
    "Stern-R-C",
    "Polmar-S-H."
  ],
  "title": "Cellular immunity to bacteria: impairment of in vitro lymphocyte responses to Pseudomonas aeruginosa in cystic fibrosis patients.",
  "source": "Infect-Immun. 1977 Dec. 18(3). P 735-40.",
  "majorSubjects": [
    "ANTIGENS-BACTERIAL",
    "CYSTIC-FIBROSIS: im",
    "LYMPHOCYTE-TRANSFORMATION.",
    "PSEUDOMONAS-AERUGINOSA: im."
  ],
  "minorSubjects": [
    "ANTIBODIES-BACTERIAL",
    "CONCANAVALIN-A",
    "HAEMOPHILUS-INFLUENZAE: im.",
    "HUMAN",
    "LECTINS",
    "STAPHYLOCOCCUS-AUREUS: im.",
    "STREPTOCOCCUS-PYOGENES: im",
    "SUPPORT-U-S-GOVT-P-H-S."
  ],
  "abstractExtract": "Lymphocyte responses to the mitogens phytohemagglutinin and concanavalin A and to Streptococcus pyogenes, Staphylococcus aureus, Haemophilus influenzae, and Pseudomonas aeruginosa were evaluated in patients with cystic fibrosis and in normal individuals. Lymphocyte proliferation in vitro was stimulated by gentamicin-killed whole bacteria, and the proliferative response was measured by [3H]thymidine incorporation. The in vitro lymphocyte responses to antibiotic-killed bacterial reached maximum thymidine incorporation after 5 days in culture and followed a unimodal dose-response curve for each of the bacteria studied. A significant specific incapacity to respond to P. aeruginosa was detected in cystic fibrosis patients with advanced clinical disease.",
  "references": [
    "001   BEKIERKUNST A         INFECT IMMUN                    14    28 976",
    "002   BURNS MW              LANCET                           1   270 968",
    "003   DOERSHUK CF           J PEDIATR                       65   677 964",
    "004   EIJSVOOGEL VP         SEMIN HEMATOL                   11   305 974",
    "005   FOWLES RE             J EXP MED                      138   952 973",
    "006   GODAL T               CLIN EXP IMMUNOL                 8   625 971",
    "007   HANN S                INFECT IMMUN                    14   114 976",
    "008   HOIBY N               SCAND J RESPIR DIS              56    38 975",
    "009   HOMMA JY              JAPAN J EXP MED                 41    89 971",
    "010   KRAHENBUHL JL         INFECT IMMUN                     4   337 971",
    "011   MACKANESS GB          J EXP MED                      129   973 969",
    "012   MOONEY JJ             J IMMUNOL                      105  1138 970",
    "013   ORDAL J               J IMMUNOL                      116  1182 976",
    "014   SHWACHMAN H           AM J DIS CHILD                  96     6 958",
    "015   SCHWARTZ RH           AM J DIS CHILD                 111   408 966",
    "016   SIMON GB              CELL IMMUNOL                     4   163 972",
    "017   SISKIND GW            FED PROC                        33  1886 974",
    "018   SOUTH MA              J PEDIATR                       71   645 967",
    "019   THORSBY E             HISTOCOMPATIBILITY TESTING           655 970",
    "020   WOOD RE               AM REV RESPIR DIS              111   733 975",
    "021   YEATES DB             ARCH DIS CHILD                  51    28 976"
  ],
  "citations": [
    "1   CHO YJ                JAP J EXP MED                   48   491 978",
    "2   SORENSEN RU           J PEDIATR                       93   201 978",
    "3   TOURAINE JL           REV FR MAL RESP                  7    41 979",
    "4   THOMASSEN MJ          PEDIATR RES                     13  1085 979",
    "5   WILSON GB             J CLIN INVEST                   66  1010 980",
    "6   SCHIOTZ PO            ACTA PATH MICROBIOL SCAND (C) S276     1 981",
    "7   RUBIN HR              CELL IMMUNOL                    57   307 981",
    "8   HEYNE K               EUR J PEDIATR                  137   116 981",
    "9   SEALE TW              ANN CLIN LAB SCI                12   415 982",
    "10   BODEY GP              REV INFECT DIS                   5   279 983",
    "11   PETIT JC              BIOMED PHARMACOTHER             37   422 983",
    "12   RUBIN HR              INFECT IMMUN                    39   630 983",
    "13   PORWOLL JM            INFECT IMMUN                    40   670 983",
    "14   PARMELY MJ            J EXP MED                      160  1338 984",
    "15   LIEBERMAN MM          SURV SYNTH PATHOL RES            4   312 985",
    "16   SPEERT DP             SURV SYNTH PATHOL RES            4    14 985",
    "17   HEGGIE AD             PROC SOC EXP BIOL MED          181   586 986"
  ]
}