{
  "paperNumber": "78093",
  "recordNumber": "00874",
  "acessionNumber": "78192839",
  "authors": [
    "Schiotz-P-O",
    "Hoiby-N",
    "Morling-N",
    "Sorensen-H."
  ],
  "title": "C3 polymorphism in a Danish cystic fibrosis population and its possible association with antibody response.",
  "source": "Hum-Hered. 1978. 28(4). P 293-300.",
  "majorSubjects": [
    "ANTIBODIES-BACTERIAL",
    "COMPLEMENT-3: ge",
    "CYSTIC-FIBROSIS: im.",
    "POLYMORPHISM-GENETICS."
  ],
  "minorSubjects": [
    "ADOLESCENCE",
    "ADULT",
    "ANTIBODIES-BACTERIAL: an",
    "CHILD.",
    "CHILD-PRESCHOOL",
    "CYSTIC-FIBROSIS: fg",
    "DENMARK",
    "FEMALE.",
    "GENE-FREQUENCY",
    "HUMAN",
    "INFANT",
    "INFANT-NEWBORN",
    "MALE",
    "PHENOTYPE.",
    "PSEUDOMONAS-INFECTIONS: im."
  ],
  "abstractExtract": "The C3 types of human serum are reported for a material of 113 Danish cystic fibrosis patients, age 0-30 years. The frequency of the C3F gene was 0.2832 which was significantly higher (p less than 0.0005) than the frequency found in a control group of 224 healthy babies (C3F \u003d 0.1585). It also differed significantly (p less than 0.01) from the C3F gene frequency of 0.1780 found in 177 blood donors, age 20-24 years. A significant association between any of the C3 phenotypes and the most serious infection in cystic fibrosis, chronic mucoid P. aeruginosa infection, or the antibody response against these bacteria was not found.",
  "references": [
    "001   BRONNESTAM R          HUM HERED                       23   206 973",
    "002   BRONNESTAM R          HUM HERED                       23   214 973",
    "003   BURNS MW              LANCET                           1   270 968",
    "004   DIEM K                DOCUMENTA GEIGY SCIENTIFIC TA            962",
    "005   DOGGETT RG            IN: LAWSON D PROC 5TH INT CF         175 969",
    "006   DOGGETT RG            INFECT IMMUN                     6   628 972",
    "007   FARHUD DD             HUMANGENETIK                    17    57 972",
    "008   GIBSON LE             PEDIATRICS                      23   545 959",
    "009   HOFF GE               SCAND J INFECT DIS               6   333 974",
    "010   HOLZHAUER RJ          AM J HUM GENET                  28   602 976",
    "011   HOIBY N               ACTA PATH MICROBIOL SCAND (B)   81   298 973",
    "012   HOIBY N               ACTA PATH MICROBIOL SCAND (B)   82   541 974",
    "013   HOIBY N               ACTA PATH MICROBIOL SCAND (B)   82   551 974",
    "014   HOIBY N               ACTA PATH MICROBIOL SCAND (B)   83   549 975",
    "015   HOIBY N               SCAND J RESPIR DIS              58    65 977",
    "016   LEDERBERG S           AM J HUM GENET                  28   597 976",
    "017   SHWACHMAN H           CLIN PEDIATR                    14  1115 975",
    "018   SORENSEN H            HUM HERED                       25   279 975",
    "019   SORENSEN H            HUM HERED                       25   284 975",
    "020   TEISBERG P            VOX SANG                        19    47 970"
  ],
  "citations": [
    "1   SCACCHI R             HUM HERED                       31   183 981",
    "2   BECK B                ACTA PAEDIATR SCAND SUPPL 301 1982   125 982",
    "3   BERNAL JE             HUM HERED                       36    97 986",
    "4   SCHUR PH              ANNU REV MED                    37   333 986"
  ]
}