{
  "paperNumber": "76147",
  "recordNumber": "00501",
  "acessionNumber": "78071432",
  "authors": [
    "Newhouse-M-T",
    "Rossman-C-M",
    "Dolovich-J",
    "Dolovich-M-B",
    "Wilson-W-M."
  ],
  "title": "Impairment of mucociliary transport in cystic fibrosis.",
  "source": "Mod-Probl-Paediatr. 1976 Oct 24-27. 19. P 190-8.",
  "majorSubjects": [
    "CILIA: ph",
    "CYSTIC-FIBROSIS: pp",
    "MUCUS: ph."
  ],
  "minorSubjects": [
    "HUMAN",
    "IGG",
    "IN-VITRO",
    "INFLAMMATION: pp",
    "NASAL-MUCOSA: pp.",
    "RESPIRATORY-SYSTEM: pp."
  ],
  "abstractExtract": "Over the past few years, studies from various laboratories have suggested the presence of a factor(s) in cystic fibrosis serum causing widespread in vitro abnormalities of components of the lung defence mechanism particularly with respect to macrophage dysfunction, quantitative and qualitative alterations in mucus, and ciliary motility.  The possible in vivo role of ciliary dysfunction in the pathogenesis of the disease is of particular clinical interest.  Since an in vitro ciliary dyskinesia factor had been previously demonstrated and pulmonary complications are the hallmark of CF, yet clearance in most of our clinically stable CF subjects was relatively well maintained, this suggested to us that a mucociliary transport abnormality might be present intermittently.  In order to explore this further, we designed nasal mucociliary clearance studies to determine whether CF serum might exhibit MCT inhibition in vivo. From these studies, we concluded that there was a substance(s) in CF serum which had the capacity to slow MCT.  Whether this effect is on the cilia themselves or via overproduction of normal or abnormal mucus is not known.",
  "references": [
    "001   BOXERBAUM B           AM REV RESPIR DIS              108   777 973",
    "002   YEATES DB             ARCH DIS CHILD                  51    28 976",
    "003   GIBSON LE             LANCET                           2   189 970",
    "004   SPOCK A               PEDIATR RES                      1   173 967",
    "005   BOWMAN BH             SCIENCE                        164   325 969",
    "006   BESLEY GTN            J MED GENET                      6   278 969",
    "007   WOOD RE               LANCET                           2  1452 973",
    "008   CHRISTENSEN J         IN: LAWSON D PROC 5TH INT CF          49 969",
    "009   CHERRY JD             J PEDIATR                       79   937 971",
    "010   SANCHIS J             N ENGL J MED                   288   651 973",
    "011   WOOD RE               AM REV RESPIR DIS              111   733 975",
    "012   NEWHOUSE M            IN: MANGOS JA                        319 973",
    "013   SANCHIS J             J APPL PHYSIOL                  33   757 972",
    "014   SANCHIS J             BULL PHYSIOPATH RESPIR NANCY     9   325 973",
    "015   ROSSMAN CM            J PEDIATR                       90   579 977",
    "016   PROCTOR DF            IN: DAVIES CN                    2    25 967",
    "017   BOWMAN BH             SCIENCE                        167   871 970",
    "018   BOWMAN BH             BIOCHEM BIOPHYS RES COMMUN      64  1310 975",
    "019   DANES BS              J EXP MED                      137  1538 973",
    "020   ISHIZAKA K            J IMMUNOL                      100   554 968",
    "021   WANNER A              CHEST                           61   287 972",
    "022   KARTAGENER M          BEITR KLIN TUBERK               83   489 933",
    "023   CAMNER P              AM REV RESPIR DIS              112   807 975",
    "024   AFZELIUS BA           SCIENCE                        193   317 976"
  ],
  "citations": []
}