{
  "paperNumber": "79124",
  "recordNumber": "01104",
  "acessionNumber": "80051503",
  "authors": [
    "Fellows-K-E",
    "Khaw-K-T",
    "Schuster-S",
    "Shwachman-H."
  ],
  "title": "Bronchial artery embolization in cystic fibrosis; technique and long-term results.",
  "source": "J-Pediatr. 1979 Dec. 95(6). P 959-63.",
  "majorSubjects": [
    "BRONCHIAL-ARTERIES",
    "CYSTIC-FIBROSIS: co",
    "EMBOLIZATION-THERAPEUTIC.",
    "HEMOPTYSIS: th."
  ],
  "minorSubjects": [
    "ADOLESCENCE",
    "ADULT",
    "ANGIOGRAPHY",
    "BRONCHIAL-DISEASES: ra, th.",
    "BRONCHOSCOPY",
    "CHILD",
    "FEMALE",
    "FOLLOW-UP-STUDIES",
    "HEMOPTYSIS: et.",
    "HUMAN",
    "MALE",
    "RECURRENCE."
  ],
  "abstractExtract": "Severe bronchial hemorrhage in 13 patients with cystic fibrosis was treated by catheter embolization of bronchial arteries. Indications were either excessive bleeding persisting for several days, or bleeding serious enough to interfere with pulmonary drainage and recurring over weeks or months. In follow-up ranging from one to 30 months, cessation of major bleeding was achieved in 12 of 13 patients (93%), although 5 of 13 patients (40%) did have recurrence of minor hemoptysis. No neurologic or other major complications were encountered. However, there are potential risks and this approach at present should be limited to patients with life-threatening bleeding and carried out only by experienced angiographers.",
  "references": [
    "001   HOLSCLAW DS           J PEDIATR                       76   829 970",
    "002$  STERN RC              AM REV RESPIR DIS              117   825 978",
    "003   SCHUSTER SR           J PEDIATR SURG                  12   889 977",
    "004   WHOLEY MH             JAMA                           236  2501 976",
    "005   HARLEY JD             AM J ROENTGENOL                128   302 977",
    "006   BOOKSTEIN JJ          CHEST                           72   658 977",
    "007   REMY J                RADIOLOGY                      122    33 977",
    "008   SHWACHMAN H           AM J DIS CHILD                  96     6 958",
    "009   FELLOWS KE            RADIOLOGY                      114   551 975",
    "010   FEIGELSON HH          RADIOLOGY                       85   663 965",
    "011   KARDJIEV V            RADIOLOGY                      112    81 974",
    "012   REUTER S              RADIOLOGY                       84    87 965",
    "013   DICHIRO G             RADIOLOGY                      112   231 974",
    "014   DICHIRO G             J NEUROSURG                     39     1 973",
    "015   TVETEN L              ACTA RADIOL                     17     1 976",
    "016   TVETEN L              ACTA RADIOL                     17   257 976",
    "017   BOTENGA ASJ           SELECTIVE BRONCHIAL AND INTER            970",
    "018   HELENON CH            NOUV PRESSE MED                  6  4209 977",
    "019   BARTH KH              INVEST RADIOL                   12   273 977",
    "020   KERBER CW             AM J ROENTGENOL                130  1193 978"
  ],
  "citations": [
    "1   HOLSCLAW DS           CLIN CHEST MED                   1   407 980",
    "2   ATHANASOULIS CA       N ENGL J MED                   302  1117 980",
    "3   FELLOWS KE            RADIOLOGY                      140   249 981",
    "4   TABACHNIK NF          SURG GYNECOL OBSTET            152   837 981",
    "5   SILVERMAN NA          CHEST                           82   195 982",
    "6   HEASTON DK            SEM RESPIR MED                   5    58 983",
    "7   MARMON L              J PEDIATR SURG                  18   811 983",
    "8   PORTER DK             J THORAC CARDIOVASC SURG        86   409 983",
    "9   PORTER DK             ARCH INTERN MED                143   287 983",
    "10   UFLACKER R            RADIOLOGY                      146   627 983",
    "11   WHITE RI              ANN RADIOL (PARIS)              27   310 984",
    "12   BARTH KH              MED CLIN NORTH AM               68  1647 984",
    "13   DAVIS PB              CHEST                           85   802 984",
    "14   WHITE RI              AM J ROENTGENOL                142    27 984",
    "15   LESTER LA             SEM RESPIR MED                   6   285 985",
    "16   HOFFER FA             PEDIATR CLIN NORTH AM           32  1461 985",
    "17   TRENTO A              ANN THORAC SURG                 39   254 985",
    "18   STANKIEWICZ JA        EAR NOSE THROAT J               64   180 985",
    "19   NOLAN MT              IR J MED SCI                   154   336 985",
    "20   LOCK JE               J AM COLL CARDIOL                7  1420 986",
    "21   KAUFMAN SL            AM J CARDIOL                    58  1130 986",
    "22   MOORE LB              RADIOLOGY                      161   173 986",
    "23   FERNALD GW            SEM ROENTGENOL                  22    87 987",
    "24   LOCK JE               CIRCULATION                     75   593 987"
  ]
}