{
  "paperNumber": "75159",
  "recordNumber": "00325",
  "acessionNumber": "76012347",
  "authors": [
    "Holzel-A."
  ],
  "title": "The quest for the basic defect in cystic fibrosis.",
  "source": "Physiotherapy. 1975 Aug 10. 61(8). P 238-9.",
  "majorSubjects": [
    "CYSTIC-FIBROSIS: et."
  ],
  "minorSubjects": [
    "CYSTIC-FIBROSIS: fg",
    "HUMAN",
    "METABOLISM-INBORN-ERRORS: co."
  ],
  "abstractExtract": "The search for the basic defect in cystic fibrosis has so far been singularly disappointing.  There is no doubt that it is a disease recessively inherited, ie that the parents carry the cystic fibrosis gene without showing any signs of ill health (heterozygous) but when transmitted from both of them to an offspring this child manifests the disease, having acquired the abnormal gene in double dose (homozygote).  Cystic fibrosis is the most common of the genetically determined diseases.  Two types of cultured cells, fibroblasts and white cells from affected individuals and heterozygous carriers for cystic fibrosis, showed characteristic changes of metachromasia that seemed to allow for a classification of patients and carriers to be distributed into separate classes.  Serum from patients with cystic fibrosis of the pancreas disorganises the movement of cilia of the isolated rabbit tracheal mucosa.  One of the early and also most constant observations is the \u0027viscosity\u0027 of secretions of the mucosal glands in the respiratory tract, in the alimentary apparatus, in the biliary system and in the pancreas.  A striking increase in the levels of sodium and chloride, and to a lesser extent of potassium, is present in the sweat of practically all sufferers of cystic fibrosis.  However frustrating and tantalising the outcome of research into the basic defect has been so far, the ultimate answer is likely to be astonishing in it simplicity.",
  "references": [
    "001   BARBERO GJ            IN: PORTER R                    32       968",
    "002   BEARN AG              IN: MANGOS JA                         21 973",
    "003   DANES BS              IN: LAWSON D PROC 5TH INT CF          67 969",
    "004   DANES BS              J EXP MED                      123     1 966",
    "005   DI SANTAGNESE PA      PEDIATRICS                      12   549 953",
    "006   MANGOS JA             PEDIATR RES                      1   436 967",
    "007   SPOCK A               PEDIATR RES                      1   173 967"
  ],
  "citations": []
}