{
  "paperNumber": "78187",
  "recordNumber": "00967",
  "acessionNumber": "78179933",
  "authors": [
    "Katz-S."
  ],
  "title": "Calcium and sodium transport processes in patients with cystic fibrosis 2. Mg2+- dependent, Ca2+ ATPase activity in fibroblast membrane preparations from cystic fibrosis patients and controls.",
  "source": "Res-Commun-Chem-Pathol-Pharmacol. 1978 Mar. 19(3). P 491-503.",
  "majorSubjects": [
    "ADENOSINE-TRIPHOSPHATASE: me",
    "CALCIUM: me",
    "CYSTIC-FIBROSIS: me.",
    "SODIUM: me."
  ],
  "minorSubjects": [
    "ADOLESCENCE",
    "CELL-MEMBRANE: en",
    "CELLS-CULTURED",
    "CHILD.",
    "FIBROBLASTS: en, ul",
    "HUMAN",
    "MAGNESIUM: me, pd."
  ],
  "abstractExtract": "Mg2+-dependent Ca2+-ATPase activity was determined in membrane preparations of fibroblasts grown from skin biopsies of cystic fibrosis patients and age-matched controls. This enzyme was stimulated by increasing free calcium concentrations with an apparent Kdiss for calcium of approximately 45 micron. Although there was a great deal of variation in Ca2+-ATPase activity observed between individual strains, there was a significant decrease in the maximal activation of the Ca2+-ATPase in membrane preparations of fibroblasts obtained from cystic fibrosis patients compared to the controls (P less than 0.05). This observation indicates that decreased Ca2+- ATPase activity is a generalized phenomenon in cystic fibrosis found in more than one cell-type. This decrease in Ca2+-ATPase activity may have a number of implications that may explain some of the manifestations of the disease.",
  "references": [
    "001   BAKER PF              IN: BUTLER JAV                       179 972",
    "002   BARRANCO SC           J CELL PHYSIOL                  88    33 976",
    "003   BETTELHEIM FA         BIOCHIM BIOPHYS ACTA           236   702 971",
    "004   BLOMFIELD J           ARCH DIS CHILD                  48   267 973",
    "005   BLOSTEIN R            J BIOL CHEM                    243  1957 968",
    "006   BOAT TF               PEDIATR RES                      8   531 974",
    "007   BOND GH               BIOCHIM BIOPHYS ACTA           323   592 973",
    "008   CALDWELL PG           IN: CUTHBERT AW                       10 973",
    "009   CHERNICK WS           J PEDIATR                       59   890 961",
    "010   DANES BS              J EXP MED                      129   775 969",
    "011   DI SANTAGNESE PA      N ENGL J MED                   277  1344 967",
    "012   DOUGLAS WW            BR J PHARMACOL                  34   451 968",
    "013   FLETCHER DS           CLIN CHIM ACTA                  44     5 973",
    "014   FORSTNER JF           PEDIATR RES                     10   609 976",
    "015   GIBSON LE             PEDIATRICS                      48   695 971",
    "016   GLYNN IM              BIOCHEM J                       90   147 964",
    "017   KATZ S                CF CLUB ABST                    18     9 977",
    "018   KATZ S                BIOCHIM BIOPHYS ACTA           389   314 975",
    "019   KROOTH RS             MED CLIN NORTH AM               53   795 969",
    "020   LEWIS AE              BIOSTATISTICS                            966",
    "021   LOWRY OH              J BIOL CHEM                    193   265 951",
    "022   MANDEL ID             CLIN PEDIATR                     8   161 969",
    "023   MATALON R             BIOCHEM BIOPHYS RES COMMUN      33   954 968",
    "024   POST RL               METHODS ENZYMOL                 10   762 967",
    "025   QUISSELL DO           NATURE                         247   115 974",
    "026   ROUFOGALIS BD         BIOCHIM BIOPHYS ACTA           318   360 973",
    "027   RUSSELL JM            J GEN PHYSIOL                   63   144 974",
    "028   SCHATZMANN HJ         J PHYSIOL (LOND)               235   551 973",
    "029   SHIGEKAWA M           J BIOL CHEM                    251  6984 976"
  ],
  "citations": [
    "1   ANSAH TA              CELL CALC                        1   195 980",
    "2   ANSAH TA              PROC WEST PHARMACOL SOC         23   389 980",
    "3   THEOHARIDES TC        LIFE SCI                        27   703 980",
    "4   KATZ S                CLIN CHIM ACTA                 100   245 980",
    "5   FODER B               CLIN CHIM ACTA                 104   187 980",
    "6   MALER T               BIOCHIM BIOPHYS ACTA           598     1 980",
    "7   GNEGY ME              BIOCHEM MED                     26   294 981",
    "8   SORSCHER EJ           LANCET                           1   368 982",
    "9   HARRIS A              CLIN CHIM ACTA                 128    41 983",
    "10   KATZ S                CELL CALC                        5   421 984",
    "11   ALLEN BG              CELL CALC                        7   161 986",
    "12   BRIDGES MA            PEDIATR RES                     20   356 986",
    "13   MORRISSEY SM          DIGESTION                       34    28 986"
  ]
}