{
  "paperNumber": "75080",
  "recordNumber": "00246",
  "acessionNumber": "75209073",
  "authors": [
    "Schoni-M",
    "Kaiser-D",
    "Drack-E",
    "Axmacher-U."
  ],
  "title": "Excretion of trypsin-like activity, electrolytes and protein in mixed and parotid saliva of patients with cystic fibrosis of the pancreas.",
  "source": "Eur-J-Clin-Invest. 1975 Apr. 5(2). P 153-8.",
  "majorSubjects": [
    "CYSTIC-FIBROSIS: me",
    "SALIVA: me",
    "TRYPSIN: me."
  ],
  "minorSubjects": [
    "CALCIUM: an",
    "CHILD",
    "CHILD-PRESCHOOL",
    "HUMAN.",
    "HYDROGEN-ION-CONCENTRATION",
    "PAROTID-GLAND: se",
    "PROTEINS: an.",
    "SALIVA: an."
  ],
  "abstractExtract": "The esterolytic activity of mixed and parotid saliva in cystic fibrosis (CF) patients and normal subjects was determined using BAEE (alpha-Benzoyl-1-arginine-ethylester) as the substrate. Using soybean- trypsin-inhibitor the trypsin-like activity (TLA) was measured and plotted as a function of parotid flow rate. In addition calcium, protein and pH were determined. Trypsin-like activity in mixed and parotid saliva showed large individual variations in CF and normal children. In parotid saliva we could not find any significant difference, whereas a reduction of TLA in mixed saliva of CF patients was observed. The fact that our normal values fell within the range of heterozygotes reported by Rao et al. (19), makes their hypothesis of a close relationship between reduced TLA and the genetic defect very doubtful. Protein, calcium and pH increased with augmented salivation and no difference between CF patients and normal age matched children could be found except for the pH at a flow rate above 0.75 ml/min per m2 body surface where significantly lower pH values resulted. The relevance of reduced TLA to the pathogenesis of cystic fibrosis is discussed.",
  "references": [
    "001   BOWMAN BH             SCIENCE                        167   871 970",
    "002   CONOVER JH            PEDIATR RES                      7   220 973",
    "003   FREY EK               KALLIKREIN KININ SYSTEM INH              968",
    "004   GIBSON LE             PEDIATRICS                      48   695 971",
    "005   GUGLER EC             J PEDIATR                       71   585 967",
    "007   HEIDLAND A            KLIN WOCHENSCHR                 50   959 972",
    "008   KAISER D              PEDIATR RES                      5   167 971",
    "009   KAISER D              IN: MANGOS JA                        247 973",
    "010   KAISER D              PFLUEGERS ARCH                 349    63 974",
    "011   KASSELL B             IN: PERTINAUM GE                19   853 970",
    "012   KREUSSER W            EUR J CLIN INVEST                2   398 972",
    "013   LOCKHART LH           SOUTH MED J                     61  1356 968",
    "014   LOURIE RS             AM J DIS CHILD                  65   455 943",
    "015   LOWRY OH              J BIOL CHEM                    193   265 951",
    "016   MANDEL ID             AM J DIS CHILD                 110   646 965",
    "017   MANGOS JA             PEDIATR RES                      2   378 968",
    "018   OUCHTERLONY O         ACTA PATH MICROBIOL SCAND       26   507 949",
    "019   RAO GJS               J PEDIATR                       80   573 972",
    "020   RECTOR FC             J CLIN INVEST                   44   278 965",
    "021   RICK W                METHODS IN ENZYMATIC ANALYSIS        807 965",
    "022   SCHNEYER LH           PHYSIOL REV                     52     3 972",
    "023   SPOCK A               PEDIATR RES                      1   173 967",
    "024   TRAUTSCHOLD I         HOPPE SEYLERS Z PHYSIOL CHEM   325    48 961",
    "025   WALLACH D             EUR J BIOCHEM                   21   433 971",
    "026   WERLE E               BIOCHEM Z                      323   279 952",
    "027   WERLE E               ARZNEIMITTEL FORSCH             18   281 964",
    "028   WERLE E               ARCH INT PHARMACODYN THER      131   257 961",
    "029   WERLE E               BIOCHEM Z                      290   129 937",
    "030   WERLE E               BIOCHEM Z                      301   329 939",
    "031   YOUNG JA              PFLUEGERS ARCH                 319   185 970"
  ],
  "citations": [
    "1   GRIMMEL K             ACTA HEPATOGASTROENTEROL        23   334 976",
    "2   HAUBRICH J            ARCH OTO RHINO LARYNGOL        213     1 976",
    "3   MUNZEL M              ARCH OTO RHINO LARYNGOL        213   209 976",
    "4   CHILLA R              ARCH OTO RHINO LARYNGOL        214   367 977",
    "5   RAO GJS               ENZYME                          23   314 978",
    "6   SLAVOTINEK AH         AUST NZ J MED                   11    91 981",
    "7   KATZ S                CELL CALC                        5   421 984",
    "8   KONARSKA L            J CLIN CHEM CLIN BIOCHEM        23   337 985"
  ]
}