{
  "paperNumber": "79127",
  "recordNumber": "01107",
  "acessionNumber": "79069484",
  "authors": [
    "Hahn-T-J",
    "Squires-A-E",
    "Halstead-L-R",
    "Strominger-D-B."
  ],
  "title": "Reduced serum 25-hydroxyvitamin D concentration and disordered mineral metabolism in patients with cystic fibrosis.",
  "source": "J-Pediatr. 1979 Jan. 94(1). P 38-42.",
  "majorSubjects": [
    "CALCIUM: bl",
    "CYSTIC-FIBROSIS: bl",
    "HYDROXYCHOLECALCIFEROLS: bl."
  ],
  "minorSubjects": [
    "ADOLESCENCE",
    "ADULT",
    "BONE-AND-BONES: me",
    "CALCIUM: ur",
    "CHILD.",
    "CYSTIC-FIBROSIS: me",
    "FEMALE",
    "HUMAN",
    "KIDNEY: me",
    "MALE.",
    "PARATHYROID-HORMONES: bl",
    "SUPPORT-U-S-GOVT-P-H-S."
  ],
  "abstractExtract": "Vitamin D and mineral metabolism were studied in 21 adolescents and young adults with cystic fibrosis and the results were compared to those in 21 matched controls. All CF patients had been maintained on standard multivitamin supplements in combination with pancreatic enzyme replacement. Despite this supplementation, relative to control subjects the CF patients had a 36% reduction in serum 25- hydroxyvitamin D concentration, a slight but significant reduction in serum calcium concentration, evidence of calcium malabsorption with secondary hyperparathyroidism, and a 14% decrease in bone mass measured by the photon absorption technique. Currently accepted modes of pancreatic enzyme replacement and vitamin D supplementation are often inadequate to maintain normal mineral homeostasis in CF patients; additional measurements may be required to reduce the risk of clinically significant osteopenia concomitant with prolonged survival in CF.",
  "references": [
    "001   BENNETT MJ            AM J CLIN NUTR                  20   415 967",
    "002   TORSTENSON OL         PEDIATRICS                      45   857 970",
    "003   GUGLER EC             MOD PROBL PEDIATR               10    95 967",
    "004   DI SANTAGNESE PA      IN: VAUGHAN VC III                   903 975",
    "005   DI SANTAGNESE PA      N ENGL J MED                   295   597 976",
    "006   HAHN TJ               N ENGL J MED                   292   550 974",
    "007   TAUSSIG LM            J PEDIATR                       82   380 973",
    "008   HAHN TJ               J CLIN ENDOCRINOL METAB         39   274 974",
    "009   ANON                  MEDICAL LABORATORY TECHNOLOGY        169 969",
    "010   SLATOPOLSKY E         J CLIN INVEST                   50   492 971",
    "011   HADDAD JG JR          J LAB CLIN MED                  81    22 973",
    "012   KERMACK KA            BIOMETRIKA                      37    30 950",
    "013   SHWACHMAN H           MEDICINE (BALTIMORE)            56   129 977",
    "014   LAPEY A               J PEDIATR                       84   328 974",
    "015   PARSONS JA            CLIN ENDOCRINOL METAB            1    33 972",
    "016   HAHN TJ               DRUGS                           12   201 976",
    "017   REEMTSMA K            PEDIATRICS                      22   525 958",
    "018   ARNAUD SB             PROC SOC EXP BIOL MED          149   570 975",
    "019   THOMPSON GR           J CLIN INVEST                   45    94 966",
    "020   GERTNER JM            BR MED J                         1  1310 977",
    "021   DELUCA HF             J LAB CLIN MED                  87     7 976",
    "022   DI SANTAGNESE PA      PEDIATRICS                      18   387 956",
    "023   TYSON KRT             J PEDIATR SURG                   3   271 968",
    "024   GARABEDIAN M          PROC NAT ACAD SCI USA           69  1673 972",
    "025   SCHNEIDER LE          SCIENCE                        196  1452 977",
    "026   JUBIZ W               J CLIN ENDOCRINOL METAB         44   617 977",
    "027   LACHMAN E             AM J ROENTG RAD THER NUCL MED   74   712 955",
    "028   WILSON CR             NORLAND CAMERON BONE MINERAL             972",
    "029   LEVIN ME              N ENGL J MED                   294   241 976"
  ],
  "citations": [
    "1   AVIOLI LV             CLIN ENDOCRINOL METAB            8   547 979",
    "2   ANON                  NUTR REV                        37   247 979",
    "3   CHASE HP              J PEDIATR                       95   337 979",
    "4   WEISMAN Y             J PEDIATR                       95   416 979",
    "5   MEREDITH SC           CLIN ENDOCRINOL METAB            9   131 980",
    "6   LOVINGER RD           PEDIATRICS                      66   359 980",
    "7   MITCHELL EA           J PEDIATR                       97   789 980",
    "8   PITT MJ               RADIOL CLIN NORTH AM            19   581 981",
    "9   SOLOMONS NW           AM J CLIN NUTR                  34   462 981",
    "10   CONGDEN PJ            ARCH DIS CHILD                  56   708 981",
    "11   COPPENHAVER D         HUM GENET                       57   399 981",
    "12   PARK RW               GASTROENTEROLOGY                81  1143 981",
    "13   LLOYDSTILL JD         J PEDIATR                       99   580 981",
    "14   LEVI N                RIV ITAL PEDIATR                 8   695 982",
    "15   AGUS ZS               KIDNEY INT                      24   113 983",
    "16   KATZ S                CELL CALC                        5   421 984",
    "17   GOTZ M                ATEMWEGS LUNGENKRANKH           10   594 984",
    "18   LOGVINOFF MM          CLIN PEDIATR                    23   389 984",
    "19   HODGES P              J AM DIET ASSOC                 84   664 984",
    "20   HUBBARD VS            SEM RESPIR MED                   6   308 985",
    "21   LO CW                 AM J CLIN NUTR                  42   644 985",
    "22   HANLY JG              Q J MED                         56   377 985",
    "23   FRIEDMAN HZ           GASTROENTEROLOGY                88   808 985",
    "24   REITER EO             J PEDIATR                      106    21 985",
    "25   DODGE JA              ACTA PAEDIATR SCAND SUPPL 317 1985    31 985",
    "26   DUHAMEL JF            ARCH FR PEDIATR                 43   229 986"
  ]
}