{
  "paperNumber": "75179",
  "recordNumber": "00345",
  "acessionNumber": "76033530",
  "authors": [
    "Skude-G."
  ],
  "title": "Sources of the serum isoamylases and their normal range of variation with age.",
  "source": "Scand-J-Gastroenterol. 1975. 10(6). P 577-84.",
  "majorSubjects": [
    "GLYCOSIDE-HYDROLASES: bl",
    "ISOAMYLASE: bl."
  ],
  "minorSubjects": [
    "ADOLESCENCE",
    "ADULT",
    "AGE-FACTORS",
    "CHILD",
    "CHILD-PRESCHOOL.",
    "CYSTIC-FIBROSIS: en",
    "FEMALE",
    "FETUS: en",
    "GENITALIA-FEMALE: en.",
    "HUMAN",
    "INFANT",
    "INFANT-NEWBORN",
    "ISOAMYLASE: ur",
    "KIDNEY: en.",
    "LIVER: en",
    "LUNG: en",
    "MALE",
    "PANCREAS: en",
    "SUBMANDIBULAR-GLAND: en."
  ],
  "abstractExtract": "The isoamylases in various human tissue homogenates and body fluids were separated by agarose gel electrophoresis. Nothing suggested any significant production of amylase in the liver. Minute amounts of amylase belonging to the pancreatic group of isoamylases might be produced by the glands of the proximal duodenum. The specific group of isoamylases produced in the female genital tract could not be demonstrated in serum or urine. The activity of amylase in serum was derived from two groups of isoenzymes, one group originating from the salivary glands, the other from the pancreatic gland. The contribution of each of these two sources to the total serum amylase was determined from early foetal life to adult age. A very low activity of the salivary isoamylases was regularly found in serum from 14-week-old foetuses. The activity increased steadily with age and reached the normal adult level, about 80 U/l, at the age of 5 years. The pancreatic group of isoamylases in serum developed later; the majority of children below 3 months had no demonstrable pancreatic isoamylase activity. The activity rose slowly to reach adult level, about 80 U/l, at the age of 10 to 15 years. The activity did not vary with sex, and the diurnal variation of the isoamylase was negligible. In children with cystic fibrosis of the pancreas the activity of pancreatic isoamylases in serum was low.",
  "references": [
    "001   AMMAN RW              ANN INTERN MED                  78   521 973",
    "002   AW SE                 GUT                              8   402 967",
    "003   BELFIORE F            CLIN CHEM                       18  1403 972",
    "004   BELFIORE F            CLIN CHEM                       19   387 973",
    "005   FARBER S              J CLIN INVEST                   22   827 943",
    "006   GOT R                 CLIN CHIM ACTA                  22   545 968",
    "007   GREEN CL              AM J OBSTET GYNECOL             73   402 957",
    "008   JANOWITZ HD           AM J MED                        27   924 959",
    "009   KAMARYT J             Z KLIN CHEM KLIN BIOCHEM         8   564 970",
    "010   KUTTNER M             PROC SOC EXP BIOL MED           32   564 934",
    "011   LAXOVA R              J MED GENET                      9   321 972",
    "012   LEVITT MD             ANN INTERN MED                  71   919 969",
    "013   LILLIBRIDGE CB        J PEDIATR                       82   279 973",
    "014   MCGEACHIN RL          PROC SOC EXP BIOL MED           99   130 958",
    "015   MAYER WB              BULL JOHNS HOPKINS HOSP         44   246 929",
    "016   MEITES S              CRC CRIT REV CLIN LAB SCI        2   103 971",
    "017   NICORY C              BIOCHEM J                        6   387 922",
    "018   ROSSITER MA           ACTA PAEDIATR SCAND             63   389 974",
    "019   SEARCY RL             PEDIATRICS                      39   294 967",
    "020   SKUDE G               SCAND J CLIN LAB INVEST         35    41 975",
    "021   SOMOGYI M             ARCH INTERN MED                 67   665 941",
    "022   TAKEUCHI T            CLIN CHIM ACTA                  54   137 974",
    "023   VACIKOVA A            J CHROMATOGR                    69   349 972"
  ],
  "citations": [
    "1   SKUDE G               SCAND J GASTROENTEROL           11    21 976",
    "2   SKUDE G               SCAND J GASTROENTEROL           11   525 976",
    "3   SKUDE G               GUT                             17   127 976",
    "4   SKUDE G               ACTA PAEDIATR SCAND             65   145 976",
    "5   SKUDE G               AM J OBSTET GYNECOL            126   652 976",
    "6   WARSHAW AL            LANCET                           1   929 977",
    "7   MERRITT AD            ADV HUM GENET                    8   135 977",
    "8   DONALDSON LA          SCAND J GASTROENTEROL           12   637 977",
    "9   MAGID E               SCAND J GASTROENTEROL           12   621 977",
    "10   SKUDE G               SCAND J GASTROENTEROL           12    53 977",
    "11   SKUDE G               SCAND J GASTROENTEROL           12     3 977",
    "12   WARSHAW AL            J SURG RES                      22   362 977",
    "13   ODONNELL MD           CLIN CHEM                       23   560 977",
    "14   WARSHAW AL            J LAB CLIN MED                  90     1 977",
    "15   DAVIDSON GP           PEDIATR RES                     12   967 978",
    "16   GILLARD BK            PEDIATR RES                     12   868 978",
    "17   KAMARYT J             J CLIN CHEM CLIN BIOCHEM        16   539 978",
    "18   BERK JE               AM J GASTROENTEROL              69   417 978",
    "19   BERK JE               GASTROENTEROLOGY                74  1313 978",
    "20   KENNY D               CLIN CHIM ACTA                  89   429 978",
    "21   HUBBARD VS            J PEDIATR                       92   685 978",
    "22   FORSTNER GG           PEDIATR RES                     13  1077 979",
    "23   DONALDSON LA          GUT                             20   216 979",
    "24   STICKLE JE            AM J VET RES                    41   506 980",
    "25   AGGETT PJ             ARCH DIS CHILD                  55   236 980",
    "26   ODONNELL MD           CLIN CHIM ACTA                 104   265 980",
    "27   KRISTENSEN BO         BR MED J                       281   978 980",
    "28   HAGGMARK A            GASTROENTEROL CLIN BIOL          5   927 981",
    "29   ZANNINO L             RIV ITAL PEDIATR                 7   247 981",
    "30   BOSSUYT PJ            CLIN CHEM                       27   451 981",
    "31   FAHRENKRUG J          CLIN CHEM                       27  1655 981",
    "32   JACOBSON G            SCAND J GASTROENTEROL           17   833 982",
    "33   VONEYBEN FE           J UROL                         128  1195 982",
    "34   MOLLERPETERSEN J      ACTA MED SCAND                 211   459 982",
    "35   HICKS JM              BULL MOL BIOL MED                8   105 983",
    "36   GILLARD BK            CLIN CHEM                       29  1119 983",
    "37   JACOBS E              CLIN CHEM                       29   887 983",
    "38   LEBENTHAL E           J PEDIATR                      102     1 983",
    "39   KOOP H                CLIN GASTROENTEROL              13   739 984",
    "40   OKABE H               CLIN CHEM                       30  1219 984",
    "41   MASIAR PJ             NEOPLASMA                       31   351 984",
    "42   GUERRA EG             REV INVEST CLIN                 36   109 984",
    "43   MORGENSTERN T         MONATSSCHR KINDERHEILKD        132   661 984",
    "44   HUBBARD VS            SEM RESPIR MED                   6   299 985",
    "45   GIBERTINI P           ITAL J GASTROENTEROL            17   211 985",
    "46   CHO JW                ACTA CHIR SCAND                151   323 985",
    "47   FOO AY                ANN CLIN BIOCHEM                23   624 986",
    "48   FUKAYAMA M            DIFFERENTIATION                 31   127 986",
    "49   TSIANOS EB            HEPATOGASTROENTEROLOGY          33   247 986",
    "50   TSIANOS EB            J CLIN PATHOL                   39   464 986",
    "51   BARROS FP             AM J GASTROENTEROL              81   261 986",
    "52   FJOSNE U              ACTA MED SCAND                 219   301 986"
  ]
}