{
  "queryNumber": "95",
  "queryText": "What abnormalities of skeletal muscle function or structure have been found in CF patients?",
  "relevantDocuments": "9",
  "results": [
    [
      "12",
      "0001"
    ],
    [
      "30",
      "2112"
    ],
    [
      "43",
      "0100"
    ],
    [
      "192",
      "0002"
    ],
    [
      "257",
      "1000"
    ],
    [
      "322",
      "0100"
    ],
    [
      "603",
      "2120"
    ],
    [
      "606",
      "2120"
    ],
    [
      "1097",
      "0001"
    ]
  ]
}