{
  "paperNumber": "79045",
  "recordNumber": "01025",
  "acessionNumber": "80087357",
  "authors": [
    "Feery-B-J",
    "Phelan-P-D",
    "Gallichio-H-A",
    "Hampson-A-W."
  ],
  "title": "Antibody responses to influenza virus vaccine in patients with cystic fibrosis.",
  "source": "Aust-Paediatr-J. 1979 Sep. 15(3). P 181-2.",
  "majorSubjects": [
    "ANTIBODIES-VIRAL: im",
    "CYSTIC-FIBROSIS: im",
    "INFLUENZA-VACCINE: im."
  ],
  "minorSubjects": [
    "ADOLESCENCE",
    "ADULT",
    "CHILD",
    "CHILD-PRESCHOOL.",
    "HEMAGGLUTINATION-INHIBITION-TESTS",
    "HUMAN",
    "INFLUENZA-VACCINE: ad.",
    "ORTHOMYXOVIRUSES-TYPE-A: im."
  ],
  "abstractExtract": "Patients with cystic fibrosis were immunized with subunit influenza vaccine and their haemagglutination-inhibiting (HI) antibody responses were compared with responses in young healthy adults. There was no significant difference in the antibody levels reached after immunization and no evidence of any impairment of responses in the patient group.",
  "references": [
    "001   DAVENPORT FM          J EXP MED                       98   641 953",
    "002   ANON                  MED J AUST                       1  1310 970",
    "003   PALMER DF             ADVANCED LABORATORY TECHNIQUE            975"
  ],
  "citations": []
}