{
  "paperNumber": "74049",
  "recordNumber": "00049",
  "acessionNumber": "75008207",
  "authors": [
    "Goodchild-M-C",
    "Sagaro-E",
    "Brown-G-A",
    "Cruchley-P-M",
    "Jukes-H-R.",
    "Anderson-C-M."
  ],
  "title": "Comparative trial of pancrex V forte and nutrizym in treatment of malabsorption in cystic fibrosis.",
  "source": "Br-Med-J. 1974 Sep 21. 3(5933). P 712-4.",
  "majorSubjects": [
    "AMYLASES: tu",
    "BROMELAINS: tu",
    "CYSTIC-FIBROSIS: co",
    "LIPASE: tu.",
    "MALABSORPTION-SYNDROMES: dt",
    "PANCREATIC-EXTRACTS: tu.",
    "PEPTIDE-HYDROLASES: tu",
    "TRYPSIN: tu."
  ],
  "minorSubjects": [
    "ADOLESCENCE",
    "CHILD",
    "CHILD-PRESCHOOL",
    "CLINICAL-TRIALS.",
    "COMPARATIVE-STUDY",
    "DIETARY-FATS: me",
    "DIETARY-PROTEINS: me.",
    "DRUG-COMBINATIONS",
    "FECES: an",
    "FEMALE",
    "HUMAN.",
    "INTESTINAL-ABSORPTION",
    "LIPIDS: an",
    "MALE",
    "UREA: ur."
  ],
  "abstractExtract": "A cross-over trial of pancreatic enzyme replacement therapy has been conducted on 12 children with cystic fibrosis using Pancrex V forte and Nutrizym tablets in equivalent dosage.  No differences were found in the effectiveness of these products as measured by stool volume, number of bowel actions, faecal fat excretion, and urine urea excretion.  Neither product eliminated the steatorrhoea. Though there was no laboratory evidence to support their choice nine patients expressed a preference for Nutrizym at the conclusion of the trial.  This preference was based partly on the smaller number of tablets which are required.",
  "references": [
    "001   ANDERSON CM           LANCET                           1   836 952",
    "002   BONSNES RW            J BIOL CHEM                    158   581 945",
    "003$  COLTINI EP            J NUTR                         103   581 945",
    "004$  FAWCETT JK            J CLIN PATHOL                   13   156 960",
    "005   HARRIS R              ARCH DIS CHILD                  30   424 955",
    "006   KNILL-JONES RP        BR MED J                         4    21 970",
    "007   LAPEY A               J PEDIATR                       84   328 974",
    "008   MATTHEWS LW           PEDIATRICS                      27   351 961",
    "009   ROSS CAC              ARCH DIS CHILD                  30   316 955",
    "010   VAN DE KAMER JH       J BIOL CHEM                    177   347 949"
  ],
  "citations": [
    "1   ALLEN WM              J BIOL STANDARD                  3   267 975",
    "2   WIDHALM K             WIEN KLIN WOCHENSCHR            88   557 976",
    "3   WOOD RE               AM REV RESPIR DIS              113   833 976",
    "4   WEISE J               EUR J PEDIATR                  122   107 976",
    "5   ANON                  LANCET                           2    73 977",
    "6   REGAN PT              LEBER MAGEN DARM                 7   201 977",
    "7   REGAN PT              N ENGL J MED                   297   854 977",
    "8   REGAN PT              MAYO CLIN PROC                  53    79 978",
    "9   REGAN PT              MAYO CLIN PROC                  54   267 979",
    "10   DURIE PR              GUT                             21   778 980",
    "11   GOW R                 LANCET                           2  1071 981",
    "12   CHO YW                J CLIN PHARMACOL                21   224 981",
    "13   CONGDEN PJ            ARCH DIS CHILD                  56   708 981",
    "14   TOLCKMITT W           KLIN PAEDIATR                  193   365 981",
    "15   MITCHELL EA           AUST PAEDIATR J                 18   114 982"
  ]
}