{
  "paperNumber": "75062",
  "recordNumber": "00228",
  "acessionNumber": "85177317",
  "authors": [
    "Warren-C-P",
    "Tai-E",
    "Batten-J-C",
    "Hutchcroft-B-J",
    "Pepys-J."
  ],
  "title": "Cystic fibrosis--immunological reactions to A. fumigatus and common allergens.",
  "source": "Clin-Allergy. 1975 Mar. 5(1). P 1-12.",
  "majorSubjects": [
    "ASPERGILLUS-FUMIGATUS: im",
    "CYSTIC-FIBROSIS: im."
  ],
  "minorSubjects": [
    "ASPERGILLOSIS: im",
    "ASTHMA: im",
    "EOSINOPHILS: im",
    "HAY-FEVER: im.",
    "HUMAN",
    "HYPERSENSITIVITY: im",
    "IGE: an",
    "IMMUNOGLOBULINS: an.",
    "LEUKOCYTE-COUNT",
    "PRECIPITIN-TESTS",
    "SKIN-TESTS."
  ],
  "abstractExtract": "Immunological studies of forty-three patients with cystic fibrosis showed that positive prick tests to at least one common allergen were obtained in 70%, to multiple allergens in 28% and to A. fumigatus in 50%. Specific IgE antibodies against these allergens were found in the appropriate subjects. In spite of this evidence of type 1, IgE, sensitization none of the patients had a history of infantile eczema. Intracutaneous tests with A. fumigatus extract gave types 1 and 3 reactions in sixteen patients (37%), only seven of whom were among the sixteen (37%) who gave positive precipitin tests. Raised levels of total serum IgG and IgA were found as compared with healthy controls and asthmatic subjects. No differences were found in total serum IgM and IgD levels. The high incidence of allergy to A. fumigatus in cystic fibrosis is confirmed.",
  "references": [
    "001   BATTEN JC             MOD PROBL PEDIATR               10   227 967",
    "002   COCHRANE CG           J EXP MED                      134   75S 971",
    "003   CURRAN WS             ANN INTERN MED                  55   777 961",
    "004   DOLOVICH J            J ALLERGY                       46   127 970",
    "005   DOLOVICH J            J ALLERGY CLIN IMMUNOL          52    38 973",
    "006   KATZ RM               N ENGL J MED                   288   233 973",
    "007   LESKOWITZ S           CLIN ALLERGY                     2   237 972",
    "008   LONGBOTTOM JL         J PATHOL BACTERIOL              88   141 964",
    "009   MCCARTHY DS           IN: LAWSON D PROC 5TH INT CF         194 969",
    "010   MCCARTHY DS           CLIN ALLERGY                     1   415 971",
    "011   MEARNS MB             THORAX                          20   385 965",
    "012   MEARNS MB             LANCET                           1   538 967",
    "013   PEPYS J               IN: GELL PGH                             968",
    "014   PEPYS J               PROC INT CONG ALLERGOLOGY        6   221 968",
    "015   PEPYS J               CLIN ALLERGY SUPPL               3   491 973",
    "016   PEPYS J               CLIN ALLERGY                     3   143 973",
    "017   ROWE DS               BULL WHO                        40   613 969",
    "018   SALVAGGIO JE          CLIN ALLERGY                     3    43 973",
    "019   SCADDING JG           SCAND J RESPIR DIS              48   372 967",
    "020   SIMON G               TEACH IN ON CF                           970",
    "021   TADA T                J IMMUNOL                      104   377 970",
    "022   TAYLOR B              LANCET                           2   111 973",
    "023   WIDE L                LANCET                           2  1105 967"
  ],
  "citations": [
    "1   WARNER JO             LANCET                           1   990 976",
    "2   MULLINS J             CLIN ALLERGY                     6   209 976",
    "3   MITCHELLHEGGS P       Q J MED                         45   479 976",
    "4   CLARKE CW             CLIN ALLERGY                     7   527 977",
    "5   WARNER JO             CLIN ALLERGY                     7   385 977",
    "6   SAKULA A              BR J DIS CHEST                  71   295 977",
    "7   TURNER MW             ARCH DIS CHILD                  53   631 978",
    "8   ZAMBIE MF             ANN ALLERGY                     42   290 979",
    "9   HODSON ME             THORAX                          35   801 980",
    "10   TOBIN MJ              THORAX                          35   807 980",
    "11   PRIOR J               BR J DIS CHEST                  74    84 980",
    "12   MATTHEWS WJ           N ENGL J MED                   302   245 980",
    "13   CROMWELL O            LANCET                           2   164 981",
    "14   REEN DJ               CLIN ALLERGY                    11   571 981",
    "15   CLARKE CW             BR J DIS CHEST                  75    15 981",
    "16   MOSS RB               J PEDIATR                       99   215 981",
    "17   ZETTERSTROM O         BR MED J                       283  1215 981",
    "18   SCHIOTZ PO            ACTA PAEDIATR SCAND SUPPL 301 1982    55 982",
    "19   ANON                  LANCET                           2   257 983",
    "20   BIRX DL               ANN ALLERGY                     53   124 984",
    "21   HODSON ME             POSTGRAD MED J                  60   225 984",
    "22   LAUFER P              J ALLERGY CLIN IMMUNOL          73    44 984",
    "23   AUERBACH HS           LANCET                           2   686 985",
    "24   STARKE ID             BR J DIS CHEST                  79   295 985",
    "25   GORDON IJ             J ROY COLL PHYSICIANS LOND      20   206 986",
    "26   PIEDRA P              J PEDIATR                      108   817 986"
  ]
}