{
  "paperNumber": "78066",
  "recordNumber": "00847",
  "acessionNumber": "78213515",
  "authors": [
    "Guy-G-J",
    "Butterworth-J."
  ],
  "title": "Carboxypeptidase A activity of cultured skin fibroblasts and relationship to cystic fibrosis.",
  "source": "Clin-Chim-Acta. 1978 Jul 1. 87(1). P 63-9.",
  "majorSubjects": [
    "CARBOXYPEPTIDASES: me",
    "CYSTIC-FIBROSIS: en",
    "SKIN: en."
  ],
  "minorSubjects": [
    "CARBOXYPEPTIDASES: ai",
    "CELLS-CULTURED",
    "ENZYME-ACTIVATION: de.",
    "FIBROBLASTS: en",
    "HUMAN",
    "KINETICS",
    "LYSOSOMES: en."
  ],
  "abstractExtract": "Properties of carboxypeptidase A of cultured skin fibroblasts from control and cystic fibrosis patients were studied using alpha-N- carbobenzoxy-L-glutamyl-L-tyrosine as substrate. Carboxypeptidase A was inhibited by thiomersal, cyanide, iodoacetate and N- ethylmaleimide in a similar manner for control and cystic fibrosis fibroblasts. Both trypsin and dithiothreitol treatment activated the enzyme, but 1,10-phenanthroline inhibited only in the presence of dithiothreitol. Both Zn2+ and Co2+ reversed this inhibition. Trypsin treatment of carboxypeptidase A produced a form of the enzyme having a higher KM value for both control and cystic fibrosis fibroblasts. Dithiothreitol treatment of control fibroblasts resulted in a form with similar properties to the trypsin activated form, but cystic fibrosis fibroblasts yielded a variant form with even higher KM and Vmax values. Since other properties were similar, it seems likely that this difference reflected binding of a molecule to the enzyme rather than of a defect in the enzyme.",
  "references": [
    "001   BUTTERWORTH J         CLIN CHIM ACTA                  44   295 973",
    "002   BUTTERWORTH J         CLIN GENET                       9   505 976",
    "003   BUTTERWORTH J         CLIN GENET                      12   297 977",
    "004   LOWRY OH              J BIOL CHEM                    193   265 951",
    "005   TAYLOR SL             BIOCHIM BIOPHYS ACTA           341    99 974",
    "006   ROTH M                ANAL CHEM                       43   880 971",
    "007   BOWMAN BH             BIOCHEM BIOPHYS RES COMMUN      64  1310 975",
    "008   RAO GJS               PEDIATR RES                      9   739 975",
    "009   ERLANGER BF           ARCH BIOCHEM BIOPHYS            95   271 961",
    "010   RAO GJS               J PEDIATR                       80   573 972",
    "011   BERGSTROM K           SCIENCE TOOLS                   24     8 977",
    "012   BARRETT AJ            BIOCHEM J                      133   709 973",
    "013   SHAPIRA E             BIOCHEM BIOPHYS RES COMMUN      71   864 976"
  ],
  "citations": [
    "1   BUTTERWORTH J         CLIN CHIM ACTA                  97    39 979",
    "2   BUTTERWORTH J         ANAL BIOCHEM                   106   156 980",
    "3   BUTTERWORTH J         CLIN CHIM ACTA                 108   143 980",
    "4   BUTTERWORTH J         J INHERIT METAB DIS              5     9 982",
    "5   BUTTERWORTH J         CLIN CHIM ACTA                 122    51 982"
  ]
}