{
  "paperNumber": "75067",
  "recordNumber": "00233",
  "acessionNumber": "75207931",
  "authors": [
    "Robinson-P-G",
    "Smith-P-A",
    "Elliott-R-B."
  ],
  "title": "A simple method for the quantitative determination of stool trypsin and chymotrypsin.",
  "source": "Clin-Chim-Acta. 1975 Jul 23. 62(2). P 225-9.",
  "majorSubjects": [
    "CHYMOTRYPSIN: an",
    "FECES: en",
    "TRYPSIN: an."
  ],
  "minorSubjects": [
    "CHILD",
    "CHYMOTRYPSIN: me",
    "CYSTIC-FIBROSIS: en",
    "DUODENUM: en.",
    "HETEROZYGOTE",
    "HUMAN",
    "HYDROGEN-ION-CONCENTRATION",
    "INFANT",
    "METHODS.",
    "TRYPSIN: me."
  ],
  "abstractExtract": "A simple method for the determination of the activity of trypsin and chymotrypsin in stool and duodenal aspirations is described.  The method is based on that described by Barbero et al. (Am. J. Dis. Child., 112 (1966) 536) [1] but utilizes the time for a drop of 0.1 pH unit in the solution, instead of a constant pH titration, to determine enzyme activity.  Results for a number of cystic fibrosis patients and normals compare favorably with the literature.",
  "references": [
    "001   BARBERO GJ            AM J DIS CHILD                 112   536 966",
    "002   SHWACHMAN H           AM J DIS CHILD                  66   418 943",
    "003   SHWACHMAN H           PEDIATRICS                       4   222 949",
    "004   JOHNSTONE DE          PEDIATRICS                       7   483 951",
    "005   GORDON I              BR MED J                         1   463 952",
    "006   HORSFIELD A           J MED LAB TECH                  10    18 952",
    "007   JOHNSTONE DE          AM J DIS CHILD                  84   191 952",
    "008   NEURATH H             CHEM REV                        46    69 950",
    "009   RICHMOND RC           PEDIATRICS                      16   207 955",
    "010   LUNDH G               SCAND J CLIN LAB INVEST          9   229 957",
    "011   GROSSMAN MI           PROC SOC EXP BIOL MED          110    41 962",
    "012   HAVERBACK BJ          GASTROENTEROLOGY                44   588 963",
    "013   DYCK WP               AM J DIG DIS                    10   530 965",
    "014   ROBINSON PG           NZ MED J                        79  1024 974"
  ],
  "citations": [
    "1   ROBINSON PG           ARCH DIS CHILD                  51   301 976",
    "2   CROSSLEY JR           LANCET                           2  1093 977",
    "3   DURR HK               DIGESTION                       17   396 978",
    "4   CONGDON PJ            POSTGRAD MED J                  57   453 981",
    "5   VARIYAM EP            GASTROENTEROLOGY                81   751 981",
    "6   MITCHELL EA           AUST PAEDIATR J                 18   118 982",
    "7   KASPAR P              CLIN CHEM                       30  1753 984",
    "8   LAMI F                AM J GASTROENTEROL              79   697 984",
    "9   JUNGE W               CLIN BIOCHEM                    19   323 986"
  ]
}