{
  "queryNumber": "41",
  "queryText": "Is Vitamin D metabolism normal in CF patients?",
  "relevantDocuments": "15",
  "results": [
    [
      "46",
      "0100"
    ],
    [
      "296",
      "0100"
    ],
    [
      "301",
      "0100"
    ],
    [
      "322",
      "0010"
    ],
    [
      "370",
      "0100"
    ],
    [
      "392",
      "1000"
    ],
    [
      "603",
      "2221"
    ],
    [
      "941",
      "0001"
    ],
    [
      "998",
      "1010"
    ],
    [
      "1106",
      "2222"
    ],
    [
      "1107",
      "2222"
    ],
    [
      "1108",
      "2222"
    ],
    [
      "1115",
      "1122"
    ],
    [
      "1184",
      "0010"
    ],
    [
      "1190",
      "2222"
    ]
  ]
}