{
  "paperNumber": "74010",
  "recordNumber": "00010",
  "acessionNumber": "74154352",
  "authors": [
    "Burnell-R-H",
    "Robertson-E-F."
  ],
  "title": "Cystic fibrosis in a patient with Kartagener syndrome.",
  "source": "Am-J-Dis-Child. 1974 May. 127(5). P 746-7.",
  "majorSubjects": [
    "CYSTIC-FIBROSIS: co",
    "KARTAGENER-TRIAD: co."
  ],
  "minorSubjects": [
    "CASE-REPORT",
    "CHLORIDES: an",
    "HUMAN",
    "INFANT",
    "LUNG: ra",
    "MALE.",
    "SITUS-INVERSUS: co, ra",
    "SODIUM: an",
    "SWEAT: an."
  ],
  "abstractExtract": "A patient exhibited the features of both Kartagener syndrome and cystic fibrosis.  At most, to the authors\u0027 knowledge, this represents the third such report of the combination.  Cystic fibrosis should be excluded before a diagnosis of Kartagener syndrome is made.",
  "references": [
    "001   KARTAGENER M          BEITR KLIN TUBERK               83   489 933",
    "002   SCHWARZ V             ARCH DIS CHILD                  43   695 968",
    "003   MACE JW               CLIN PEDIATR                    10   285 971",
    "004   ANDERSEN DH           AM J DIS CHILD                  56   344 938",
    "005   DI SANTAGNESE PA      IN: NELSON WE                        856 969",
    "006   MILLER RD             CHEST                           62   130 972",
    "007   KARTAGENER M          ARCH PEDIATR                    79   193 962",
    "008   KATSUHARA K           CHEST                           61    56 972",
    "009   CHURCHILL ED          J THORAC SURG                   18   279 949",
    "010   LOGAN WD              DIS CHEST                       48   613 965",
    "011   BROWN NM              BR MED J                         2   725 959",
    "012   CALICETI G            OTORINOLARINGOL ITAL            30    18 961"
  ],
  "citations": [
    "1   BOCHKOVA DN           GENETIKA (SOVIET GENETICS)      11   154 975",
    "2   WOOD RE               AM REV RESPIR DIS              113   833 976",
    "3   MOSSBERG B            MT SINAI J MED                  44   837 977",
    "4   ROTT HD               HUM GENET                       46   249 979",
    "5   BOWMAN BH             HUM HERED                       31   248 981",
    "6   AFZELIUS BA           CRC CRIT REV BIOCHEM            19    63 985"
  ]
}