{
  "paperNumber": "76004",
  "recordNumber": "00359",
  "acessionNumber": "77084757",
  "authors": [
    "Waring-W-W."
  ],
  "title": "Current management of cystic fibrosis.",
  "source": "Adv-Pediatr. 1976. 23. P 401-38. (REVIEW).",
  "majorSubjects": [
    "CYSTIC-FIBROSIS: th."
  ],
  "minorSubjects": [
    "ADOLESCENCE",
    "ADULT",
    "AEROSOLS",
    "AMYLASES: tu.",
    "BRONCHODILATOR-AGENTS: tu",
    "CALORIC-INTAKE",
    "CHILD",
    "CHILD-PRESCHOOL.",
    "CYSTIC-FIBROSIS: dh, di, dt",
    "DIETARY-FATS",
    "DIETARY-PROTEINS.",
    "DRAINAGE",
    "HUMAN",
    "INFANT",
    "IRRIGATION",
    "LIPASE: tu.",
    "PARENTERAL-FEEDING",
    "PEPTIDE-HYDROLASES: tu",
    "REVIEW",
    "TRIGLYCERIDES.",
    "SUPPORT-U-S-GOVT-NON-P-H-S",
    "VITAMINS: tu",
    "WATER."
  ],
  "abstractExtract": "Although forty years have passed since the discovery of the clinical entity called (for lack of a better name) cystic fibrosis, its treatment remains both symptomatic and controversial.  Moreover, the efficacy of therapy has been difficult to evaluate for several reasons: the lack of a suitable animal model for therapeutic experimentation, the protean manifestations of the disease, the natural variations in its severity, the prolonged periods of observation that are required by its very chronicity and frequently the lack of satisfactory clinical parameters by which to score response.  Stated in its simplest form, the treatment of cystic fibrosis is directed towards the long-term control of salt loss, malabsorption and bronchial obstruction, the management of several complications of the disease and the establishment of a positive therapeutic environment that minimizes anxiety and depression.  The purpose of this review are to help the pediatric practitioner gain security in his day-to-day management of children with the disease and to advocate an effective working relationship between the practitioner and a regional cystic fibrosis or pediatric pulmonary center for long-term patient management.  Problems in diagnosis, treatment of salt loss, the prevention and treatment of malabsorption, the prevention and treatment of bronchial obstruction, the prevention and treatment of certain complications, and the psychosocial support of the patient and family are discussed.",
  "references": [
    "001   SARSFIELD JK          ARCH DIS CHILD                  50   463 975",
    "002   WARING WW             AM REV RESPIR DIS              104   166 971",
    "003   GIBSON LE             CLIN PEDIATR                    12   450 973",
    "004   GIBSON LE             PEDIATRICS                      23   545 959",
    "005   ANON                  GAP CONF REP PROB SWEAT TESTI            975",
    "006   ANON                  STUDY EVAL OF TEST FOR CF                975",
    "007   ANON                  GUIDE TO DIAGNOSIS AND MANAGE            971",
    "008   HUANG NN              GUIDE TO DRUG THERAPY IN PATI            974",
    "009   ANON                  CF Q ANNOTATED REFERENCES",
    "010   ANON                  DIRECTORY OF CF CARE TEACHING",
    "011   SHWACHMAN H           IN: SHIRKEY HC                       651 975",
    "012   CROZIER DN            PEDIATR CLIN NORTH AM           21   935 974",
    "013   ANON                  AM REV RESPIR DIS PART 2       110     1 974",
    "014   MANGOS JA             SCIENCE                        158   135 967",
    "015   BERGNER A             PEDIATRICS                      55   814 975",
    "016   DOLAN TF JR           AM REV RESPIR DIS              110   812 974",
    "017   WARING WW             MINI GUIDE TO LUNG DISEASE     1-4",
    "018   ALLAN JD              AM J DIS CHILD                 126    22 973",
    "019   KUO PT                J CLIN INVEST                   44  1924 965",
    "020   GRACEY M              ARCH DIS CHILD                  44   401 969",
    "021   GRACEY M              ARCH DIS CHILD                  45   445 970",
    "022   OURSO SR              MINI GUIDE TO LUNG DISEASE       8",
    "023   OURSO SR              MORE COOKING TREASURES                   976",
    "024   BARCLAY RPC           ARCH DIS CHILD                  50   490 975",
    "025   MICHENER WM           PEDIATR CLIN NORTH AM           17   373 970",
    "026   FOX HA                PEDIATRICS                      52    14 973",
    "027   HARRIS JA             RESPIR CARE                     20  1164 975",
    "028   MELLINS RB            AM REV RESPIR DIS SUPPL        110   137 974",
    "029   MOTOYAMA EK           IN: MANGOS JA                        335 973",
    "030   LORIN MI              AM J PHYS MED                   50   215 971",
    "031   DENTON R              DIS CHEST                       28   123 955",
    "032   MATTHEWS LW           J PEDIATR                       65   558 964",
    "033   MATTHEWS LW           PEDIATRICS                      39   176 967",
    "034   DOERSHUK CF           PEDIATRICS                      41   723 968",
    "035   WOLFSDORF J           PEDIATRICS                      43   799 969",
    "036   BAU SK                PEDIATRICS                      48   605 971",
    "037   ALDERSON PO           J PEDIATR                       84   479 974",
    "038   NORMAN AP             PRACTITIONER                   206   786 971",
    "039   WARING WW             PEDIATR RES                      6   431 972",
    "040   CHANG N               AM REV RESPIR DIS              107   672 973",
    "041   ROSENBLUTH M          CLIN RES                        19   805 971",
    "042   MOTOYAMA EK           PEDIATRICS                      50   299 972",
    "043   MATTHEWS LW           IN: MANGOS JA                        303 973",
    "044   GIBSON LE             AM REV RESPIR DIS SUPPL        110   100 974",
    "045   CHANG N               AM REV RESPIR DIS              106   867 972",
    "046   LAWSON D              BR MED J                         1   317 965",
    "047   SOLOMONS CC           PEDIATRICS                      47   384 971",
    "048   LIEBERMAN J           JAMA                           205   312 968",
    "049   WILLIAMS MH JR        AM REV RESPIR DIS SUPPL        110   122 974",
    "050   KULCZYCKI LL          PROC INT CONG PEDIATR 13TH           577 971",
    "051   RUCKER RW             CF CLUB ABST                             974",
    "052   HACKETT RR            ANESTHESIOLOGY                  26   248 965",
    "053   RAMIREZ RJ            ANN INTERN MED                  63   819 965",
    "054   KYLSTRA JA            AM REV RESPIR DIS              103   651 971",
    "055   MUGGENBURG BA         J APPL PHYSIOL                  38   922 975",
    "057   CEZEAUX G JR          JAMA                           199    15 967",
    "058   BRAUNSTEIN MS         CHEST                           66    96 974",
    "059   HUBER GL              AM REV RESPIR DIS              104   337 971",
    "060   MUGGENBURG BA         AM REV RESPIR DIS              106   219 972",
    "061   LAWSON D              IN: LAWSON D PROC 5TH INT CF         225 969",
    "062   MARKS MI              J PEDIATR                       79   822 971",
    "063   HAWLEY HB             CURR THER RES                   16   414 974",
    "064   HOFF GE               SCAND J INFECT DIS               6   333 974",
    "065   STERN RC              CLIN PEDIATR                    11   521 972",
    "066   RUCKER RW             PEDIATRICS                      54   358 974",
    "067   LIFSCHITZ MI          AM J DIS CHILD                 116   633 968",
    "068   STOWE SM              AM REV RESPIR DIS              111   611 975",
    "069   ROYCE SW              PEDIATRICS                       8   255 951",
    "070   MONSET-COUCHARD M     CURR PROB PEDIATR NO 4           5       975",
    "071   SYMCHYCH PS           ARCH PATHOL                     92   409 971",
    "072   WHITMAN V             PEDIATRICS                      55    83 975",
    "073   KELMINSON LL          PEDIATRICS                      39    24 967",
    "074   PATTERSON PR          PSYCHOSOCIAL ASPECTS OF CF               973"
  ],
  "citations": [
    "1   STERN RC              AM REV RESPIR DIS              118   821 978",
    "2   ROSENSTEIN BJ         JAMA                           240  1987 978",
    "3   HOLSCLAW DS           CLIN CHEST MED                   1   407 980",
    "4   SACK J                ISR J MED SCI                   16   417 980",
    "5   CHRYMKO M             AM J HOSP PHARM                 37   713 980",
    "6   GOTZ M                EUR J RESPIR DIS                61   122 980",
    "7   PASSERO MA            CLIN PEDIATR                    20   264 981",
    "8   LAUGHLIN JJ           PEDIATRICS                      68   203 981",
    "9   DAVID TJ              LANCET                           2  1204 982",
    "10   MITCHELL EA           AUST PAEDIATR J                 18    40 982",
    "11   THOMASSEN MJ          J PEDIATR                      104   352 984",
    "12   KUHN RJ               CLIN PHARMACY                    4   555 985"
  ]
}