{
  "paperNumber": "75073",
  "recordNumber": "00239",
  "acessionNumber": "76002085",
  "authors": [
    "Grossman-M-L."
  ],
  "title": "The psychosocial approach to the medical management of patients with cystic fibrosis.",
  "source": "Clin-Pediatr (Phila). 1975 Sep. 14(9). P 830-3.",
  "majorSubjects": [
    "ADAPTATION-PSYCHOLOGICAL",
    "CYSTIC-FIBROSIS: th."
  ],
  "minorSubjects": [
    "ADOLESCENCE",
    "AMBULATORY-CARE",
    "ANXIETY-SEPARATION.",
    "ATTITUDE-TO-DEATH",
    "ATTITUDE-TO-HEALTH",
    "CHILD-PSYCHIATRY",
    "CHILD.",
    "CHILD-HOSPITALIZED",
    "CHILD-PRESCHOOL",
    "DEFENSE-MECHANISMS",
    "HUMAN.",
    "IDENTITY-CRISIS",
    "INFANT",
    "INFANT-NEWBORN",
    "LIFE-STYLE.",
    "PARENT-CHILD-RELATIONS",
    "PROFESSIONAL-PATIENT-RELATIONS.",
    "REFERRAL-AND-CONSULTATION",
    "STRESS-PSYCHOLOGICAL."
  ],
  "abstractExtract": "It is most important to deal with the feelings of the child and his family in regard to cystic fibrosis.  Genuine recognition of feelings by the pediatric staff can go a long way toward reassuring family members that their long-standing burden and suffering are being validated and understood.  When a family manifests early signs of difficulty in coping with the emotional and physical stress imposed by cystic fibrosis, it is helpful to refer them to a child psychiatrist for consultation.  It is primarily the families at high risk for breakdown which most require early prevention and intervention.  The role of the pediatrician as the primary clinician is crucial.  It is he who must provide the support and understanding that are integral parts of the primary prevention of emotional decompensation in this disorder.",
  "references": [
    "001   BOWLBY J              MATERNAL CARE AND MENTAL HEAL            952",
    "002   BOWLBY J              INT J PSYCHOANAL                41    89 960",
    "003   TISZA VB              J AM ACAD CHILD PSYCHIAT         9   515 970",
    "004   SPITZ RA              PSYCHOANALYT STUDY CHILD         2   313 946",
    "005   BERGMANN T            CHILDREN IN THE HOSPITAL                 965",
    "006   PRUGH DG              AM J ORTHOPSYCHIATRY            23    70 953",
    "007   PIAGET J              SIX PSYCHOLOGICAL STUDIES                967",
    "008   ERIKSON EH            IDENTITY AND THE LIFE CYCLE              959",
    "009   MCCOLLUM AT           J PEDIATR                       77   571 970",
    "010   LEVY DM               MATERNAL OVERPROTECTION                  943",
    "011   PRUGH DG              IN: FREEDMAN AM                      181 971",
    "012   CAPLAN G              PRINCIPLES OF PREVENTIVE PSYC            964"
  ],
  "citations": []
}