{
  "paperNumber": "78095",
  "recordNumber": "00876",
  "acessionNumber": "78241012",
  "authors": [
    "Sahu-S",
    "Lynn-W-S."
  ],
  "title": "Lipid composition of sputum from patients with asthma and patients with cystic fibrosis.",
  "source": "Inflammation. 1978 Mar. 3(1). P 27-36.",
  "majorSubjects": [
    "ASTHMA: me",
    "CYSTIC-FIBROSIS: me",
    "LIPIDS: an",
    "SPUTUM: an."
  ],
  "minorSubjects": [
    "ADOLESCENCE",
    "ADULT",
    "CHILD",
    "FATTY-ACIDS: an",
    "GLYCOLIPIDS: an.",
    "HUMAN",
    "PHOSPHOLIPIDS: an",
    "PULMONARY-SURFACTANT: an.",
    "SUPPORT-U-S-GOVT-P-H-S."
  ],
  "abstractExtract": "Lipids from the sputum of patients with asthma and with cystic fibrosis were isolated and characterized. In both cases, lipids constituted approximately 30% of the dry material. Phosphatidlycholine was the most abundant lipid, Significant amounts of phosphatidylethanolamine and phosphatidylglycerol were present. Hexosyl ceramides, sphingomyelin, phosphatidylinositol, lysophosphatidylcholine, and lysophosphatidylethanolamine were present as minor lipid components. Apperciable quantities of neutral lipids were present, of which triglycerides and cholesterol were the main constituents. Phosphatidylcholine, sphingomyelin, and phosphatidylgycerol were highly saturated. Large amounts of phosphatidylcholine containing mostly palmitic acid, particularly in the asthmatic sputum, suggest htat this highly saturated. Large amounts of phosphatidylcholine containing mostly palmitic acid, particularly in the asthmatic sputum, suggests that this highly saturated phospholipid is synthesized in the upper airways for reasons other than its beneficial surface-active properties in the alveoli.",
  "references": [
    "001   CHERNICK WS           PEDIATRICS                      24   739 959",
    "002   MATTHEWS LW           AM REV RESPIR DIS               88   199 963",
    "003   RAMIREZ RJ            AM J MED                        45   502 968",
    "004   LEWIS RW              LIPIDS                           6   859 971",
    "005   SAHU S                AM REV RESPIR DIS              114   177 976",
    "006   SAHU S                AM REV RESPIR DIS              115   233 977",
    "007   GALLAI-HATCHARD JJ    BIOCHIM BIOPHYS ACTA           116   532 966",
    "008   ADAMS EP              CHEM PHYS LIPIDS                 1   368 967",
    "009   FOLCH J               J BIOL CHEM                    226   497 957",
    "010   ROUSER G              IN: MARINETTI GV                 1    99 967",
    "011   ESSELMAN WJ           METHODS ENZYMOL                 28   140 972",
    "012   VIOQUE E              J AM OIL CHEM SOC               39    63 962",
    "013   SKIPSKI VP            METHODS ENZYMOL                 14   530 969",
    "014   DITMER JC             METHODS ENZYMOL                 14   482 969",
    "015   ROONEY SA             J LIPID RES                     16   418 975",
    "016   TARLOV AR             J BIOL CHEM                    240    49 965",
    "017   BARTLETT GR           J BIOL CHEM                    234   466 959",
    "018   FARKAS J              J LIPID RES                     14   344 973",
    "019   VANHANDEL E           J LAB CLIN MED                  50   152 957",
    "020   RUDEL LL              J LIPID RES                     14   364 973",
    "021   LAUTER CJ             J LIPID RES                      3   136 962",
    "022   TAO RVP               J LIPID RES                     14    16 973",
    "023   BAXTER CF             LIPIDS                           4   243 969",
    "024   HEPPLESTON AG         BR J EXP PATHOL                 55   384 974",
    "025   BODY DR               LIPIDS                           6   625 971",
    "026   HURST DJ              RESPIR PHYSIOL                  17    72 973",
    "027   ROONEY SA             BIOCHIM BIOPHYS ACTA           360    56 974",
    "028   GRAY GM               BIOCHIM BIOPHYS ACTA           144   519 967",
    "029   HENDERSON RF          LIPIDS                           7   492 972",
    "030   KING RJ               AM J PHYSIOL                   224   788 973",
    "031   GODINEZ RI            BIOCHEMISTRY                    14   830 975",
    "032   HALLMAN M             J LIPID RES                     17   257 976",
    "033   KLAUS MH              PROC NAT ACAD SCI USA           47  1858 961",
    "034   CLEMENTS JA           SCIENCE                        169   603 970"
  ],
  "citations": [
    "1   GALABERT C            CLIN RESP PHYSIOL               17   197 981",
    "2   HARPER TB             AM REV RESPIR DIS              126   540 982",
    "3   SLAYTER HS            EUR J BIOCHEM                  142   209 984"
  ]
}