{
  "paperNumber": "74026",
  "recordNumber": "00026",
  "acessionNumber": "74109135",
  "authors": [
    "Lieberman-J."
  ],
  "title": "Plasma arginine esterase activity in cystic fibrosis.",
  "source": "Am-Rev-Respir-Dis. 1974 Mar. 109(3). P 399-401.",
  "majorSubjects": [
    "CYSTIC-FIBROSIS: en",
    "ESTERASES: bl."
  ],
  "minorSubjects": [
    "ACIDS",
    "ADOLESCENCE",
    "ADULT",
    "ARGININE",
    "CHLOROFORM.",
    "ENZYME-ACTIVATION",
    "HUMAN",
    "MIDDLE-AGE",
    "TRYPSIN-INHIBITORS."
  ],
  "abstractExtract": "Plasma arginine esterase activity was measured in 13 young adult patients with cystic fibrosis and in 36 control subjects.  The enzyme was activated by treating the plasma with chloroform and ellagic acid in the manner described by Rao and associates (1).  No difference was found either between the arginine esterase activities of the patients with cystic fibrosis and the control subjects, or between the degrees of activity inhibited by soybean trypsin inhibitor.  Thus, the findings of Rao and associates of a deficiency of arginine esterase activity in the plasma of patients with cystic fibrosis were not confirmed.",
  "references": [
    "001   RAO GJS               SCIENCE                        177   610 972",
    "002   CAUDILL M             LANCET                           2   307 973",
    "003   RAO GJS               J PEDIATR                       80   573 972",
    "004   LIEBERMAN J           PEDIATR RES                      3   571 969",
    "005   CHERNICK WS           J PEDIATR                       65   694 964"
  ],
  "citations": [
    "1   COBURN MD             AM REV RESPIR DIS              110   368 974",
    "2   ALTLAND K             HUM GENET                       28   207 975",
    "3   ALHADEFF JA           CLIN GENET                      10    63 976",
    "4   BOWMAN BH             LIFE SCI                        19  1289 976",
    "5   BOWMAN BH             TEX REP BIOL MED                34     1 976",
    "6   CHANGUS JE            ARCH PATHOL LAB MED            100     7 976",
    "7   WOOD RE               AM REV RESPIR DIS              113   833 976",
    "8   DISANTAGNESE PA       N ENGL J MED                   295   597 976",
    "9   CALLAHAN JW           PEDIATR RES                     11  1166 977",
    "10   COLMAN RW             THROMB HAEMOST                  38   751 977",
    "11   CHAN KYH              CLIN CHIM ACTA                  74    71 977",
    "12   ROMEO G               NATURE                         274   909 978",
    "13   ROMEO G               PEDIATR RES                     13  1030 979",
    "14   JAKEL HP              BIOL ZENTRALBL                  98    55 979",
    "15   PARSONS M             CLIN CHIM ACTA                 100   215 980",
    "16   BURY AF               PEDIATR RES                     16   613 982",
    "17   BRIDGES MA            ANN NY ACAD SCI                421   360 983"
  ]
}