{
  "paperNumber": "79126",
  "recordNumber": "01106",
  "acessionNumber": "79069499",
  "authors": [
    "Hubbard-V-S",
    "Farrell-P-M",
    "di-SantAgnese-P-A."
  ],
  "title": "25-Hydroxycholecalciferol levels in patients with cystic fibrosis.",
  "source": "J-Pediatr. 1979 Jan. 94(1). P 84-6.",
  "majorSubjects": [
    "CYSTIC-FIBROSIS: bl",
    "HYDROXYCHOLECALCIFEROLS: bl."
  ],
  "minorSubjects": [
    "HUMAN",
    "VITAMIN-D: ad."
  ],
  "abstractExtract": "Assessment of the status of circulating vitamin D in cystic fibrosis patients was investigated by determining serum levels of 25-hydroxycholecalciferol.  The majority of the patients with CF and pancreatic insufficiency had levels of 25-OH-D within the normal range.  Clinical symptoms or pathologic signs resulting from deficiencies of vitamins A and E in patients with CF have been repeatedly documented.  In contrast, a paradoxical lack of vitamin D deficiency signs has been observed in CF patients.  This is especially puzzling since rickets had been commonly associated with most other forms of steatorrhea.  We can only speculate why rickets was formerly rarely reported in association with CF.  Perhaps because of voracious appetites and the selective absorption of vitamin D via the lymphatics without requiring esterification, these individuals were spared clinical rickets.",
  "references": [
    "001   DI SANTAGNESE PA      AM J MED                        21   406 956",
    "002   OPPENHEIMER EH        BULL JOHNS HOPKINS HOSP         98   353 956",
    "003   ANDERSEN DH           J PEDIATR                       15   763 939",
    "004   PARSONS LG            ARCH DIS CHILD                   2   198 927",
    "005   WEBER A               PEDIATRICS                      50    73 972",
    "006   TAUSSIG LM            J PEDIATR                       82   380 973",
    "007   BELSEY RE             J CLIN ENDOCRINOL METAB         38  1046 974",
    "008   FARRELL PM            PEDIATR RES                     11   443 977",
    "009   ARNAUD SB             PEDIATRICS                      57   221 976",
    "010   HADDAD JG JR          NATURE                         244   515 973",
    "011   THOMPSON GR           J CLIN INVEST                   45    94 966",
    "012   BLOMSTRAND R          ACTA CHEM SCAND                 21  1662 967"
  ],
  "citations": [
    "1   ANON                  NUTR REV                        37   247 979",
    "2   CHASE HP              J PEDIATR                       95   337 979",
    "3   WEISMAN Y             J PEDIATR                       95   416 979",
    "4   MEREDITH SC           CLIN ENDOCRINOL METAB            9   131 980",
    "5   SOLOMONS NW           AM J CLIN NUTR                  34   462 981",
    "6   CONGDEN PJ            ARCH DIS CHILD                  56   708 981",
    "7   COPPENHAVER D         HUM GENET                       57   399 981",
    "8   PARK RW               GASTROENTEROLOGY                81  1143 981",
    "9   LOGVINOFF MM          CLIN PEDIATR                    23   389 984",
    "10   HUBBARD VS            SEM RESPIR MED                   6   308 985",
    "11   HANLY JG              Q J MED                         56   377 985",
    "12   REITER EO             J PEDIATR                      106    21 985",
    "13   DODGE JA              ACTA PAEDIATR SCAND SUPPL 317 1985    31 985",
    "14   DUHAMEL JF            ARCH FR PEDIATR                 43   229 986"
  ]
}