{
  "paperNumber": "79116",
  "recordNumber": "01096",
  "acessionNumber": "79153525",
  "authors": [
    "Herrod-H-G",
    "Amos-D-B",
    "Spock-A."
  ],
  "title": "HLA determinants in families with more than one member with cystic fibrosis [letter].",
  "source": "J-Pediatr. 1979 Apr. 94(4). P 676.",
  "majorSubjects": [
    "ANTIGENIC-DETERMINANTS",
    "CYSTIC-FIBROSIS: fg",
    "HLA-ANTIGENS."
  ],
  "minorSubjects": [
    "CYSTIC-FIBROSIS: im",
    "HUMAN."
  ],
  "abstractExtract": "Attempts to identify the carrier state for cystic fibrosis (CF) or to make a prenatal diagnosis of CF have been unsuccessful.  One approach to this problem is to look for associations between known genetic markers and the locus for CF.  In general these studies have looked at the frequency of HLA types in patients with CF and have failed to demonstrate a strong association.  We attempted to look for linkage between HLA haplotypes and CF in families with more than one affected member.  The segregation of HLA in these affected sibpairs vary little from the expected.  Although the sample size is small, it is unlikely that a close linkage exists between the HLA loci and the CF locus.",
  "references": [
    "001   LAMM LU               ANN HUM GENET                   38   383 975",
    "002   GOODCHILD MC          J MED GENET                     13   417 976",
    "003   AMOS DB               IN: ROSE NR                          797 976",
    "004   HERROD HG             J PEDIATR                       91   276 977"
  ],
  "citations": [
    "1   ANON                  LANCET                           2   249 985",
    "2   MOSS RB               MONOGR ALLERGY                  19   202 986"
  ]
}