{
  "paperNumber": "77024",
  "recordNumber": "00606",
  "acessionNumber": "78038523",
  "authors": [
    "Keens-T-G",
    "Krastins-I-R",
    "Wannamaker-E-M",
    "Levison-H",
    "Crozier-D-N.",
    "Bryan-A-C."
  ],
  "title": "Ventilatory muscle endurance training in normal subjects and patients with cystic fibrosis.",
  "source": "Am-Rev-Respir-Dis. 1977 Nov. 116(5). P 853-60.",
  "majorSubjects": [
    "CYSTIC-FIBROSIS: pp",
    "MUSCLES: pp."
  ],
  "minorSubjects": [
    "ADOLESCENCE",
    "ADULT",
    "EXERTION",
    "HUMAN.",
    "PHYSICAL-EDUCATION-AND-TRAINING",
    "PHYSICAL-ENDURANCE",
    "RESPIRATION.",
    "RESPIRATORY-FUNCTION-TESTS: is, mt",
    "TIME-FACTORS."
  ],
  "abstractExtract": "Ventilatory muscles can become fatigued, and this can contribute to respiratory failure. Patients with chronic obstructive lung disease may benefit from improving their ventilatory muscle endurance to improve resistance to fatigue. Ventilatory muscle endurance was measured in 30 normal subjects and 55 patients with cystic fibrosis by finding the highest level of normocapnic hyperpnea that could be sustained for 15 min. Subjects with cystic fibrosis had 36 per cent higher ventilatory muscle endurance than normal subjects, reflecting the chronic training stress of breathing against increased respiratory loads. Four normal subjects and 4 subjects with cystic fibrosis participated in a specific ventilatory muscle endurance training program consisting of 25 min per day of maximal normocapnic hyperpnea 5 days per week for 4 weeks. The cystic fibrosis patients who trained improved their ventilatory muscle endurance by 51.6 per cent, whereas the normal subjects who trained showed a 22.1 per cent increase in ventilatory muscle endurance. Seven subjects with cystic fibrosis participated in a 4-week physical activity training program consisting of at least 1.5 hours per day of intensive swimming and canoeing at summer camp. They increased their ventilatory muscle endurance by 56.7 per cent. There were no other pulmonary function changes. Ventilatory muscle endurance can be readily improved in cystic fibrosis equally well by specific ventilatory muscle endurance exercise.",
  "references": [
    "001   ROUSSOS CS            PHYSIOLOGIST                    19   345 976",
    "002   LEITH DE              J APPL PHYSIOL                  41   508 976",
    "003   ZOCCHE GP             J APPL PHYSIOL                  15  1073 960",
    "004   TENNEY SM             RESPIR PHYSIOL                   5   187 968",
    "005   FREEDMAN S            RESPIR PHYSIOL                   8   230 970",
    "006   LEVISON H             J APPL PHYSIOL                  25    21 968",
    "007   CLARK TJH             CLIN SCI                        36   307 969",
    "008   POTTER WA             J CLIN INVEST                   50   910 971",
    "009   ASTRAND PO            J APPL PHYSIOL                   7   218 954",
    "010   SNEDECOR GW           STATISTICAL METHODS                      974",
    "011   LANDAU LI             AM REV RESPIR DIS              111   725 975",
    "012   LIEBERMAN DA          AM J PHYSIOL                   222   556 972",
    "013   SANTAMBROGIO A        RESPIR PHYSIOL                  10   236 970",
    "014   KEENS TG              FED PROC                        36   614 977",
    "015   PAEZ PN               AM REV RESPIR DIS               95   944 967"
  ],
  "citations": [
    "1   DERENNE JP            AM REV RESPIR DIS              118   119 978",
    "2   PERESS L              BULL EUR PHYSIOPATH RESP        15    91 979",
    "3   ROCHESTER DF          BULL EUR PHYSIOPATH RESP        15   951 979",
    "4   SMIDT U               BULL EUR PHYSIOPATH RESP        15    95 979",
    "5   GURWITZ D             PEDIATR CLIN NORTH AM           26   603 979",
    "6   KEENS TG              PEDIATR CLIN NORTH AM           26   517 979",
    "7   ANDERSEN JB           SCAND J RESPIR DIS              60   151 979",
    "8   MACKLEM PT            AM REV RESPIR DIS              119    93 979",
    "9   GROSS D               AM J MED                        68    27 980",
    "10   COATES AL             ACTA PAEDIATR SCAND             69   353 980",
    "11   BELMAN MJ             AM REV RESPIR DIS              121   273 980",
    "12   CAMPBELL JA           AM REV RESPIR DIS              122   679 980",
    "13   ROCHESTER DF          AM REV RESPIR DIS              122   133 980",
    "14   HUBBARD VS            AM J DIS CHILD                 134   317 980",
    "15   MOSER KM              ARCH INTERN MED                140  1596 980",
    "16   ZACH MS               LANCET                           2  1201 981",
    "17   BELMAN MJ             EUR J RESPIR DIS                62   391 981",
    "18   ORENSTEIN DM          CHEST                           80   392 981",
    "19   LISBOA C              REV MED CHIL                   109   476 981",
    "20   MORENO R              REV MED CHIL                   109   393 981",
    "21   PARDY RL              AM REV RESPIR DIS              123   426 981",
    "22   JARDIM J              AM REV RESPIR DIS              124   274 981",
    "23   MARTIN BJ             INT J SPORTS MED                 3   100 982",
    "24   MILES DS              ERGONOMICS                      25   239 982",
    "25   MILLER M              AM J CLIN NUTR                  36   492 982",
    "26   GIMENEZ M             EUR J APP PHYSI OCCUP PHYSIOL   49   379 982",
    "27   NICKERSON BG          J APPL PHYSIOL                  52   768 982",
    "28   ROBINSON EP           J APPL PHYSIOL                  52  1400 982",
    "29   ZACH M                ARCH DIS CHILD                  57   587 982",
    "30   COHEN CA              AM J MED                        73   308 982",
    "31   BELMAN MJ             CHEST                           81   440 982",
    "32   SONNE LJ              CHEST                           81   436 982",
    "33   BELMAN MJ             CHEST                           82   761 982",
    "34   ALDRICH TK            AM REV RESPIR DIS              126   195 982",
    "35   ARORA NS              AM REV RESPIR DIS              126     5 982",
    "36   ASHER MI              AM REV RESPIR DIS              126   855 982",
    "37   DELGADO HR            AM REV RESPIR DIS              126   200 982",
    "38   ROUSSOS C             N ENGL J MED                   307   786 982",
    "39   SHEPHERD RW           J PEDIATR GASTROENTEROL NUTR     2   439 983",
    "40   SHARP JT              CLIN CHEST MED                   4   421 983",
    "41   GROSS D               ISR J MED SCI                   19   383 983",
    "42   FANTA CH              J APPL PHYSIOL                  54  1618 983",
    "43   ROCHESTER DF          MED CLIN NORTH AM               67   573 983",
    "44   NICKERSON BG          PEDIATRICS                      71   147 983",
    "45   MORENO R              REV MED CHIL                   111   647 983",
    "46   WEISMAN IM            AM REV RESPIR DIS              127   641 983",
    "47   ONEILL S              AM REV RESPIR DIS              128  1051 983",
    "48   PARDY RL              CLIN CHEST MED                   5    35 984",
    "49   CARRIERI VK           HEART LUNG                      13   436 984",
    "50   KIM MJ                HEART LUNG                      13   333 984",
    "51   KOTTKE TE             PREV MED                        13    47 984",
    "52   MOXHAM J              BULL EUR PHYSIOPATH RESP        20   437 984",
    "53   HODSON ME             POSTGRAD MED J                  60   225 984",
    "54   FARKAS GA             J CLIN INVEST                   74  1214 984",
    "55   HODGES P              J AM DIET ASSOC                 84   664 984",
    "56   JEDERLINIC P          CHEST                           86   870 984",
    "57   SONNE LJ              CHEST                           86   939 984",
    "58   WAGENER JS            AM REV RESPIR DIS              129   873 984",
    "59   DIMARCO AF            MUSCLE NERVE                     8   284 985",
    "60   GREEN M               CLIN SCI                        68     1 985",
    "61   SHARP JT              CHEST                           88  S118 985",
    "62   RENZI G               UNION MED CAN                  114   897 985",
    "63   BELMAN MJ             AM REV RESPIR DIS              131   226 985",
    "64   CHEN HI               AM REV RESPIR DIS              131   251 985",
    "65   ZACH M                MONATSSCHR KINDERHEILKD        133   868 985",
    "66   ALDRICH TK            LUNG                           163    15 985",
    "67   HUGHES RL             ACTA PAEDIATR SCAND SUPPL 317 1985    42 985",
    "68   HADDAD GG             CLIN CHEST MED                   7    79 986",
    "69   KELSEN SG             CLIN CHEST MED                   7   101 986",
    "70   MCKEON JL             AUST NZ J MED                   16   648 986",
    "71   MARTIN AJ             DEVELOP MED CHILD NEUROL        28   314 986",
    "72   ESTRUP C              RESPIRATION                     50    36 986",
    "73   MACINTYRE NR          CHEST                           89   677 986",
    "74   BELMAN MJ             CHEST                           90   662 986",
    "75   RIES AL               CHEST                           90   285 986",
    "76   MOCELLIN R            WIEN KLIN WOCHENSCHR            98   735 986",
    "77   LEVINE S              AM REV RESPIR DIS              133   400 986",
    "78   EDLUND LD             AM J DIS CHILD                 140    80 986",
    "79   CLANTON TL            J APPL PHYSIOL                  62    39 987",
    "80   CROPP A               AM REV RESPIR DIS              135  1056 987"
  ]
}