{
  "paperNumber": "76122",
  "recordNumber": "00476",
  "acessionNumber": "76097309",
  "authors": [
    "Carter-R-A."
  ],
  "title": "The value of screening in paediatrics.",
  "source": "J-R-Coll-Physicians-Lond. 1976 Jan. 10(2). P 153-60.",
  "majorSubjects": [
    "MASS-SCREENING",
    "PEDIATRICS."
  ],
  "minorSubjects": [
    "ALPHA-FETOPROTEINS: df",
    "ALPHA-1-ANTITRYPSIN: df.",
    "AMINO-ACID-METABOLISM-INBORN-ERRORS: di",
    "CYSTIC-FIBROSIS: di.",
    "EVALUATION-STUDIES",
    "GALACTOSEMIA: di.",
    "GLUCOSEPHOSPHATE-DEHYDROGENASE-DEFICIENCY: di",
    "HARTNUP-DISEASE: di.",
    "HIP-DISLOCATION-CONGENITAL: di",
    "HOMOCYSTINURIA: di",
    "HUMAN.",
    "HYPOTHYROIDISM: cn",
    "INFANT",
    "INFANT-NEWBORN.",
    "MAPLE-SYRUP-URINE-DISEASE: di",
    "PHENYLKETONURIA: di."
  ],
  "abstractExtract": "Population screening is the carrying out of some test or procedure on every individual within a population defined by such limits as geography, administration, race, sex or age.  At risk screening is the carrying out of such a test or procedure on a person or persons for whom there already exists some medical reason to suppose that the findings may be positive.  This review of conditions for which population screening may be considered is not exhaustive, but it serves to show the central dilemma in this field, which is that, apart from congenital dislocation of the hip, phenylketonuria and possibly homocystinuria, none seems to show quite strong enough a case to be considered worthwhile screening for on its own.",
  "references": [
    "001   ABULID J              J CLIN ENDOCRINOL METAB         39   263 974",
    "002   BARNES ND             ARCH DIS CHILD                  50   497 975",
    "003   ANON                  BR MED J                         3   489 971",
    "004   ANON                  BR MED J                         1   527 974",
    "005   BROCK DJH             LANCET                           2   923 973",
    "006   BROCK DJH             LANCET                           2   197 972",
    "007   DACOU-VOUTETAKIS C    ARCH DIS CHILD                  48   826 973",
    "008   DEALL AM              BR MED J                         3   639 971",
    "009   DICKSON LG            CLIN CHEM                       19   301 973",
    "010   DOW PA                AM J CLIN PATHOL                61   333 974",
    "011   ENDRE L               LANCET                           1   631 974",
    "012   GUTHRIE R             US DHEW CHILDRENS BUREAU PUBL            965",
    "013   HARRIS R              LANCET                           1   429 974",
    "014   HAWCROFT J            HEALTH TRENDS                    6    72 974",
    "015   HOLLAND WW            LANCET                           2  1494 974",
    "016   HOLT KS               LANCET                           2  1057 974",
    "017   HOLTON JB             ANN CLIN BIOCHEM                 9   118 972",
    "018   KLEIN AH              LANCET                           2    77 974",
    "019   KLEIN A               PEDIATR RES                      5   399 971",
    "021   LAURENCE KM           LANCET                           2   939 974",
    "022   LEEK AE               LANCET                           1   876 974",
    "023   LEEK AE               LANCET                           2  1151 974",
    "024   LEEK AE               LANCET                           1   385 973",
    "025   LINDSAY G             ANN CLIN BIOCHEM                 9   115 972",
    "026   ANON                  BR MED J                         4     7 968",
    "027   MITTMAN C             CHEST                           60   214 971",
    "028   RAINE DN              ANN CLIN BIOCHEM                 6    29 969",
    "029   RAINE DN              BR MED J                         2   329 972",
    "030   RAINE DN              BR MED J                         3     7 972",
    "032   RAINE DN              LANCET                           2   996 974",
    "033   RAINE DN              TREATMENT OF INHERITED ME                975",
    "034   SCRIVER CR            LANCET                           2   230 964",
    "035   SEAKINS JWT           TREATMENT OF INBORN ERRORS OF            973",
    "036   SELLER MJ             LANCET                           1   428 974",
    "037   SIMILA S              ARCH DIS CHILD                  50   565 975",
    "038   STEPHAN U             LANCET                           1   367 975",
    "039   SUN T                 AM J CLIN PATHOL                62   725 974",
    "040   THAMBIPILLAI S        AM J CLIN PATHOL                63   836 975",
    "041   UDDIN DE              JAMA                           227  1408 974",
    "042   WALD NJ               LANCET                           1   765 974",
    "043   WHITBY LG             LANCET                           2   819 974",
    "044   ANON                  SCREENING FOR INBORN ERRORS O            968"
  ],
  "citations": [
    "1   CHALMERS RA           ANN CLIN BIOCHEM                14   149 977",
    "2   SMILKSTEIN G          J MED EDUC                      53   766 978",
    "3   NELSON JH             WEST J MED                     129   243 978"
  ]
}