{
  "paperNumber": "74165",
  "recordNumber": "00164",
  "acessionNumber": "74141045",
  "authors": [
    "Waisbren-B-A",
    "Martins-R-R",
    "Bruns-W-T",
    "Kurzynski-T-A."
  ],
  "title": "Whole cell heat-killed gram-negative bacilli vaccine.",
  "source": "Wis-Med-J. 1974 Apr. 73(4). P S42-5.",
  "majorSubjects": [
    "BACTERIAL-INFECTIONS: pc",
    "BACTERIAL-VACCINES: tu.",
    "ESCHERICHIA-COLI:  im",
    "PSEUDOMONAS-AERUGINOSA: im",
    "VACCINATION."
  ],
  "minorSubjects": [
    "ANTIBODY-FORMATION",
    "BURNS: im",
    "CHILD",
    "CHILD-PRESCHOOL.",
    "CYSTIC-FIBROSIS: im",
    "FEMALE",
    "HEART-SURGERY",
    "HEAT",
    "HUMAN",
    "MALE."
  ],
  "abstractExtract": "This preliminary clinical study is of the ability of a multivalent heat-killed whole cell gram-negative bacilli vaccine to be tolerated and to evoke an antibody response in groups of patients who have a manifest need for increased resistance to gram-negative bacilli. Three groups of patients were studied: 35 burn patients; seven small children with cystic fibrosis; and 35 patients who were about to undergo coronary vein grafts.  The results of vaccination were different in each of the three groups of patients that were vaccinated.",
  "references": [
    "001   FINLAND M             JAMA                           170  2188 959",
    "002   MYEROWITZ RL          J INFECT DIS                   124   239 971",
    "003   SMITH DT              ARCH INTERN MED                125   344 970",
    "004   WRIGHT AE             BR MED J                         1   256 897",
    "005   FISHER MW             J BACTERIOL                     98   835 969",
    "006   KUNIN CM              PROC SOC EXP BIOL MED          111   160 962",
    "007   ALEXANDER JW          ARCH SURG                       99   249 969",
    "008   WAISBREN BA           CF CLUB ABST                    12       971",
    "009   WAISBREN BA           J IMMUNOL                       97   431 966",
    "010   GORZYNSKI EA          INFECT IMMUN                     5   625 972",
    "011   CROWDER JG            J LAB CLIN MED                  79    47 972",
    "012   WAISBREN BA           J INFECT DIS                   119   518 969",
    "013   SPRACKLEN FHN         BR MED J                         1    89 968",
    "014   STEINBERG AD          ANN INTERN MED                  76   619 972",
    "015   ALEXANDER JW          J TRAUMA                         6   780 966",
    "016   WEISBERGER AS         JAMA                           209    97 969",
    "017   BORTIN MM             TRANSPLANTATION                 12   573 971",
    "018   WAISBREN BA           PROC AM BURN ASS 4TH ANN MTG             972"
  ],
  "citations": [
    "1   STANISLAVSKY ES       ZH MIKROBIO EPIDEMIO IMMUNOBI 1983    22 983"
  ]
}