{
  "paperNumber": "75020",
  "recordNumber": "00186",
  "acessionNumber": "76059140",
  "authors": [
    "Perman-J",
    "Breslow-L",
    "Ingal-D."
  ],
  "title": "Nonoperative treatment of meconium ileus equivalent.",
  "source": "Am-J-Dis-Child. 1975 Oct. 129(10). P 1210-1.",
  "majorSubjects": [
    "CYSTIC-FIBROSIS: co",
    "FECES",
    "INTESTINAL-OBSTRUCTION: et."
  ],
  "minorSubjects": [
    "ACETYLCYSTEINE",
    "CASE-REPORT",
    "CHILD",
    "ENEMA",
    "FEMALE",
    "HUMAN.",
    "INTESTINAL-OBSTRUCTION: th",
    "LIPASE: tu",
    "MECONIUM."
  ],
  "abstractExtract": "Intraluminal bowel obstruction secondary to inspissated feces is a known complication of cystic fibrosis. When seen in the older child, it is termed \"meconium ileus equivalent.\" We studied a case in which nonsurgical resolution of the obstruction was obtained with N- acetylcysteine enemas and pancreatic replacement enzymes given orally and by enema. The pathogenesis of this disorder and the basis for the treatment are described. Recognition of this complication and familiarity with its medical management are important in caring for the older child with cystic fibrosis.",
  "references": [
    "001   JENSEN KG             ACTA PAEDIATR SCAND             51   344 962",
    "002   MULLINS F             JAMA                           192   741 965",
    "003   JAFFE BF              ARCH SURG                       92   337 966",
    "004   SHEFFNER AL           ANN NY ACAD SCI                106   298 963",
    "005   MEEKER IA             SURGERY                         56   419 964",
    "006   SIMPSON TE            MAYO CLIN PROC                  43   725 968",
    "007   SIGLER RM             MAYO CLIN PROC                  40   477 965",
    "008   LILLIBRIDGE CB        J PEDIATR                       71   887 967",
    "009   GRACEY M              ARCH DIS CHILD                  44   404 969",
    "010   SHAW A                J PEDIATR SURG                   4   119 969",
    "011   GRAND RJ              CLIN PEDIATR                     9   588 970"
  ],
  "citations": []
}