{
  "queryNumber": "60",
  "queryText": "What are the effects of CF on the pulmonary circulation?",
  "relevantDocuments": "34",
  "results": [
    [
      "17",
      "0101"
    ],
    [
      "87",
      "0100"
    ],
    [
      "100",
      "2222"
    ],
    [
      "155",
      "1220"
    ],
    [
      "241",
      "2112"
    ],
    [
      "267",
      "0111"
    ],
    [
      "322",
      "1210"
    ],
    [
      "340",
      "0002"
    ],
    [
      "348",
      "2222"
    ],
    [
      "354",
      "1000"
    ],
    [
      "370",
      "1000"
    ],
    [
      "446",
      "2220"
    ],
    [
      "519",
      "1010"
    ],
    [
      "550",
      "1000"
    ],
    [
      "587",
      "2120"
    ],
    [
      "597",
      "2120"
    ],
    [
      "653",
      "1010"
    ],
    [
      "698",
      "2122"
    ],
    [
      "722",
      "0001"
    ],
    [
      "724",
      "0001"
    ],
    [
      "751",
      "0010"
    ],
    [
      "764",
      "0001"
    ],
    [
      "990",
      "1002"
    ],
    [
      "1000",
      "0001"
    ],
    [
      "1004",
      "2222"
    ],
    [
      "1040",
      "0001"
    ],
    [
      "1041",
      "1110"
    ],
    [
      "1043",
      "1110"
    ],
    [
      "1046",
      "0002"
    ],
    [
      "1047",
      "1110"
    ],
    [
      "1104",
      "0001"
    ],
    [
      "1110",
      "0012"
    ],
    [
      "1192",
      "1100"
    ],
    [
      "1194",
      "0001"
    ]
  ]
}