{
  "paperNumber": "75071",
  "recordNumber": "00237",
  "acessionNumber": "75167122",
  "authors": [
    "Ho-Shin-Y",
    "Glass-L",
    "Evans-H-E."
  ],
  "title": "Pulmonary diseases in childhood.",
  "source": "Clin-Notes-Respir-Dis. 1975 Summer. 14(1). P 3-12.",
  "majorSubjects": [
    "LUNG-DISEASES."
  ],
  "minorSubjects": [
    "ASTHMA",
    "ATELECTASIS",
    "BRONCHI",
    "BRONCHIOLITIS-VIRAL",
    "CHILD.",
    "CHILD-PRESCHOOL",
    "CYSTIC-FIBROSIS",
    "FEMALE",
    "FOREIGN-BODIES.",
    "HEMOPTYSIS",
    "HUMAN",
    "INFANT",
    "INFANT-NEWBORN",
    "MALE.",
    "MEDIASTINAL-EMPHYSEMA",
    "PNEUMONIA",
    "PNEUMOTHORAX",
    "PREGNANCY.",
    "RESPIRATORY-DISTRESS-SYNDROME",
    "TUBERCULOSIS-IN-CHILDHOOD.",
    "TUBERCULOSIS-PULMONARY."
  ],
  "abstractExtract": "Many types of lung disease are seen in the pediatric age group. These range all the way from disorders of the neonate that are closely related to parturition, to acute infectious diseases seen in infancy and early childhood, to chronic disorders such as cystic fibrosis and bronchial asthma.  Management of the conditions described involves cooperation between the primary care physician and the specialist.  A variety of organizations offers aid to both physicians and patients\u0027 families.",
  "references": [
    "001   MILLER HC             J PEDIATR                       72   628 968",
    "002   GLUCK L               PEDIATR RES                      6    81 972",
    "003   GLUCK L               AM J OBSTET GYNECOL            109   440 971",
    "004   CLEMENTS JA           N ENGL J MED                   286  1077 972",
    "005   KATTWINKEL J          PEDIATRICS                      52   131 973",
    "006   WILSON MG             AM J DIS CHILD                  99   489 960",
    "007   ANDERSON WR           ARCH PATHOL                     91   506 971",
    "008   ELDERKIN FM           BR MED J                         2   722 965",
    "009   RAPKIN RH             CLIN PEDIATR                    10   312 971",
    "010   GERBEAUX J            AM J DIS CHILD                 110   507 965",
    "011   DURFEE ML             AM REV RESPIR DIS               99   304 969",
    "012   MARKS MB              CLIN PEDIATR                    13   225 974",
    "013   FRANKLIN W            N ENGL J MED                   290  1469 974",
    "014   GIBBS GE              PAEDIATRICIAN                    1   133 972"
  ],
  "citations": []
}