{
  "paperNumber": "77127",
  "recordNumber": "00708",
  "acessionNumber": "77231257",
  "authors": [
    "Heinrich-H-C",
    "Gabbe-E-E",
    "Bartels-H",
    "Oppitz-K-H",
    "Bender-Gotze-C.",
    "Pfau-A-A."
  ],
  "title": "Bioavailability of food iron-(59Fe), vitamin B12-(60Co) and protein bound selenomethionine-(75Se) in pancreatic exocrine insufficiency due to cystic fibrosis.",
  "source": "Klin-Wochenschr. 1977 Jun 15. 55(12). P 595-601.",
  "majorSubjects": [
    "CYSTIC-FIBROSIS: me",
    "IRON: me",
    "SELENIUM: me",
    "SELENOMETHIONINE: me.",
    "VITAMIN-B-12: me."
  ],
  "minorSubjects": [
    "BIOLOGICAL-AVAILABILITY",
    "CHILD",
    "CHILD-PRESCHOOL.",
    "COBALT-RADIOISOTOPES",
    "DIETARY-PROTEINS: me",
    "FOOD",
    "HUMAN.",
    "INTESTINAL-ABSORPTION",
    "INTRINSIC-FACTOR: pd",
    "IRON-RADIOISOTOPES.",
    "LIVER",
    "MEAT",
    "PANCREATIN: pd",
    "PROTEIN-BINDING",
    "RADIOISOTOPES.",
    "VITAMIN-B-12-DEFICIENCY: et",
    "WHOLE-BODY-COUNTING."
  ],
  "abstractExtract": "The absorption of biosynthetically 59Fe-labeled hemiglobin, pork and hog liver, 60 Co-vitamin B12 and 75Se-selenomethionin labeled pork was measured in children with cystic fibrosis by whole body counting of the absorbed radionuclides within the 4-pi geometry of a large volume radioactivity detector with liquid organic scintillator.",
  "references": [
    "001   AWWAD HK              J BIOL CHEM                    242   492 967",
    "002   BEN PORATH M          J NUCL MED                       9   168 968",
    "003   DEREN JJ              N ENGL J MED                   288   949 973",
    "004   EVANS WB              AM J DIG DIS                    11   594 966",
    "005   HEINRICH HC           PROC UNIV NEW MEXICO CONF ORG        312 960",
    "006   HEINRICH HC           SEMIN HEMATOL                    1   199 964",
    "007   HEINRICH HC           IN: HALLBERG L                       213 970",
    "008   HEINRICH HC           PROC WORKSHOP CONF HOECHS 3RD         34 975",
    "009   HEINRICH HC           KLIN WOCHENSCHR                 55   587 977",
    "010   HEINRICH HC           ATOMPRAXIX                      10   477 964",
    "011   HEINRICH HC           EUR J CLIN INVEST                1   321 971",
    "012   HEINRICH HC           KLIN WOCHENSCHR                 49   819 971",
    "013   HEINRICH HC           KLIN WOCHENSCHR                 44   827 966",
    "015   HENDERSON JT          LANCET                           2   241 972",
    "016   LE BAUER E            ARCH INTERN MED                122   423 968",
    "017   MCINTYRE PA           ARCH INTERN MED                 98   541 956",
    "018   NIEWEG HO             IN: HEINRICH HC                      610 962",
    "019   TOSKES PP             J CLIN INVEST                   52  1660 973",
    "020   TOSKES PP             N ENGL J MED                   284   627 971",
    "021   VEEGER W              N ENGL J MED                   267  1341 962",
    "022   SEPHTON-SMITH R       BR MED J                         1   608 964",
    "023   STRAHM HW             ARCH KINDERHEILK               175   270 967"
  ],
  "citations": [
    "1   HEINRICH HC           KLIN WSCHR                      55   587 977",
    "2   LLOYDSTILL JD         PEDIATRICS                      65  1010 980",
    "3   SOLOMONS NW           AM J CLIN NUTR                  34   462 981",
    "4   YOUNG VR              AM J CLIN NUTR                  35  1076 982",
    "5   SWANSON CA            AM J CLIN NUTR                  38   169 983",
    "6   LEVANDER OA           FED PROC                        42  1721 983",
    "7   CHRISTENSEN MJ        BR J NUTR                       50    43 983",
    "8   ROTTOLI A             RIV ITAL PEDIATR                10   337 984",
    "9   LEVANDER OA           BULL NY ACAD MED                60   144 984",
    "10   WARD KP               EUR J PEDIATR                  142    21 984",
    "11   SOLOMONS NW           TRACE ELEMENTS MED               2    59 985",
    "12   WATSON RD             J PARENT ENTERAL NUTR            9    58 985",
    "13   SOLOMONS NW           J PEDIATR GASTROENTEROL NUTR     5   122 986",
    "14   DWORKIN B             J PARENT ENTERAL NUTR           11    38 987"
  ]
}