{
  "paperNumber": "79043",
  "recordNumber": "01023",
  "acessionNumber": "80129794",
  "authors": [
    "Phelan-P-D."
  ],
  "title": "Cystic fibrosis: is it relevant to family practitioners?.",
  "source": "Aust-Fam-Physician. 1979 Dec. 8(12). P 1232-4.",
  "majorSubjects": [
    "CYSTIC-FIBROSIS: di",
    "FAMILY-PRACTICE."
  ],
  "minorSubjects": [
    "ADOLESCENCE",
    "ADULT",
    "AUSTRALIA",
    "CHILD",
    "CYSTIC-FIBROSIS: oc, th.",
    "HUMAN",
    "PATIENT-CARE-TEAM."
  ],
  "abstractExtract": "There has been a major change in the outlook for children with cystic fibrosis during the last 20 years. Provided the diagnosis is made before serious irreversible lung disease has occurred, most patients can expect to reach adult life without very serious disability.",
  "references": [],
  "citations": []
}