{
  "paperNumber": "74016",
  "recordNumber": "00016",
  "acessionNumber": "74107099",
  "authors": [
    "Ozonoff-M-B."
  ],
  "title": "Ataxia-telangiectasia: chronic pneumonia, sinusitis, and adenoidal hypoplasia.",
  "source": "Am-J-Roentgenol-Radium-Ther-Nucl-Med. 1974 Feb. 120(2). P 297-9.",
  "majorSubjects": [
    "ADENOIDS: ra",
    "ATAXIA-TELANGIECTASIA: co",
    "PNEUMONIA: et.",
    "SINUSITIS:  et."
  ],
  "minorSubjects": [
    "ATAXIA-TELANGIECTASIA: ra",
    "CASE-REPORT",
    "CHILD.",
    "CYSTIC-FIBROSIS:  ra",
    "DIAGNOSIS-DIFFERENTIAL",
    "ETHMOID-SINUS: ra.",
    "FEMALE",
    "FRONTAL-SINUS: ab, ra",
    "HUMAN",
    "MAXILLARY-SINUS: ra.",
    "PNEUMONIA: ra."
  ],
  "abstractExtract": "The syndrome of ataxia-telangiectasia is characterized by ataxia, progressive neurologic degeneration, cutaneous and conjunctival telangiectasis, and immunologic deficiency.  Roentgenologic evidence of chronic pulmonary and sinus infections and decreased lymphoid tissue will usually be present.  As the sinopulmonary abnormalities resemble those of cystic fibrosis, a small adenoidal mass may be of differential aid.",
  "references": [
    "001   BODER E               PEDIATRICS                      21   526 958",
    "002   EISEN AH              N ENGL J MED                   272    18 965",
    "003   KARPATI G             AM J DIS CHILD                 110    51 965",
    "004   TADJOEDIN MK          AM J DIS CHILD                 110    64 965"
  ],
  "citations": [
    "1   SHACKELFORD GD        AM J ROENTGENOL                123   144 975",
    "2   LALLEMAND D           ANN RADIOL (PARIS)              24    67 981"
  ]
}