{
  "paperNumber": "76167",
  "recordNumber": "00521",
  "acessionNumber": "76268606",
  "authors": [
    "Shapira-E",
    "Rao-G-J",
    "Wessel-H-U",
    "Nadler-N-L."
  ],
  "title": "Absence of an alpha two-macroglobulin-protease complex in cystic fibrosis.",
  "source": "Pediatr-Res. 1976 Sep. 10(9). P 812-7.",
  "majorSubjects": [
    "ALPHA-MACROGLOBULINS: df",
    "ARGININE: bl",
    "CYSTIC-FIBROSIS: en.",
    "ESTERASES: bl."
  ],
  "minorSubjects": [
    "HUMAN",
    "HYDROLYSIS",
    "IMMUNE-SERA",
    "IMMUNOELECTROPHORESIS.",
    "IMMUNOLOGIC-TECHNICS",
    "RABBITS: im."
  ],
  "abstractExtract": "The present study using immunologic methodology confirms previous observations from this laboratory of an absence of a protease component with arginine esterase activity in plasma of patients with cystic fibrosis. In this study, the pooled plasma from control individuals was activated and partially purified after adsorption on columns of soybean trypsin inhibitor conjugated to Sepharose 4B followed by elution with benzamidine. The fraction was further purified by isoelectrofocusing on polyacrylamide gels. Proteins around the pI range of 5.5 were eluted and utilized to prepare an antiserum. Immunoelectrophoresis of activated plasma samples from control subjects and patients with cystic fibrosis was performed utilizing the antiserum. In controls, four precipitin arcs with residual esterase activity were observed, whereas only three were seen in plasma from patients with cystic fibrosis. Double gel diffusion experiments using specific antisera ruled out the presence of trypsin, chymotrypsin, plasminogen, prothrombin, C1 esterase, alpha one-trypsin inhibitor, and inter-alpha-trypsin inhibitor in the concentrated benzamidine eluate. The antisera to alpha two- macroglobulin gave an immunoprecipitate which was readily stained for proteolytic activity. On immunoelectrophoresis, the alpha two- macroglobulin precipitin band corresponded to the band absent in plasma of patients with cystic fibrosis. In contrast, the alpha two- macroglobulin levels were similar in plasma of control subjects and patients with cystic fibrosis. Using the antiserum to the protein fractith proteolytic activity could be demonstrated in control plasma. One specific enzyme-active \"rocket\" was absent in plasma of patients with cystic fibrosis. In a double blind study of 15 control samples and 15 samples from patients with cystic fibrosis, a specific \"rocket\" was shown to be present in 13 control samples and absent in 14 cystic fibrosis samples. alpha two-Macroglobulin was determined by both an immunologic procedure and by its trypsin binding (trypsin protein esterase concentration). The ratio of the immunologic assay to the biologic activity assay was 90 for the normal plasma samples and only 65 for cystic fibrosis samples.",
  "references": [
    "001   AXEN R                NATURE                         214  1302 967",
    "002   BAGDASARIAN A         J CLIN INVEST                   54  1444 974",
    "003   BARRETT AJ            BIOCHEM J                      133   709 973",
    "004   BOWMAN BH             SCIENCE                        164   325 969",
    "005   CONOVER JH            PEDIATR RES                      7   220 973",
    "006   ERLANGER BF           ARCH BIOCHEM BIOPHYS            95   271 961",
    "007   GANROT PO             CLIN CHIM ACTA                  14   493 966",
    "008   HAMBERG U             EUR J BIOCHEM                   40   439 973",
    "009   HARPEL PC             J EXP MED                      138   508 973",
    "010   KABAT EA              EXPERIMENTAL IMMUNOCHEMISTRY             961",
    "011   KAUZMANN W            J AM CHEM SOC                   75  5154 953",
    "012   LAURELL CB            ANAL BIOCHEM                    15    45 966",
    "013   LEVY HB               PROC SOC EXP BIOL MED          103   250 960",
    "014   LOWRY OH              J BIOL CHEM                    193   265 951",
    "015   MANCINI G             IMMUNOCHEMISTRY                  2   235 965",
    "016   MANGOS JA             PEDIATR RES                      1   436 967",
    "017   OUCHTERLONY O         ACTA PATH MICROBIOL SCAND       25   186 948",
    "018   RAO GJS               J PEDIATR                       80   573 972",
    "019   RAO GJS               PEDIATR RES                      8   684 974",
    "020   RAO GJS               PEDIATR RES                      9   739 975",
    "021   RAO GJS               SCIENCE                        177   610 972",
    "022   SHAPIRA E             J LAB CLIN MED                  77   877 971",
    "024   SHAPIRA E             ISR J MED SCI                   10  1086 974",
    "025   SPOCK A               PEDIATR RES                      1   173 967",
    "026   WILSON GB             PEDIATR RES                     10    87 976"
  ],
  "citations": [
    "1   RAO GJS               PEDIATR RES                     11   981 977",
    "2   WILSON GB             PEDIATR RES                     11   317 977",
    "3   SHAPIRA E             CLIN CHIM ACTA                  78   359 977",
    "4   SHAPIRA E             J BIOL CHEM                    252  7923 977",
    "5   WILSON GB             NATURE                         266   463 977",
    "6   SCHAAP T              ISR J MED SCI                   14   201 978",
    "7   RAO GJS               ENZYME                          23   314 978",
    "8   PEARSON RD            PEDIATR RES                     13   834 979",
    "9   ROMEO G               PEDIATR RES                     13  1030 979",
    "10   VANLEUVEN F           PEDIATR RES                     13  1384 979",
    "11   DAVIS PB              PEDIATR RES                     14    83 980",
    "12   WALSH MMJ             PEDIATR RES                     14   353 980",
    "13   SHAPIRA E             BIOCHEM BIOPHYS RES COMMUN      93    50 980",
    "14   ROMEO G               J LAB CLIN MED                  95   116 980",
    "15   SCHIDLOW DV           AM REV RESPIR DIS              121    31 980",
    "16   NELLES LP             BIOCHIM BIOPHYS ACTA           623    46 980",
    "17   SCHIOTZ PO            ACTA PATH MICROBIOL SCAND (C) S276     1 981",
    "18   HULTBERG B            CLIN CHIM ACTA                 112   167 981",
    "19   COX KL                J PEDIATR GASTROENTEROL NUTR     1   345 982",
    "20   BURY AF               IRCS MED SCI BIOCHEM            10   255 982",
    "21   BURY AF               PEDIATR RES                     16   613 982",
    "22   ROBERTS RC            PEDIATR RES                     16   416 982",
    "23   BRIDGES MA            CLIN CHIM ACTA                 118    33 982",
    "24   VEREMEENKO KN         UKR BIOKHIM ZH                  55   218 983",
    "25   BRIDGES MA            ANN NY ACAD SCI                421   360 983",
    "26   SHAPIRA E             ANN NY ACAD SCI                421   352 983",
    "27   EAGER KB              PEDIATR RES                     18   999 984"
  ]
}