{
  "paperNumber": "76093",
  "recordNumber": "00447",
  "acessionNumber": "76236895",
  "authors": [
    "Hann-S",
    "Holsclaw-D-S."
  ],
  "title": "Interactions of Pseudomonas aeruginosa with immunoglobulins and complement in sputum.",
  "source": "Infect-Immun. 1976 Jul. 14(1). P 114-7.",
  "majorSubjects": [
    "COMPLEMENT-3",
    "COMPLEMENT",
    "CYSTIC-FIBROSIS: im",
    "IMMUNOGLOBULINS.",
    "PSEUDOMONAS-AERUGINOSA: im",
    "SPUTUM: im."
  ],
  "minorSubjects": [
    "ADOLESCENCE",
    "ADULT",
    "ANTIGEN-ANTIBODY-REACTIONS",
    "CHILD.",
    "CHILD-PRESCHOOL",
    "COMPLEMENT-3: an",
    "COMPLEMENT: an.",
    "CYSTIC-FIBROSIS: mi",
    "FEMALE",
    "HUMAN",
    "IGA: an",
    "IGG: an",
    "IGM: an.",
    "IMMUNOGLOBULINS: an",
    "MALE",
    "SPUTUM: mi."
  ],
  "abstractExtract": "The interactions of Pseudomonas aeruginosa with humoral factors in the sputum of patients with cystic fibrosis were investigated by using an indirect immunofluorescent technique. Fluorescein- conjugated, monovalent antiserum specific to heavy chains of human immunoglobulin A (IgA), IgG, or IgM and to complement C3 were used. All strains of P. aeruginosa recovered from the sputum specimens of patients with cystic fibrosis were found to be coated with antibodies of IgA, IgG, and IgM classes and with C3. The specificity of the antibody coating was determined. The fluorescence was most intense with IgA and was followed in intensity by IgG, IgM, and C3. No difference was noted between rough and mucoid strains of P. aeruginosa. When the subcultured P. aeruginosa was incubated with the sputum eluates, a similar pattern of fluorescence was demonstrated, indicating that these humoral factors are present in the sputum and that the coating process can take place in the lower respiratory tract of the patients. By single radial immunodiffusion, significant quantities of the humoral factors in the sputum eluates were detected. These findings suggest that P. aeruginosa is opsonized in sputum of patients with cystic fibrosis.",
  "references": [
    "001   BIGGAR WD             PROC NAT ACAD SCI USA           68  1716 971",
    "002   BOXERBAUM B           AM REV RESPIR DIS              108   777 973",
    "003   BOYDEN SV             IN: WOLSTENHOLME GEW                 190 976",
    "004   GOTZE O               J EXP MED                      134   90S 971",
    "005   GREEN GM              N ENGL J MED                   276   421 967",
    "006   GREEN GM              J CLIN INVEST                   43   769 964",
    "007   GUGLER EC             J PEDIATR                       73   548 968",
    "008   HUANG NN              J PEDIATR                       59   512 961",
    "009   IACOCCA VF            AM J DIS CHILD                 106   315 963",
    "010   ISHIZAKA T            J IMMUNOL                       97   716 966",
    "011   JOHNSTON RB JR        J EXP MED                      129  1275 969",
    "012   MARCER V              RIV CLIN PEDIATR                83   135 970",
    "013   OREN R                J CELL BIOL                     17   486 963",
    "014   REYNOLDS HY           GAP CONF REP PSEUDOMON IN CF           7 974",
    "015   SMITH MR              PROC NAT ACAD SCI USA           63  1151 969",
    "016   SOUTH MA              J PEDIATR                       71   645 967",
    "017   THOMAS V              N ENGL J MED                   290   588 974",
    "018   WILLIAMS RC JR        IMMUNOLOGY                      17   249 969",
    "019   WINKELSTEIN JA        J PEDIATR                       82   747 973",
    "020   YOUNG LS              J INFECT DIS                   126   257 972"
  ],
  "citations": [
    "1   HOIBY N               ACTA PATH MICROBIOL SCAND (C) S262     3 977",
    "2   SORENSEN RU           INFECT IMMUN                    18   735 977",
    "3   SORENSEN RU           J PEDIATR                       93   201 978",
    "4   SCHIOTZ PO            ACTA PATH MICROBIOL SCAND (C)   87   229 979",
    "5   SHAW JO               LAB INVEST                      42   547 980",
    "6   HOMMA JY              JAP J EXP MED                   50   149 980",
    "7   SCHIOTZ PO            ACTA PATH MICROBIOL SCAND (C) S276     1 981",
    "8   KOLB WP               AM REV RESPIR DIS              123   226 981",
    "9   HOIBY N               ACTA PAEDIATR SCAND SUPPL 301 1982    63 982",
    "10   OLIVER AM             J CLIN LAB IMMUNOL              10   221 983",
    "11   SCHILLER NL           PEDIATR RES                     17   747 983",
    "12   SORENSEN RU           EUR J RESPIR DIS                64   524 983",
    "13   PIER GB               J INFECT DIS                   150   223 984",
    "14   SPEERT DP             SURV SYNTH PATHOL RES            4    14 985",
    "15   PIEDRA P              J PEDIATR                      108   817 986"
  ]
}