{
  "paperNumber": "78152",
  "recordNumber": "00932",
  "acessionNumber": "78113434",
  "authors": [
    "Holzel-A."
  ],
  "title": "Malabsorption.",
  "source": "Midwife-Health-Visit-Community-Nurse. 1978 Mar. 14(3). P 79-81.",
  "majorSubjects": [
    "MALABSORPTION-SYNDROMES: pp."
  ],
  "minorSubjects": [
    "CELIAC-DISEASE: pp",
    "CHILD",
    "CHILD-PRESCHOOL",
    "CYSTIC-FIBROSIS: pp.",
    "DIETARY-CARBOHYDRATES",
    "HUMAN",
    "INFANT",
    "LACTOSE-INTOLERANCE: pp.",
    "SUCROSE."
  ],
  "abstractExtract": "Malabsorption in infancy and childhood can roughly be defined as a condition of inadequate growth in spite of seemingly adequate nutrition and is accompanied by excessive excretion of food components in the stools.  Acquired lactase deficiency, the introduction of sugar in the diet, coeliac disease, and cystic fibrosis are discussed.",
  "references": [],
  "citations": []
}