{
  "paperNumber": "79118",
  "recordNumber": "01098",
  "acessionNumber": "79196242",
  "authors": [
    "Worley-L",
    "Poole-C",
    "Valdes-Depena-M."
  ],
  "title": "Failure to thrive, anemia, and anasarca.",
  "source": "J-Pediatr. 1979 Jun. 94(6). P 1005-9.",
  "majorSubjects": [
    "CYSTIC-FIBROSIS: co",
    "FOOD-HYPERSENSITIVITY: co",
    "MILK: ae.",
    "PROTEIN-LOSING-ENTEROPATHIES: et."
  ],
  "minorSubjects": [
    "ANEMIA: et",
    "CASE-REPORT",
    "FEMALE",
    "HUMAN",
    "INFANT."
  ],
  "abstractExtract": "A 5-month-old white girl was admitted to an Infant Intensive Care Unit of Jackson Memorial Hospital.  According to her mother, the baby had been in \"her usual state of health\" until one week before admission, when she began to \"spit up\" after feedings and her lower extremities became puffy.  Vomiting increased in frequency until it occurred after every meal; eventually the baby refused all feedings; there was no diarrhea.  Ultimately, the family\u0027s physician, when consulted, recommended that she be admitted to the hospital.  On the fourth day she developed renal failure with anuria and rising creatinine concentration despite adequate fluid intake; peritoneal dialysis was begun.  However, she soon became hypothermic and developed pulmonary edema, and she died a few hours later.  A discussion of the case is presented.",
  "references": [
    "001   MACLEAN WC JR         J PEDIATR                       83    86 973",
    "002   LEE PA                JAMA                           228   585 974",
    "003   COLON AR              SOUTH MED J                     66   641 973",
    "004   SWISCHUK LE           J PEDIATR                       88   452 976",
    "005   GRISCOM NT            RADIOLOGY                      117   385 975",
    "006   MELHEM RE             PEDIATR RADIOL                   4   153 976"
  ],
  "citations": []
}