{
  "paperNumber": "78164",
  "recordNumber": "00944",
  "acessionNumber": "78072649",
  "authors": [
    "Holsclaw-D-S-Jr."
  ],
  "title": "Recognition and management of patients with cystic fibrosis.",
  "source": "Pediatr-Ann. 1978 Jan. 7(1). P 9-10, 12-6, 21-2 passim.",
  "majorSubjects": [
    "CYSTIC-FIBROSIS."
  ],
  "minorSubjects": [
    "ADOLESCENCE",
    "ADULT",
    "AIRWAY-OBSTRUCTION: th",
    "CHILD.",
    "CHILD-PRESCHOOL",
    "CYSTIC-FIBROSIS: co, di, pa, th",
    "HUMAN",
    "INFANT.",
    "INFANT-NEWBORN",
    "INTESTINAL-OBSTRUCTION: et",
    "LIVER: pa",
    "LUNG: pa.",
    "MECONIUM",
    "MIDDLE-AGE",
    "PANCREAS: pa.",
    "RESPIRATORY-TRACT-INFECTIONS: dt",
    "INFERTILITY: et.",
    "SUPPORT-U-S-GOVT-P-H-S",
    "SUPPORT-U-S-GOVT-NON-P-H-S."
  ],
  "abstractExtract": "Cystic fibrosis is the most common lethal genetic disease in childhood, and the broad range of its clinical expression can involve practically every specialty of medicine.  The pathology of cystic fibrosis, its clinical features, diagnosis, and treatment are discussed.  The pediatrician will not want to attempt to provide exclusive care for the CF patient.  These patients require the many supports that only a specialized center will have.  Chest surgeons, pediatric surgeons, otolaryngologists, cardiologists, gastroenterologists - in fact, all fields of medicine and all medical specialties - may be needed for the various clinical problems associated with the disease.",
  "references": [
    "001   MCKUSICK VA           MENDELIAN INHERIT IN MAN                 975",
    "002   ANON                  GUIDE TO DIAGNOSIS AND MANAGE            971",
    "003   DI SANTAGNESE PA      N ENGL J MED                   295   481 976",
    "004   HOLSCLAW DS           CLIN PEDIATR                     9   346 970",
    "005   SHWACHMAN H           PEDIATRICS                      30   389 962",
    "006   ANDERSEN DH           AM J DIS CHILD                  56   344 938",
    "007   CRAIG JM              AM J DIS CHILD                  93   357 957",
    "008   HOLSCLAW DS           AM J DIS CHILD                 109   101 965",
    "009   SHWACHMAN H           N ENGL J MED                   286  1300 972",
    "010   HOLSCLAW DS           J UROL                         106   568 971",
    "011   HOLSCLAW DS           PEDIATRICS                      48   442 971",
    "012   KOPITO LE             FERTIL STERIL                   24   512 973",
    "013   OPPENHEIMER EH        J PEDIATR                       77   991 970",
    "014   WOOD RE               AM REV RESPIR DIS              113   833 976",
    "015   OPPENHEIMER EH        PERSPECT PEDIATR PATHOL          2   241 975",
    "016   DOGGETT RG            J PEDIATR                       68   215 966",
    "017   KULCZYCKI LL          N ENGL J MED                   259   409 958",
    "018   VALMAN HB             ARCH DIS CHILD                  46   805 971",
    "019   KESSLER WR            PEDIATRICS                       8   648 951",
    "020   ANON                  J PEDIATR                       88   711 976",
    "021   GIBSON LE             PROC FOR QUANTITATIVE ION                975",
    "022   SHWACHMAN H           AM J DIS CHILD                  96     6 958",
    "023   WARING WW             ADV PEDIATR                     23   401 976",
    "024   HUANG NN              GUIDE TO DRUG THERAPY IN PATI            974",
    "025   TECKLIN JS            PHYS THER                       55  1081 975",
    "026   STERN RC              CLIN PEDIATR                    11   521 972",
    "027   HANDWERGER S          N ENGL J MED                   281   451 969",
    "028   HOLSCLAW DS           J PEDIATR                       76   829 970",
    "029   HOLSCLAW DS           PEDIATRICS                      48    51 971",
    "030   SIASSI B              J PEDIATR                       78   794 971",
    "031   KELMINSON LL          PEDIATRICS                      39    24 967",
    "032   GAYTON WF             AM J DIS CHILD                 126   856 973",
    "033   GAYTON WF             PEDIATRICS                      59   888 977",
    "034   BOYLE IR              J PEDIATR                       88   318 976",
    "035   SHWACHMAN H           MEDICINE (BALTIMORE)            56   129 977"
  ],
  "citations": [
    "1   CHO YW                J CLIN PHARMACOL                21   224 981",
    "2   STANGHELLE JK         ACTA PAEDIATR SCAND             72   935 983"
  ]
}