{
  "paperNumber": "79155",
  "recordNumber": "01135",
  "acessionNumber": "79177182",
  "authors": [
    "Dandona-P",
    "Hodson-M",
    "Bell-J",
    "Ramdial-L",
    "Batten-J-C."
  ],
  "title": "Serum-immunoreactive-trypsin concentrations in cystic fibrosis [letter].",
  "source": "Lancet. 1979 May 12. 1(8124). P 1032.",
  "majorSubjects": [
    "CYSTIC-FIBROSIS: di",
    "TRYPSIN: bl."
  ],
  "minorSubjects": [
    "ADOLESCENCE",
    "ADULT",
    "AGE-FACTORS",
    "CHILD",
    "CHILD-PRESCHOOL.",
    "HETEROZYGOTE-DETECTION",
    "HUMAN",
    "INFANT-NEWBORN",
    "TRYPSIN: im."
  ],
  "abstractExtract": "We measured immunoreactive trypsin (IRT) concentrations in 32 patients with established cystic fibrosis and in 16 parents (heterozygotes) of patients with CF.  29 patients (91%) and 6 parents (38%) had abnormal trypsin concentrations.  We found that in only 3 out of the 29 patients with abnormal IRT was the concentration supranormal.  Our data suggest that low IRT concentrations are an excellent index of diminished pancreatic reserve in CF and that serum-IRT concentration would be a useful diagnostic test.  The fact that CF patients at birth invariably have very high IRT concentrations which fall with age and the progress of the disease, allied with the fact that heterozygotes have high concentrations, supports the previous suggestion that an uncontrolled hypersecretion of zymogen granules is the basic cellular defect in CF.",
  "references": [
    "000   CROSSLEY JR           LANCET                           1   472 979"
  ],
  "citations": [
    "1   KING DN               LANCET                           2  1217 979",
    "2   DOMINICI R            RIC CLIN LAB                    10   511 980",
    "3   FELBER JP             RIC CLIN LAB                    10    55 980",
    "4   BURLINA A             SCAND J GASTROENTEROL           15    35 980",
    "5   VEZZADINI P           SCAND J GASTROENTEROL           15    29 980",
    "6   FOO Y                 J CLIN PATHOL                   33  1102 980",
    "7   DUFFY MJ              CLIN CHIM ACTA                 103   233 980",
    "8   ODONNELL MD           CLIN CHIM ACTA                 104   265 980",
    "9   DANDONA P             LANCET                           1   380 981",
    "10   DURIE PR              PEDIATR RES                     15  1351 981",
    "11   DURIE PR              J PEDIATR GASTROENTEROL NUTR     1   337 982",
    "12   HEELEY AF             CLIN CHEM                       29  2011 983",
    "13   MASOERO G             AM J DIS CHILD                 137   167 983",
    "14   ANDRIULLI A           J CLIN GASTROENTEROL             6   239 984",
    "15   KOOP H                CLIN GASTROENTEROL              13   739 984",
    "16   HJELM M               CLIN BIOCHEM                    17   284 984",
    "17   HODSON ME             POSTGRAD MED J                  60   225 984",
    "18   DURIE PR              PEDIATR RES                     20   209 986"
  ]
}