{
  "paperNumber": "76016",
  "recordNumber": "00371",
  "acessionNumber": "76182691",
  "authors": [
    "Isenberg-J-N",
    "Sahlstrom-S-J",
    "Sharp-H-L."
  ],
  "title": "The glycoprotein-degrading potential of peripheral leukocytes in cystic fibrosis.",
  "source": "Am-Rev-Respir-Dis. 1976 Apr. 113(4). P 567-9.",
  "majorSubjects": [
    "CYSTIC-FIBROSIS: bl",
    "GLYCOPROTEINS: me",
    "LEUKOCYTES: en."
  ],
  "minorSubjects": [
    "ACETYLGLUCOSAMINIDASE: bl",
    "ADOLESCENCE",
    "ADULT.",
    "ASPARTYLGLUCOSYLAMINASE: bl",
    "CHILD-PRESCHOOL",
    "CYSTIC-FIBROSIS: en.",
    "FEMALE",
    "FUCOSIDASE: bl",
    "GALACTOSIDASES: bl",
    "HUMAN",
    "IN-VITRO.",
    "LYSOSOMES: en",
    "MALE",
    "MANNOSIDASES: bl",
    "SUPPORT-U-S-GOVT-P-H-S."
  ],
  "abstractExtract": "In this study, the potential problems and discrepancies in cill culture techniques were avoided by isolating leukocytes from the peripheral blood of patients with cystic fibrosis and healthy human volunteers and preparing homogenates to determine the specific activities of 5 lysosomal enzymes involved in the degradation of glycoproteins. Four lysosomal hydrolases involved in the breakdown of the carbohydrate side chain were assayed using artificial substrates. The fifth enzyme, aspartylglucosamine amido hydrolase, which cleaves the linkage between this side chain and the peptide backbone, was assayed with natural substrate. No differences in enzyme activities between the 2 leukocyte sources were observed. Because no enzyme activities were deficient and no compensatory increases were noted, we concluded that the thick, glycoprotein-rich, exocrine secretions in cystic fibrosis cannot be attributed to a defect in their catabolism.",
  "references": [
    "001   DISCHE Z              ANN NY ACAD SCI                 93   526 962",
    "002   KNAUFF RE             CLIN CHIM ACTA                  19   245 968",
    "004   BARRETT AJ            IN: DINGLE JT                        116 973",
    "005   LOWRY OH              J BIOL CHEM                    193   265 951",
    "006   WIESMANN UN           J PEDIATR                       77   685 970",
    "007   KRAUS I               PEDIATRICS                      47  1010 971",
    "008   GIBBS GE              SCIENCE                        167   993 970",
    "009   RUSSELL SB            J MED GENET                      8   441 971",
    "010   BUTTERWORTH J         CLIN CHIM ACTA                  40   139 972",
    "011   SOMER H               CLIN CHIM ACTA                  60   219 975",
    "012   LOUISOT P             CLIN CHIM ACTA                  48   373 973",
    "013   BUTTERWORTH J         CLIN CHIM ACTA                  56   159 974"
  ],
  "citations": [
    "1   JAKEL HP              BIOL ZENTRALBL                  98    55 979",
    "2   MARGOLIES R           PEDIATR RES                     17   931 983"
  ]
}