{
  "paperNumber": "77036",
  "recordNumber": "00618",
  "acessionNumber": "77220556",
  "authors": [
    "Lipson-A",
    "Meikle-H."
  ],
  "title": "Porcine pancreatin as a source of salmonella infection in children with cystic fibrosis.",
  "source": "Arch-Dis-Child. 1977 Jul. 52(7). P 569-72.",
  "majorSubjects": [
    "DRUG-CONTAMINATION",
    "PANCREATIN: ae",
    "SALMONELLA-INFECTIONS: et."
  ],
  "minorSubjects": [
    "CHILD-PRESCHOOL",
    "CYSTIC-FIBROSIS: dt",
    "DRUG-CONTAMINATION: pc.",
    "FEMALE",
    "HUMAN",
    "INFANT",
    "MALE",
    "PANCREATIN: st, tu."
  ],
  "abstractExtract": "Contamination of a powdered preparation of pancreatin with Salmonella schwarzengrund and S. eimsbuettel resulted in the infection of at least 31% of one group of paediatric patients with cystic fibrosis. The pancreatin contained very small numbers of Salmonellae, the infecting dose in at least one child being less than 44 organisms. More stringent bacteriological standards are needed for pharmaceuticals and foods used by paediatric patients.",
  "references": [
    "001   ARMSTRONG RW          AM J EPIDEMIOL                  91   300 970",
    "002   BOHNHOFF M            J INFECT DIS                   111   117 962",
    "003   BOWMER EJ             AM J MED SCI                   247   467 964",
    "004   ANON                  BRITISH PHARMACOPOEIA NO 340             973",
    "005   ANON                  COMMUNICABLE DIS REPORT 1975             975",
    "006   ANON                  COMMUNICABLE DIS REPORT 1976             976",
    "007   CHRISTIE AB           INFECT DIS                            20 974",
    "008   CRAVEN PC             LANCET                           1   788 975",
    "009   DRACHMAN RH           PEDIATR CLIN NORTH AM           21   711 974",
    "010   ANON                  CODE OF HYGENIC PRACTICE FOR             976",
    "011   GLENCROSS EJG         BR MED J                         2   376 972",
    "012   GORDON JE             MED CLIN NORTH AM               54  1495 970",
    "013   GUINEE PAM            ZENTRALBL BAKTERIOL            231    97 975",
    "014   HOOK EW               BULL NY ACAD MED                37   499 961",
    "015   HORNICK RB            N ENGL J MED                   283   686 970",
    "016   KALLINGS LO           ACTA PHARMACEUTICA SUEDICA       3   219 966",
    "017   KRUGMAN S             INFECT DIS CHILDREN AND ADULT        261 973",
    "018   ANON                  LANCET                           1   830 972",
    "019   LANG DJ               N ENGL J MED                   276   829 967",
    "020   MCCULLOUGH NB         J INFECT DIS                    88   276 951",
    "021   MCCULLOUGH NB         J INFECT DIS                    89   209 951",
    "022   MCCULLOUGH NB         J INFECT DIS                    89   259 951",
    "023   PROST E               ANNU REV MICROBIOL              21   495 967",
    "024   ROWE B                BR MED J                         4    51 975"
  ],
  "citations": [
    "1   TURNBULL PCB          CLIN GASTROENTEROL               8   663 979",
    "2   PARK RW               GASTROENTEROLOGY                81  1143 981",
    "3   CANTEY JR             J INFECT DIS                   143   440 981",
    "4   CALVERT CA            J AM ANIM HOSP ASSOC            21   499 985"
  ]
}