{
  "paperNumber": "74097",
  "recordNumber": "00096",
  "acessionNumber": "75042703",
  "authors": [
    "Dolan-T-F-Jr",
    "Touloukian-R-J."
  ],
  "title": "Familial meconium ileus not associated with cystic fibrosis.",
  "source": "J-Pediatr-Surg. 1974 Dec. 9(6). P 821-24.",
  "majorSubjects": [
    "INTESTINAL-OBSTRUCTION: fg",
    "MECONIUM."
  ],
  "minorSubjects": [
    "CHILD-PRESCHOOL",
    "CYSTIC-FIBROSIS: co",
    "HUMAN",
    "INFANT-NEWBORN.",
    "INTESTINAL-OBSTRUCTION: et, ra",
    "MALE."
  ],
  "abstractExtract": "With rare exceptions, patients with meconium ileus have cystic fibrosis of the pancreas with pancreatic achylia, elevated salt content of sweat, and characteristic pulmonary manifestations.  We wish to report the occurrence of meconium ileus in two full-term siblings with normal pancreatic function and no evidence of cystic fibrosis by history of physical findings, and with normal sweat electrolytes.  To our knowledge this is the first report of familial meconium ileus without associated cystic fibrosis of the pancreas or pancreatic insufficiency.",
  "references": [
    "001   RICKHAM PP            AM J SURG                      109   173 965",
    "002   GELLIS SS             YEARBOOK OF PEDIATRICS               204 966",
    "003   MACLAURIN C           AUST NZ J SURG                  34   196 964",
    "004   EMERY JL              ARCH DIS CHILD                  32    17 957",
    "005   MEEKER IA             SURG CLIN NORTH AM              44  1483 969",
    "006   BRETON A              SEM HOP PARIS                   35  1101 959",
    "007   KORNBLITH BA          AM J PATHOL                      5   249 929",
    "008   HURWITT ES            AM J DIS CHILD                  64   443 942",
    "009   AUBURN RP             SURGERY                         65   689 969",
    "010   CHING NPH             ARCH SURG                       90    65 965",
    "011   GILLIS DA             CAN MED ASSOC J                 92   225 965"
  ],
  "citations": [
    "1   SHIGEMOTO H           J PEDIATR SURG                  13   475 978",
    "2   ROSENSTEIN BJ         AM J DIS CHILD                 132   167 978",
    "3   YOSHIKAWA Y           ACTA PATHOL JAP                 31   845 981",
    "4   PARK RW               GASTROENTEROLOGY                81  1143 981",
    "5   OLSEN MM              J PEDIATR SURG                  17   479 982",
    "6   HILLEMEIER AC         PEDIATRICS                      69   325 982",
    "7   ROSENSTEIN BJ         JOHNS HOPKINS MED J            150   113 982",
    "8   TAL A                 CLIN PEDIATR                    24   460 985",
    "9   LAMBERTY JM           ANAESTHESIA                     40   448 985",
    "10   SAMUEL N              J ULTRASOUND MED                 5   425 986"
  ]
}