{
  "paperNumber": "76116",
  "recordNumber": "00470",
  "acessionNumber": "76096876",
  "authors": [
    "Papp-Z",
    "Karsai-T",
    "Gyurkovits-K."
  ],
  "title": "Letter: Protein level in the meconium of a homozygotic and a heterozygotic infant with cystic fibrosis.",
  "source": "J-Pediatr. 1976 Jan. 88(1). P 151.",
  "majorSubjects": [
    "CYSTIC-FIBROSIS: me",
    "MECONIUM: an",
    "PROTEINS: an."
  ],
  "minorSubjects": [
    "COMPARATIVE-STUDY",
    "CYSTIC-FIBROSIS: fg",
    "HETEROZYGOTE",
    "HOMOZYGOTE.",
    "HUMAN",
    "INFANT-NEWBORN",
    "MALE."
  ],
  "abstractExtract": "In our patient, the second child of a married couple heterozygous for cystic fibrosis , the meconium protein content was higher than that of controls.  He has no symptoms of cystic fibrosis.  The determination of sodium and chloride ions in the sweat excluded homozygosity; the bromide test led us to conclude the child to be a heterozygote.  In our patient the protein content of the meconium, the majority of which was albumin, was two- to threefold that of the controls.  This elevated protein content, however, was not characteristic of homozygosity.  Our results lead us to conclude that a high protein content of meconium does not unconditionally indicate the homozygotic state for cystic fibrosis.  It would appear that heterozygosity for cystic fibrosis is not completely without abnormality.  Our findings perhaps explain \"false positive\" results recorded in the literature.  High-protein content in the meconium may be useful in the identification of heterozygotes too.",
  "references": [
    "001   BUCHANAN DJ           PEDIATRICS                       9   304 952",
    "002   SCHUTT WH             ARCH DIS CHILD                  43   178 968",
    "003   GREEN MN              PEDIATRICS                      41   989 968",
    "004   PROSSER R             ARCH DIS CHILD                  49   597 974",
    "005   KOLLBERG H            ARCH DIS CHILD                  47   836 972",
    "006   BULL FE               ARCH DIS CHILD                  49   602 974"
  ],
  "citations": [
    "1   PAPP Z                CLIN GENET                      11   431 977"
  ]
}