{
  "paperNumber": "76054",
  "recordNumber": "00409",
  "acessionNumber": "77067410",
  "authors": [
    "Anderson-L-C",
    "Smith-Q-T",
    "Shapiro-B-L."
  ],
  "title": "Cellular glycosaminoglycans in lymphocytes from patients with cystic fibrosis.",
  "source": "Clin-Chim-Acta. 1976 Nov 15. 73(1). P 63-5.",
  "majorSubjects": [
    "CYSTIC-FIBROSIS: bl",
    "GLYCOSAMINOGLYCANS: bl",
    "LYMPHOCYTES: me."
  ],
  "minorSubjects": [
    "ELECTROPHORESIS-CELLULOSE-ACETATE",
    "GALACTOSAMINE: an.",
    "GLUCOSAMINE:  an",
    "HUMAN."
  ],
  "abstractExtract": "Cellular glycosaminoglycans were isolated from lymphocytes from patients with cystic fibrosis and controls. The isolated glycosaminoglycans were fractionated by cellulose acetate electrophoresis, analyzed for glucosamine and galactosamine content, and subjected to hydrolysis with bovine testicular hyaluronidase. The total glycosaminoglycan content, the per cent glucosamine and galactosamine, and the distribution of cellular glycosaminoglycans in circulating lymphocytes in cystic fibrosis were no different from controls.",
  "references": [
    "001   DANES BS              BIOCHEM GENET                   12   359 974",
    "002   BOYUM A               SCAND J CLIN LAB INVEST SUPPL   97    77 968",
    "003   LINDE A               CALC TISS RES                   12   281 973",
    "004   BREEN M               ANAL BIOCHEM                    35   146 970",
    "005   MURPHY D              CLIN CHIM ACTA                  53   145 974",
    "006   SCHUBERT M            PRIMER ON CONNECTIVE TISS             68 968",
    "007   MURATA K              CLIN CHIM ACTA                  57   115 974",
    "008   TANIGUCHI N           BIOCHEM MED                     11   217 974",
    "009   WELCH DW              PEDIATR RES                      9   698 975"
  ],
  "citations": [
    "1   CAPEAU J              BIOMEDICINE                     28   124 978",
    "2   HUESO P               REV ESP FISIOL                  34   339 978",
    "3   LATIF KA              NUTR REP INT                    24   471 981",
    "4   SHAPIRO BL            SCIENCE                        216   417 982",
    "5   ASTAKHOVA TA          TER ARKH                        59    62 987"
  ]
}