{
  "paperNumber": "75015",
  "recordNumber": "00182",
  "acessionNumber": "75125836",
  "authors": [
    "Wood-R-E",
    "Herman-C-J",
    "Johnson-K-W",
    "di-SantAgnese-P-A."
  ],
  "title": "Pneumatosis coli in cystic fibrosis: clinical, radiological, and pathological features.",
  "source": "Am-J-Dis-Child. 1975 Feb. 129(2). P 246-8.",
  "majorSubjects": [
    "CYSTIC-FIBROSIS: co",
    "PNEUMATOSIS-CYSTOIDES-INTESTINALIS: et."
  ],
  "minorSubjects": [
    "ADOLESCENCE",
    "BARIUM-SULFATE: du",
    "CASE-REPORT",
    "CYSTIC-FIBROSIS: pa.",
    "HUMAN",
    "INTESTINE-LARGE: pa",
    "MALE.",
    "PNEUMATOSIS-CYSTOIDES-INTESTINALIS: ra, pa",
    "RECTAL-PROLAPSE: et.",
    "RESPIRATORY-FUNCTION-TESTS."
  ],
  "abstractExtract": "A patient with cystic fibrosis was found to have pneumatosis coli associted with rectal prolapse.  In cystic fibrosis there are several factors predisposing to pneumatosis, yet it is rarely reported.  Symptoms are nonspecific, and the diagnosis should be considered in patients with cystic fibrosis or other chronic lung disease and vague abdominal complaints.",
  "references": [
    "001   ECKER JA              AM J GASTROENTEROL              56   125 971",
    "002   KOSS LG               ARCH PATHOL                     53   523 952",
    "003   DOUB HP               JAMA                           172  1238 960",
    "004   KEYTING WS            RADIOLOGY                       76   733 961",
    "005   CREEVEY K             N ENGL J MED                   259   912 958",
    "006   MARSHAK RH            AM J DIG DIS                     1    99 956",
    "007   SMITH WF              GASTROENTEROLOGY                35   528 958",
    "008   WHITE H               RADIOL CLIN NORTH AM             1   539 963",
    "009   KULCZYCKI LL          N ENGL J MED                   259   409 958",
    "010   NELSON SW             AM J ROENTG RAD THER NUCL MED  115   225 972"
  ],
  "citations": [
    "1   OLMSTED WW            GASTROINTEST RADIOL              1   177 976",
    "2   EIMOTO T              ACTA PATHOL JAP                 28   481 978",
    "3   KLEINMAN PK           AM J DIS CHILD                 134  1149 980",
    "4   DORSTEN JF            J AM OSTEOPATH ASSOC            81   123 981",
    "5   WALL LL               J PEDIATR                      101   745 982",
    "6   BALI A                BR MED J                       287  1011 983",
    "7   KLIEGMAN RM           N ENGL J MED                   310  1093 984",
    "8   HUBBARD VS            SEM RESPIR MED                   6   299 985",
    "9   PIETERSE AS           HUM PATHOL                      16   683 985",
    "10   AMMONS MA             TRANSPLANTAT PROC               18  1868 986",
    "11   HERNANZSCHULMAN M     RADIOLOGY                      160   497 986",
    "12   YEAGER AM             PEDIATR RADIOL                  17    18 987"
  ]
}