{
  "paperNumber": "75136",
  "recordNumber": "00302",
  "acessionNumber": "76076877",
  "authors": [
    "Araki-H",
    "Field-M",
    "Shwachman-H."
  ],
  "title": "A new assay for cystic fibrosis factor: effects of sera from patients with cystic fibrosis in the in vitro electrical properties of rat jejunum.",
  "source": "Pediatr-Res. 1975 Dec. 9(12). P 932-4.",
  "majorSubjects": [
    "CYSTIC-FIBROSIS: bl",
    "JEJUNUM: de."
  ],
  "minorSubjects": [
    "ANIMAL",
    "BIOLOGICAL-ASSAY",
    "FRUCTOSE: pd",
    "GLUCOSE: pd",
    "HUMAN.",
    "IN-VITRO",
    "JEJUNUM: ph",
    "RATS",
    "TEMPERATURE."
  ],
  "abstractExtract": "The in vitro electrical properties of rat jejunum were utilized to assay a factor or factors in serum from patients with cystic fibrosis (CF). Sera from patients with CF were found to decrease short circuit current (SCC) and the SCC response to glucose, and to increase electrical resistance. These effects were present in all 24 patients with CF and 10 of 14 parents of CF patients and absent from the serum of 21 control subjects. This quantitative technique provides an alternative to the ciliostatic assays for the detection of the CF factor or factors.",
  "references": [
    "001   ASANO T               AM J PHYSIOL                   207   415 964",
    "002   BERATIS NG            PEDIATR RES                      7   958 973",
    "003   BOWMAN BH             SCIENCE                        164   325 969",
    "004   BOWMAN BH             SCIENCE                        167   871 970",
    "005   BROWN GA              LANCET                           2   639 971",
    "006   KAISER D              PEDIATR RES                      5   167 971",
    "007   LOCKHART LH           TEX REP BIOL MED                31   631 973",
    "008   MANGOS JA             SCIENCE                        158   135 967",
    "009   MORIN CL              BIOMEDICINE EXPRESS             19   133 973",
    "010   SCHULTZ SG            J GEN PHYSIOL                   47   567 964",
    "011   SPOCK A               PEDIATR RES                      1   173 967",
    "012   TAUSSIG LM            LANCET                           1  1367 972",
    "013   USSING HH             ACTA PHYSIOL SCAND              23   110 951",
    "014   WOOD RE               LANCET                           2  1452 973"
  ],
  "citations": [
    "1   WOOD RE               AM REV RESPIR DIS              113   833 976",
    "2   DISANTAGNESE PA       N ENGL J MED                   295   534 976",
    "3   SHWACHMAN H           MEDICINE                        56   129 977",
    "4   ARAKI H               LANCET                           1   793 978",
    "5   IMPERO JE             PEDIATR RES                     12   108 978",
    "6   GILMORE JP            PROC SOC EXP BIOL MED          157    70 978",
    "7   MORRISSEY SM          MONOGR PAEDIATR                 10   102 979",
    "8   NAGY EC               PEDIATR RES                     13   729 979",
    "9   TUCKER RD             PEDIATR RES                     13  1371 979",
    "10   WILL PC               PEDIATR RES                     13  1129 979",
    "11   TUCKER RD             IEEE TRANS BIOMED ENG           26   607 979",
    "12   SCANLIN TF            CLIN CHEST MED                   1   424 980",
    "13   WILL PC               PEDIATR RES                     14  1245 980",
    "14   BANCHINI G            PEDIATR RES                     15  1073 981",
    "15   RUDIN DO              BIOL PSYCHIAT                   16   373 981",
    "16   ALBAZZAZ FJ           RESPIRATION                     46    88 984"
  ]
}