{
  "paperNumber": "74068",
  "recordNumber": "00067",
  "acessionNumber": "77050936",
  "authors": [
    "Bearn-A-G."
  ],
  "title": "The expression of inherited metabolic disease in cultured cells.",
  "source": "Harvey-Lect. 1974-75. 70 Series. P 75-91.",
  "majorSubjects": [
    "CELLS-CULTURED",
    "CYSTIC-FIBROSIS: me.",
    "METABOLISM-INBORN-ERRORS:  me."
  ],
  "minorSubjects": [
    "HUMAN",
    "LIPOCHONDRODYSTROPHY: me",
    "SUPPORT-U-S-GOVT-NON-P-H-S."
  ],
  "abstractExtract": "Since 1900 improvements in general hygiene, and the development of antibiotic therapy have enabled many of the epidemic infectious diseases, particularly those of infancy and early childhood, increasingly to be controlled.  In contrast, the morbidity and mortality of diseases of genetic origin have been little affected. The rational use of cell culture as an investigative technique in inherited metabolic disease is rooted in the simple biologic truth that, since a full complement of chromosomes is present in all somatic cells, it should be possible to detect the specific biochemical consequences of gene activity in cultured fibroblasts unless, during the process of differentiation, genes are irreversibly inactivated.  The usefulness of tissue culture in investigating inherited metabolic disease does not rest with the biochemical identification of the primary defect.  The cells in culture provide a model system of the disease, which can be used to test the possible effectiveness of therapeutic agents.  Tissue culture techniques indicated that the cells derived from patients with cystic fibrosis showed metachromasia.  Although the isolation and characterization of cystic fibrosis from cystic fibrosis serum has not been accomplished, a number of properties have been described.",
  "references": [
    "001   BATESON W             ESSAYS AND ADDRESSES                  93 928",
    "002   BEARN AG              N ENGL J MED                   286   764 972",
    "003   BEARN AG              TRANS ASSOC AM PHYSICIANS       82   248 969",
    "004   BERGGARD I            AM J MED                        39   221 965",
    "005   BOWMAN BH             TEX REP BIOL MED                31   611 973",
    "006   BOWMAN BH             SCIENCE                        164   325 969",
    "007   BOWMAN BH             SCIENCE                        167   871 970",
    "008   BOWMAN BH             PROC NAT ACAD SCI USA           70   548 973",
    "009   BRANTE G              SCAND J CLIN LAB INVEST          4    43 952",
    "010   CARREL A              IN: NOBEL LECTURES PHYSIOLOGY        444 964",
    "011   CHILDS B              IN: SUTTON HE                          3 972",
    "012   CONOVER JH            PEDIATR RES                      7   220 973",
    "013   CONOVER JH            LANCET                           2  1501 973",
    "014   DANES BS              J EXP MED                      123     1 966",
    "015   DANES BS              J EXP MED                      124  1181 966",
    "016   DANES BS              J EXP MED                      126   509 967",
    "017   DANES BS              J EXP MED                      129   775 969",
    "018   DANES BS              BIOCHEM BIOPHYS RES COMMUN      36   919 969",
    "019   DANES BS              J EXP MED                      132   765 970",
    "020   DANES BS              J EXP MED                      137  1538 973",
    "022   DARLINGTON GJ         SCIENCE                        185   859 974",
    "023   DI SANTAGNESE PA      PEDIATRICS                      12   549 953",
    "024   DORFMAN A             PROC NAT ACAD SCI USA           43   443 957",
    "025   FRATANTONI JC         PROC NAT ACAD SCI USA           60   699 968",
    "026   GARROD AE             LANCET                           2     1 908",
    "027$  GARROD AE             BR MED J                             747 924",
    "028   GARROD AE             Q J MED                          6   242 913",
    "029   HARRISON RG           HARVEY LECTURES                  3   199 907",
    "030   HERZBERG V            J CLIN INVEST                   52  2732 973",
    "031   KESSLER WR            PEDIATRICS                       8   648 951",
    "032   KEYNES G              LIFE OF WILLIAM HARVEY               368 966",
    "033   LOCKHART LH           TEX REP BIOL MED                31   631 973",
    "034   LYON MF               AM J HUM GENET                  14   135 962",
    "035   MCKUSICK VA           HERITABLE DISORDERS OF CONNEC            972",
    "036   MCKUSICK VA           MENDELIAN INHERIT IN MAN                 975",
    "037   MCKUSICK VA           LANCET                           1   993 972",
    "038   MANGOS JA             SCIENCE                        158   135 967",
    "039   MEYER K               PROC SOC EXP BIOL MED           97   275 958",
    "040   NEUFELD EF            IN: MCKUSICK VA                      141 973",
    "041$  NEUFELD EF            IN: STEINBERG AG                10    81 974",
    "042   POLLEY MJ             J MED GENET                     11   249 974",
    "044   SPOCK A               PEDIATR RES                      1   173 967",
    "045   WHITTERIDGE G         WILLIAM HARVEY AND THE CIRCUL            971"
  ],
  "citations": []
}