{
  "paperNumber": "75072",
  "recordNumber": "00238",
  "acessionNumber": "76065031",
  "authors": [
    "Shwachman-H",
    "Khaw-K-T",
    "Kowalski-S-M."
  ],
  "title": "The management of cystic fibrosis.  Observations on gentamycin when used with other antibiotics in pulmonary infections associated with cystic fibrosis.",
  "source": "Clin-Pediatr (Phila). 1975 Dec. 14(12). P 1115-8.",
  "majorSubjects": [
    "ANTIBIOTICS: tu",
    "CYSTIC-FIBROSIS: dt",
    "GENTAMICINS: tu.",
    "LUNG-DISEASES: dt."
  ],
  "minorSubjects": [
    "CYSTIC-FIBROSIS: co",
    "DRUG-THERAPY-COMBINATION",
    "FEMALE",
    "HUMAN.",
    "LUNG-DISEASES: et",
    "MALE",
    "PSEUDOMONAS-INFECTIONS: dt."
  ],
  "abstractExtract": "From 1971 to 1973, we hospitalized 41 symptomatic patients with cystic fibrosis for intensive pulmonary therapy.  The more severely ill patients were admitted more than once during this period.  Our study included 100 courses of such intensive treatment.  Garamycin pediatric injectable, containing 10 mg/ml of the active ingredient, was administered intravenously to all patients in divided doses of 3.0 to 5.0 mg/kg/day.  The purpose of the study was to evaluate the tolerance, pharmacokinetics, and efficacy of garamycin when administered parenterally to cystic fibrosis patients with serious infections.  During the 100 courses of treatment, clinical improvement was rated as follows: significant or definite improvement, 39; moderate improvement, 50; slight improvement, 9; and no change, 2.  The use of garamycin pediatric injectable is safe and can be helpful in the management of the pulmonary infectious complications of cystic fibrosis when employed along with other well-established modalities of therapy.",
  "references": [
    "001   ANDERSEN DH           AM J DIS CHILD                  56   344 938",
    "002   GREEN MN              PEDIATRICS                      41   989 968",
    "003   STEPHAN U             IN: MANGOS JA                        281 973",
    "004   STEPHAN U             PADIATRISCHE PRAXIS             12   487 973",
    "005   SHWACHMAN H           ANN NY ACAD SCI                 93   600 962",
    "006   SHWACHMAN H           CF IN PEDIATRIC THERAPY              573 972",
    "007   GINGELL JC            J INFECT DIS                   119   396 969",
    "008   KULCZYCKI LL          CLIN PEDIATR                     9   390 970"
  ],
  "citations": [
    "1   HOIBY N               ACTA PATH MICROBIOL SCAND (C) S262     3 977",
    "2   SHWACHMAN H           MEDICINE                        56   129 977",
    "3   SCHIOTZ PO            HUM HERED                       28   293 978",
    "4   HOIBY N               ACTA PAEDIATR SCAND SUPPL 301 1982    75 982",
    "5   HOOGKAMPKORSTANJE JAA J ANTIMICROB CHEMOTHER          12   175 983"
  ]
}