{
  "paperNumber": "77046",
  "recordNumber": "00628",
  "acessionNumber": "77203082",
  "authors": [
    "Scott-J-K."
  ],
  "title": "Cystic fibrosis - Camp Couchiching.  four summers.",
  "source": "Can-Nurse. 1977 Jun. 73(6). P 14-9.",
  "majorSubjects": [
    "CAMPING",
    "CYSTIC-FIBROSIS: rh."
  ],
  "minorSubjects": [
    "ADOLESCENCE",
    "CHILD",
    "CYSTIC-FIBROSIS: dt",
    "FEMALE",
    "HUMAN",
    "MALE.",
    "ONTARIO",
    "PATIENTS: ed",
    "SPORTS",
    "PATIENT-EDUCATION."
  ],
  "abstractExtract": "The camp on Lake Couchiching for children with CF was started in 1973.  Initially, certain changes were necessary to make the camp suitable for CF campers.  Most of the activities normally available to campers at Camp Couchiching are continued as usual for our CF campers during the month of August.  Staff members spend a great deal of time teaching the campers about the need for pancreatic enzymes.  Each cystic child requires two or three physiotherapy treatments every day after the inhalation of prescribed bronchodilators and antibiotics.",
  "references": [
    "001   CAMPBELL IM           LIPIDS                           9   916 974",
    "002   CROZIER DN            PEDIATR CLIN NORTH AM           21   935 974",
    "003   DI SANTAGNESE PA      N ENGL J MED                   277  1287 967",
    "004   FRIEDMAN M            LANCET                           1   310 975",
    "005   ANON                  J PEDIATR                       88   711 976",
    "006   STERN RC              J PEDIATR                       89   412 976",
    "007   STERN RC              J PEDIATR                       89   406 976"
  ],
  "citations": [
    "1   STANGHELLE JK         ACTA PAEDIATR SCAND             72   935 983"
  ]
}