{
  "paperNumber": "78136",
  "recordNumber": "00916",
  "acessionNumber": "79007795",
  "authors": [
    "Rosenstein-B-J",
    "Langbaum-T-S",
    "Gordes-E",
    "Brusilow-S-W."
  ],
  "title": "Cystic fibrosis.  Problems encountered with sweat testing.",
  "source": "JAMA. 1978 Oct 27. 240(18). P 1987-8.",
  "majorSubjects": [
    "CYSTIC-FIBROSIS: di",
    "SWEAT: an."
  ],
  "minorSubjects": [
    "CHLORIDES: an",
    "FALSE-NEGATIVE-REACTIONS",
    "FALSE-POSITIVE-REACTIONS.",
    "HUMAN",
    "IONTOPHORESIS",
    "PILOCARPINE: du",
    "SPECIMEN-HANDLING: st."
  ],
  "abstractExtract": "The sweat test is the only practical and reliable laboratory test for confirmation of the diagnosis of cystic fibrosis. Among 234 patients referred to The Johns Hopkins Hospital for sweat testing, 62 had had a previous test; 29 tests had been reported as negative, and 33 tests had been reported as positive. Results of quantitative pilocarpine- iontophoresis sweat tests at this center led to a change in diagnosis in 27 (43.5%) of these 62 patients. Most of the errors were false- positive.",
  "references": [
    "001   WOOD RE               AM REV RESPIR DIS              113   833 976",
    "002   DARLING RC            AM J MED SCI                   225    67 953",
    "003   GIBSON LE             PEDIATRICS                      23   545 959",
    "004   ANON                  J PEDIATR                       88   711 976",
    "005   KOPITO L              PEDIATRICS                      43   794 969",
    "006   SHWACHMAN H           J PEDIATR                       66   432 965",
    "007   ANON                  GAP CONF REP PROB SWEAT TESTI            975",
    "008   MACLEAN WC JR         J PEDIATR                       83    86 973",
    "009   GIBSON LE             CLIN PEDIATR                    12   450 973",
    "010   BRAY PT               CLIN CHIM ACTA                  80   333 977",
    "011   WARING WW             ADV PEDIATR                     23   401 976"
  ],
  "citations": [
    "1   PRIEST JB             JAMA                           242  1970 979",
    "2   SCHWACHMAN H          J PEDIATR                       98   576 981",
    "3   WONG LTK              GUT                             23   744 982",
    "4   ROSENSTEIN BJ         JOHNS HOPKINS MED J            150   113 982",
    "5   WEBSTER HL            CRC CRIT REV CLIN LAB SCI       18   313 983",
    "6   KIRK JM               ANN CLIN BIOCHEM                20   369 983",
    "7   ORENSTEIN DM          SEM RESPIR MED                   6   252 985",
    "8   CHRISTOFFEL KS        J PEDIATR                      107   231 985",
    "9   TAGLE S               REV MED CHIL                   113   758 985",
    "10   ROSENSTEIN BJ         CLIN PEDIATR                    26    78 987"
  ]
}