{
  "paperNumber": "77128",
  "recordNumber": "00709",
  "acessionNumber": "77231256",
  "authors": [
    "Heinrich-H-C",
    "Bender-Gotze-C",
    "Gabbe-E-E",
    "Bartels-H",
    "Oppitz-K-H."
  ],
  "title": "Absorption of inorganic iron- (59Fe2+) in relation to iron stores in pancreatic exocrine insufficiency due to cystic fibrosis.",
  "source": "Klin-Wochenschr. 1977 Jun 15. 55(12). P 587-93.",
  "majorSubjects": [
    "CYSTIC-FIBROSIS: me",
    "IRON: me."
  ],
  "minorSubjects": [
    "CHILD",
    "CHILD-PRESCHOOL",
    "CYTOPLASM: me",
    "HUMAN",
    "INFANT.",
    "INTESTINAL-ABSORPTION",
    "IRON-RADIOISOTOPES",
    "IRON: df.",
    "PANCREATIN: pd",
    "PANCREATITIS: me",
    "WHOLE-BODY-COUNTING."
  ],
  "abstractExtract": "The absorption of 59Fe from a diagnostic 0.56 mg 59Fe2+ dose was measured by 4pi-geometry whole body counting and related to the amount of stainable diffuse cytoplasmatic non heme storage iron in the bone marrow macrophages of children with cystic fibrosis. When the storage iron was within the normal range (+/2+) children with cystic fibrosis absorbed 10-38% (Xa+/-S.D.\u003d21+/-9.3) of the oral 59Fe2+ dose which is identical with the 59Fe-absorption in normal children with normal iron stores (9-45:23+/-8.7%). Depleted iron stores caused an increase of 59Fe-absorption to 43-95% (Xa+/- S.D.\u003d62+/-19) in children with cystic fibrosis and to 45-100% (Xa+/- S.D.\u003d73+/-18) in control children. The interruption or continuation of pancreatin maintenance therapy and the simultaneous administration of 1-1.5 g pancreatin did not influence 59Fe2+ absorption in cystic fibrosis. There is no evidence for a pancreatic factor required for or inhibiting inorganic and food iron absorption in human beings. Iron absorption is controlled also in cystic fibrosis chiefly by the amounts of available storage iron. It is therefore not justified to apprehend the development of hemosiderosis in children with cystic fibrosis who are not or not sufficiently treated with pancreatin.",
  "references": [
    "001   ANDERSEN DH           AM J DIS CHILD                  56   344 938",
    "002   BALCERZAK SP          GASTROENTEROLOGY                53   257 967",
    "003   BIGGS JC              LANCET                           2   814 963",
    "004   BIGGS JC              AUSTRALAS ANN MED               15    36 966",
    "005   DAVIS AE              LANCET                           2     6 962",
    "006   DELLER DJ             AM J DIG DIS                    10   249 965",
    "007   GILLY R               MOD PROBL PEDIATR               10   263 967",
    "008   GOTZE CH              MONATSSCHR KINDERHEILKD        118   210 970",
    "009   GOTZE CH              MONATSSCHR KINDERHEILKD        119    13 971",
    "010   HAUSMANN K            ACTA HAEMATOL (BASEL)           42   193 969",
    "011   HEINRICH HC           IN: HALLBERG L                       213 970",
    "012   HEINRICH HC           ARZNEIMITTEL FORSCH             25   420 975",
    "013   HEINRICH HC           PROC WORKSHOP CONF HOECHS 3RD         34 975",
    "014   HEINRICH HC           KLIN WOCHENSCHR                 45   553 967",
    "015   HEINRICH HC           KLIN WOCHENSCHR                 47   984 969",
    "016   HEINRICH HC           KLIN WOCHENSCHR                 55   587 977",
    "017   HEINRICH HC           KLIN WOCHENSCHR                 49   819 971",
    "018   HEINRICH HC           KLIN WOCHENSCHR                 44   827 966",
    "019   HEINRICH HC           Z KINDERHEILK                  120   251 975",
    "020   KAVIN H               GUT                              8   556 967",
    "021   KINNEY TD             AM J PATHOL                     26   746 950",
    "022   KINNEY TD             J EXP MED                      102   151 955",
    "023   LONGNECKER DS         ARCH PATHOL                     80   148 965",
    "024   MURRAY MJ             GASTROENTEROLOGY                51   694 966",
    "025   SAUNDERS SJ           LANCET                           1   510 962",
    "026   TAYLOR J              J PATHOL BACTERIOL              34   793 931",
    "028   TONZ O                LANCET                           2  1096 965",
    "029   WEISS S               ARCH KINDERHEILK               174   254 966"
  ],
  "citations": [
    "1   HEINRICH HC           KLIN WSCHR                      55   595 977",
    "2   CHASE HP              J PEDIATR                       95   337 979",
    "3   SOLOMONS NW           AM J CLIN NUTR                  34   462 981",
    "4   WAGENER JS            AM J PEDIATR HEMATOL ONCOL       5   153 983",
    "5   ATER JL               PEDIATRICS                      71   810 983",
    "6   HODGES P              J AM DIET ASSOC                 84   664 984",
    "7   WONGMONGKOLRIT T      ACTA NEUROPATH (BERL)           65   265 985"
  ]
}