{
  "paperNumber": "77005",
  "recordNumber": "00587",
  "acessionNumber": "78036889",
  "authors": [
    "Ryssing-E."
  ],
  "title": "Assessment of cor pulmonale in cystic fibrosis by echocardiography.",
  "source": "Acta-Paediatr-Scand. 1977 Nov. 66(6). P 753-6.",
  "majorSubjects": [
    "CYSTIC-FIBROSIS: co",
    "ECHOCARDIOGRAPHY.",
    "PULMONARY-HEART-DISEASE: di."
  ],
  "minorSubjects": [
    "ADOLESCENCE",
    "ADULT",
    "CHILD",
    "CHILD-PRESCHOOL",
    "CYSTIC-FIBROSIS: di.",
    "FEMALE",
    "HEART-ENLARGEMENT",
    "HUMAN",
    "MALE.",
    "PEAK-EXPIRATORY-FLOW-RATE",
    "PULMONARY-HEART-DISEASE: co.",
    "VITAL-CAPACITY."
  ],
  "abstractExtract": "Thirty-one patients with cystic fibrosis of varying severity were examined by echocardiography. Right ventricular dimension (RVD) was above upper normal limit in 14 patients and right ventricular dimension index (RVD index) was higher than the upper normal limit in 11 patients. Furthermore, there was a significant relationship between increasing RVD index and 1) decreasing forced vital capacity (FVC) both actual test results and average 6 months values; and 2) decreasing peak-expiratory flow rate (PEFR) both actual test results and average 6 months values. This observation suggests a persistent heart involvement. Five patients had either heart failure and/or electrocardiographic evidence of right ventricular abnormality. These patients had increased RVD index and one patient with the highest RVD index died 8 weeks after the examination. The present study has shown the usefulness of echocardiographic measurement of right ventricular dimension and of septal motion in assessing cor pulmonale, before development of electrocardiographic abnormalities and right heart failure.",
  "references": [
    "001   DIAMOND MA            CIRCULATION                     43   129 971",
    "002   FEIGENBAUM H          ECHOCARDIOGRAPHY                         972",
    "003   GOLDRING RM           J PEDIATR                       65   501 964",
    "004   GOODMAN DJ            AM J CARDIOL                    33   438 974",
    "005   HOYBYE G              UGESKR LAEGER                  132  2007 970",
    "006   LAURENCEAU JL         CHEST                           69   388 976",
    "007   LUNDSTROM NR          ACTA PAEDIATR SCAND SUPPL      243       974",
    "008   LUNDSTROM NR          ACTA PAEDIATR SCAND             63   257 974",
    "009   LYONS HA              AM J DIS CHILD                 100   196 960",
    "010   MCCANN WD             JAMA                           221  1243 972",
    "011   MOSS AJ               J PEDIATR                       67   797 965",
    "012   PADMAVATI S           BR HEART J                      34   658 972",
    "013   POPP RL               AM J CARDIOL                    24   523 969",
    "014   ROSENTHAL A           PEDIATR CLIN NORTH AM           23   327 976",
    "015   SIASSI B              J PEDIATR                       78   794 971",
    "016   TAJIK AJ              CIRCULATION                     46    36 972",
    "017   WEYMAN AE             CIRCULATION                     54   179 976"
  ],
  "citations": [
    "1   SANTAGNESE PAD        AM J MED                        66   121 979",
    "2   HIRSCHFELD SS         CHEST                           75   351 979",
    "3   MATTHAY RA            BR HEART J                      43   474 980",
    "4   LESTER LA             J PEDIATR                       97   742 980",
    "5   MATTHAY RA            MED CLIN NORTH AM               65   489 981",
    "6   JACOBSTEIN MD         CHEST                           80   399 981",
    "7   MOSS AJ               PEDIATRICS                      70   728 982",
    "8   BECK B                ACTA PAEDIATR SCAND SUPPL 301 1982   125 982",
    "9   JOHNSON SR            OBSTET GYNECOL                  61  S  2 983",
    "10   LESTER LA             SEM RESPIR MED                   6   285 985"
  ]
}