{
  "paperNumber": "79066",
  "recordNumber": "01046",
  "acessionNumber": "79190761",
  "authors": [
    "Keens-T-G",
    "Mansell-A",
    "Krastins-I-R",
    "Levison-H",
    "Bryan-A-C.",
    "Hyland-R-H",
    "Zamel-N."
  ],
  "title": "Evaluation of the single-breath diffusing capacity in asthma and cystic fibrosis.",
  "source": "Chest. 1979 Jul. 76(1). P 41-4.",
  "majorSubjects": [
    "ASTHMA: di",
    "CARBON-MONOXIDE: du",
    "CYSTIC-FIBROSIS: di.",
    "PULMONARY-DIFFUSING-CAPACITY."
  ],
  "minorSubjects": [
    "ADOLESCENCE",
    "ADULT",
    "AIRWAY-OBSTRUCTION: pp",
    "ASTHMA: pp.",
    "BRONCHODILATOR-AGENTS: du",
    "CHILD",
    "CYSTIC-FIBROSIS: pp",
    "HUMAN.",
    "MICROCIRCULATION",
    "PULMONARY-CIRCULATION."
  ],
  "abstractExtract": "To explain why the single-breath carbon monoxide diffusing capacity (Dsb) was, on the average, elevated in 163 asthmatic subjects and 175 patients with cystic fibrosis, we simulated this elevation in ten normal subjects by having them perform the test for Dsb through an inspiratory obstruction. This resulted in an 18 percent increase in Dsb corrected for pulmonary volume. Inhalation of a bronchodilator drug was associated with relief of obstruction and a fall in the corrected Dsb in 31 asthmatic subjects but did not change either the obstruction or the corrected Dsb in 17 patients with cystic fibrosis. We suggest that elevated Dsb in asthma and cystic fibrosis is partly due to maximal inspiration against obstructed airways. This requires abnormally negative intrathoracic pressures, increasing the pulmonary capillary blood volume, and, thereby, increasing the Dsb.",
  "references": [
    "001   WENG TR               AM REV RESPIR DIS               99   719 969",
    "002   OGILVIE CM            BR MED J                         1   768 968",
    "003   EVANS CC              LANCET                           1   891 968",
    "004   COTES JE              J APPL PHYSIOL                  15   372 960",
    "005   STEINER SH            J CLIN INVEST                   44  1623 965",
    "006   SMITH TC              J APPL PHYSIOL                  27   826 969",
    "007   OGILVIE CM            J CLIN INVEST                   36     1 957",
    "008   ROUGHTON FJM          J APPL PHYSIOL                  11   290 957",
    "009   CAREL RS              ISR J MED SCI                    9  1535 973",
    "010   PECORA LJ             J ALLERGY                       37   204 966",
    "011   WAGNER PD             J APPL PHYSIOL                  31   847 971",
    "012   HYATT RE              J APPL PHYSIOL                  21   477 966"
  ],
  "citations": [
    "1   WEINBERGER SE         CHEST                           78   483 980",
    "2   DAVIES NJH            BR J DIS CHEST                  76   105 982",
    "3   RUSSELL NJ            BR J DIS CHEST                  76    35 982",
    "4   OBRODOVICH HM         AM REV RESPIR DIS              125   670 982",
    "5   OGILVIE C             THORAX                          38     5 983",
    "6   COTTON DJ             RESPIR PHYSIOL                  54    19 983",
    "7   GRAHAM BL             AM REV RESPIR DIS              129   403 984",
    "8   COTTON DJ             CHEST                           87   217 985",
    "9   PAOLETTI P            AM REV RESPIR DIS              132   806 985",
    "10   LEBECQUE P            CHEST                           91   693 987"
  ]
}