{
  "paperNumber": "76224",
  "recordNumber": "00577",
  "acessionNumber": "77105326",
  "authors": [
    "Clarke-C-W."
  ],
  "title": "Aspects of serum and sputum antibody in chronic airways obstruction.",
  "source": "Thorax. 1976 Dec. 31(6). P 702-7.",
  "majorSubjects": [
    "AIRWAY-OBSTRUCTION: im",
    "ANTIBODIES: an",
    "SPUTUM: im."
  ],
  "minorSubjects": [
    "BRONCHITIS: im",
    "CHRONIC-DISEASE",
    "CYSTIC-FIBROSIS: im",
    "HUMAN.",
    "IGA:  an",
    "IGG: an",
    "IGM: an",
    "SPUTUM: mi."
  ],
  "abstractExtract": "Immunoglobulin levels and precipitating antibody against a range of microbial antigens were measured in simultaneously collected serum and sputum samples from patients with chronic bronchitis (11), cystic fibrosis (9), bronchiectasis (9), and asthma (4). Sputum was prepared by dialysis and high-speed centrifugation methods. Results showed that it was possible to detect precipitating antibody in the sputum, and the rate was increased when both methods were used. A discrepancy was noted between the detection rate in the sputum and serum. This, combined with the lack of correlation between sputum and serum immunoglobulins, lack of relationship between bronchial inflammation and sputum immunoglobulins, and the lack of IgM in the sputum suggested that the antibody and immunoglobulin were locally produced. Sputum IgA (7S) in patients with chronic bronchitis was significantly lower (P less than 0-05) than that found in patients with cystic fibrosis and bronchiectasis. Significant differences (P less than 0- 05) were also noted in serum IgG levels between patients with chronic bronchitis, bronchiectasis, and cystic fibrosis while serum IgM levels in patients with chronic bronchitis were significantly lower (P less than 0-05) when compared to serum levels in patients with cystic fibrosis. The presence of precipitating antibody in the sputum raises the possibility that type III reactions may be important in the pathogenesis of these conditions.",
  "references": [
    "001   AUSTRIAN R            YALE J BIOL MED                 40   400 968",
    "002   BIBERFELD G           ACTA PATH MICROBIOL SCAND (B)   79   599 971",
    "003   BRANEFORS-HELANDER P  ARCH ALLERG APPL IMMUN          44   585 973",
    "004   BROCKLEHURST WE       IN: ORIE NGM                         279 970",
    "005   BROGAN TD             THORAX                          30    72 975",
    "006   BRUMFITT W            LANCET                           2  1306 957",
    "007   CLARKE CW             POSTGRAD MED J                  51   147 975",
    "008   COLTON T              STATISTICS IN MEDICINE               174 974",
    "009   DEUSCHL H             CLIN EXP IMMUNOL                16   401 974",
    "010   FALK GA               AM REV RESPIR DIS              105    14 972",
    "011   GOTZE O               J EXP MED                      134   90S 971",
    "012   GUMP DW               ARCH INTERN MED                132   847 973",
    "013   KATZ RM               N ENGL J MED                   288   233 973",
    "014$  KILBURN KH            CHEST SUPPL 61S                 65     4 974",
    "015   LEES AW               LANCET                           2  1112 959",
    "016   MCFARLANE H           BR MED J                         1   423 975",
    "017   MARTINEZ-TELLO FJ     J IMMUNOL                      101   989 968",
    "018   MAY JR                CHEMOTHERAPY OF CHRONIC BRONC            972",
    "019   MAY JR                POSTGRAD MED J                  51   144 975",
    "020   MEDICI TC             AM REV RESPIR DIS              103   784 971",
    "021   MEREDITH WM           BASIC MATHEMATICAL AND STATIS        288 967",
    "022   PARISH WE             SYMP SOC GEN MICROBIOL          22   157 972",
    "023   REED CE               YALE J BIOL MED                 40   507 968",
    "024   RYLEY HC              BR J EXP PATHOL                 49   625 968",
    "025   RYLEY HC              J CLIN PATHOL                   26   852 973",
    "026   SHORE SL              THORAX                          28   721 973",
    "027   SMITH H               SYMP SOC GEN MICROBIOL          22     1 972",
    "028   SZETIVANYI I          IN: SAMTER M                     1   356 971",
    "029   TAGER I               N ENGL J MED                   292   563 975",
    "030   VAN DER ZAWAN JC      CLIN ALLERGY                     5   225 975",
    "031   WALLWORK JC           CLIN EXP IMMUNOL                18   303 974",
    "032   WARREN CPW            AM REV RESPIR DIS              109   672 974",
    "033   WITTELS EH            AM REV RESPIR DIS              109   502 974"
  ],
  "citations": [
    "1   CLARKE CW             CLIN ALLERGY                     7   527 977",
    "2   TURNBULL LS           CLIN EXP IMMUNOL                32   226 978",
    "3   NASH DR               ANN CLIN RES                    11    49 979",
    "4   PALUCH E              INT J CANCER                    23    42 979",
    "5   MAYANSKY AN           ZH MIKROBIO EPIDEMIO IMMUNOBI 1979    14 979",
    "6   STOCKLEY RA           THORAX                          35   202 980",
    "7   STOCKLEY RA           J IMMUNOL METH                  38   151 980",
    "8   STOCKLEY RA           AM REV RESPIR DIS              122   959 980",
    "9   PUCHELLE E            BIORHEOLOGY                     18   659 981",
    "10   CLARKE CW             THORAX                          36   665 981",
    "11   PRYJMA J              ANN ALLERGY                     54    60 985"
  ]
}