{
  "paperNumber": "76111",
  "recordNumber": "00465",
  "acessionNumber": "76145694",
  "authors": [],
  "title": "Report of the committe for a study for evaluation of testing for cystic fibrosis.",
  "source": "J-Pediatr. 1976 Apr. 88(4 Pt 2). P 711-50. (REVIEW).",
  "majorSubjects": [
    "CYSTIC-FIBROSIS: di."
  ],
  "minorSubjects": [
    "ADULT",
    "CHILD",
    "CYSTIC-FIBROSIS: fg, me",
    "DUODENUM: an",
    "FEMALE.",
    "FINANCING-GOVERNMENT",
    "FINANCING-ORGANIZED",
    "GENETIC-COUNSELING.",
    "HUMAN",
    "INFANT-NEWBORN",
    "METHODS",
    "MUCINS: me",
    "MUCOUS-MEMBRANE: me.",
    "PANCREAS: me",
    "PANCREATIC-JUICE: an",
    "PREGNANCY",
    "PRENATAL-DIAGNOSIS.",
    "PROTEINS: me",
    "RESEARCH",
    "REVIEW",
    "SODIUM-CHLORIDE: an.",
    "SWEAT-GLANDS: me",
    "SWEAT: an",
    "SUPPORT-U-S-GOVT-P-H-S.",
    "UNITED-STATES."
  ],
  "abstractExtract": "The Committee for a Study for Evaluation of Testing for Cystic Fibrosis was established in August 1974 to assess the reliability of the data on cystic fibrosis \"factors\" in serum and exocrine secretions and in cell culture; evaluate the role of the cystic fibrosis \"factors\" in the detection of the heterozygote and in the diagnosis of cystic fibrosis in the homozygote in utero, during the neonatal period, and thereafter; evaluate the various screening tests for the diagnosis of cystic fibrosis in the newborn infant that have been proposed in this country and abroad, about which there is considerable controversy; and evaluate the sweat test, which as currently performed leads to diagnostic errors, both positive and negative.  Section 1 of this report presents what is known about the clinical aspects of cystic fibrosis; Section 2 summarizes the diverse facets of research in cystic fibrosis, including the sources of its support; and Section 3 is a critical analysis of the state of the art for testing for cystic fibrosis.  Section 4 comprises the Committee\u0027s recommendations, which it is hoped will be of use to both clinicians and researchers in the various settings where cystic fibrosis is diagnosed, treated, and studied.",
  "references": [
    "001   CONNEALLY PM          TEX REP BIOL MED                31   639 973",
    "002   HALLETT WY            AM REV RESPIR DIS               92   714 965",
    "003   KNUDSON AG JR         AM J HUM GENET                  19   388 967",
    "005   CORNET JM             IN: BARNETT HL                      1208 972",
    "006   DI SANTAGNESE PA      PEDIATRICS                      12   549 953",
    "007   SHWACHMAN H           PEDIATRICS                      36   689 965",
    "008   DI SANTAGNESE PA      MOD PROBL PEDIATR               10   135 967",
    "009   SHWACHMAN H           PEDIATRICS                      46   335 970",
    "010   SHWACHMAN H           HOSP PRACT                       9   143 974",
    "011   ANON                  CF FND 1973 REP SURVI STUD PA            975",
    "012   DISCHE Z              PEDIATRICS                      24    74 959",
    "013   JOHANSEN PG           BIOCHEM J                       87    63 963",
    "014   KOPITO LE             FERTIL STERIL                   24   512 973",
    "015   BOAT TF               AM REV RESPIR DIS              110   428 974",
    "016   SPOCK A               PEDIATR RES                      1   173 967",
    "017   SANCHIS J             N ENGL J MED                   288   651 973",
    "018   ROSSMAN CM            PEDIATR RES                      8   469 974",
    "019   QUINLAN MF            AM REV RESPIR DIS               99    13 969",
    "020   YEATES DB             J APPL PHYSIOL                  39   487 975",
    "022   SACKNER MA            J APPL PHYSIOL                  34   495 973",
    "023   SANTA CRUZ R          AM REV RESPIR DIS              109   458 974",
    "024   WOOD RE               AM REV RESPIR DIS              111   733 975",
    "025   MANGOS JA             PEDIATR RES                      1   436 967",
    "026   SCHULZ IJ             J CLIN INVEST                   48  1470 969",
    "027   SIMOPOULOS AP         PEDIATR RES                      5   626 971",
    "028   MANGOS JA             TEX REP BIOL MED                31   651 973",
    "029   DI SANTAGNESE PA      IN: DOWNEY JA                         25 974",
    "030   LEWISTON NJ           CF CLUB ABST                    15    59 974",
    "031   COHEN FL              J MED GENET                     11   253 974",
    "032   SMOLLER M             AM J DIS CHILD                  98   277 959",
    "033   DI SANTAGNESE PA      N ENGL J MED                   277  1287 967",
    "034   DANES BS              J EXP MED                      129   775 969",
    "035   DANES BS              LANCET                           2   765 973",
    "036   NOUSIA-ARVANITAKIS S  PEDIATR RES                      7   336 973",
    "038   TAUSSIG LM            LANCET                           1  1367 972",
    "039   KAISER D              LANCET                           1  1003 970",
    "040   KAISER D              PEDIATR RES                      5   167 971",
    "041   BROWN GA              LANCET                           2   639 971",
    "042   LOBECK CC             IN: STANBURY JB                     1605 972",
    "043   KAISER D              IN: MANGOS JA                        247 973",
    "044   TAYLOR A              PEDIATR RES                      8   861 974",
    "045   LOCKHART LH           TEX REP BIOL MED                31   631 973",
    "046   CONOVER JH            PEDIATR RES                      7   220 973",
    "047   CONOVER JH            PEDIATR RES                      7   224 973",
    "048   BERATIS NG            PEDIATR RES                      7   958 973",
    "049   CONOVER JH            LIFE SCI                        14   253 974",
    "050   MANGOS JA             PEDIATR RES                      2   378 968",
    "051   MANGOS JA             IN: MANGOS JA                        221 973",
    "052   DOGGETT RG            TEX REP BIOL MED                31   685 973",
    "054   DANES BS              J EXP MED                      136  1313 972",
    "055   LIEBERMAN J           AM REV RESPIR DIS              111   100 975",
    "056   SCANLIN TF JR         LANCET                           1  1382 975",
    "057   POLLEY MJ             J MED GENET                     11   249 974",
    "059   RAO GJS               J PEDIATR                       80   573 972",
    "060   RAO GJS               SCIENCE                        177   610 972",
    "061   RAO GJS               PEDIATR RES                      8   684 974",
    "063   HATHAWAY WE           BLOOD                           26   521 965",
    "064   HATTERSLEY PG         BR J HAEMATOL                   18   411 970",
    "066   WILSON GB             CF CLUB ABST                    15     1 974",
    "067   WILSON GB             PEDIATR RES                      9   635 975",
    "068   RENNERT OM            PEDIATRICS                      50   485 972",
    "069   RENNERT OM            IN: MANGOS JA                         41 973",
    "070   LUNDGREN DW           CF CLUB ABST                    15     2 974",
    "071   KLAGSBRUN M           IN: MANGOS JA                         53 973",
    "072   HODES ME              PEDIATR RES                      8   212 974",
    "073   MCEVOY FA             PEDIATR RES                      9   721 975",
    "074   COHEN LF              PEDIATR RES                      9   312 975",
    "075   SCHWERT GW            BIOCHIM BIOPHYS ACTA            16   570 955",
    "076   HADORN B              J PEDIATR                       73    39 968",
    "077   LAPEY A               J PEDIATR                       84   328 974",
    "078   SLEGERS JFG           PFLUEGERS ARCH                 279   265 964",
    "079   SCHULZ IJ             PFLUEGERS ARCH                 284   360 965",
    "080   DI SANTAGNESE PA      ANN NY ACAD SCI                 93   555 962",
    "081   SHWACHMAN H           MOD PROBL PEDIATR               10   158 967",
    "082   ANON                  GAP CONF REP PROB SWEAT TESTI            975",
    "083   KOPITO L              PEDIATRICS                      43   794 969",
    "085   SHWACHMAN H           PEDIATRICS                      32    85 963",
    "086   SHWACHMAN H           J PEDIATR                       66   432 965",
    "087   WARWICK WJ            CF CLUB ABST                    16    58 975",
    "088   BRIMBLECOMBE FSW      LANCET                           2  1428 973",
    "089   BRAY PT               ARCH DIS CHILD                  48   825 973",
    "090   GRAND RJ              J PEDIATR                       70   357 967",
    "091   NADLER HL             LANCET                           2    84 969",
    "092   HOUCK JC              PROC SOC EXP BIOL MED          147   167 974",
    "093   BOLTON WE             AM J HUM GENET                  27   394 975",
    "094   FARRELL PM            PROC SOC EXP BIOL MED          149   340 975",
    "095   ANON                  GENETIC SCREENING PROG PRIN A            975",
    "096   WARWICK WJ            IN: LAWSON D PROC 5TH INT CF         320 969",
    "097   GEORGE L              ARCH DIS CHILD                  46   139 971",
    "098   KULCZYCKI LL          AM J DIS CHILD                 127    64 974",
    "099   WILSON JMG            PUBLIC HEALTH PAPERS            34       968",
    "100   KOPITO L              N ENGL J MED                   272   504 965",
    "101   SHWACHMAN H           N ENGL J MED                   255   999 956",
    "102   KULCZYCKI LL          AM J DIS CHILD                 100   174 960",
    "103   KOLLBERG H            ACTA PAEDIATR SCAND             63   411 974",
    "104   HELLSING K            SCAND J CLIN LAB INVEST         33   333 974",
    "105   STEPHAN U             PEDIATRICS                      55    35 975",
    "106   LEVY HL               IN: MANGOS JA                        261 973",
    "107   GREEN MN              PEDIATRICS                      21   635 958",
    "108   WISER WC              PEDIATRICS                      33   115 964",
    "109   GREEN MN              PEDIATRICS                      41   989 968",
    "110   PROSSER R             ARCH DIS CHILD                  49   597 974",
    "111   KOLLBERG H            ACTA PAEDIATR SCAND             64   477 975",
    "114   GIAMMONA ST           AM REV RESPIR DIS              102   834 970",
    "115   ANON                  NIH APPROPR FY 1972 REPORT            34 972",
    "116   GIBSON LE             PEDIATRICS                      23   545 959"
  ],
  "citations": [
    "1   RYLEY HC              LANCET                           2   365 976",
    "2   SANTAGNESE PAD        N ENGL J MED                   295   481 976",
    "3   TENKATE LP            INT J EPIDEMIOL                  6    23 977",
    "4   THOMAS JM             PEDIATR RES                     11  1148 977",
    "5   THOMAS JM             PEDIATR RES                     11   138 977",
    "6   GOTZ M                PAEDIATR PAEDOL                 12   413 977",
    "7   ANDORSKY M            AM J DIG DIS                    22    56 977",
    "8   BRAY PT               CLIN CHIM ACTA                  80   333 977",
    "9   DESAI N               J PEDIATR                       91   447 977",
    "10   LYRENE RK             J PEDIATR                       91   681 977",
    "11   ANON                  LANCET                           2  1032 978",
    "12   WILSON GB             PEDIATR RES                     12   801 978",
    "13   BARNES GL             AUST PAEDIATR J                 14    78 978",
    "14   WARWICK WJ            CLIN CHEM                       24  2050 978",
    "15   HOLTZMAN NA           PEDIATR CLIN NORTH AM           25   411 978",
    "16   MILLER WA             SOUTH MED J                     71   201 978",
    "17   BRESLOW JL            SCIENCE                        201   180 978",
    "18   SANTAGNESE PAD        AM J MED                        66   121 979",
    "19   WARWICK WJ            AM J CLIN PATHOL                72   142 979",
    "20   DAVIDSON AGF          N ENGL J MED                   300  1164 979",
    "21   DAVIS PB              AM J MED                        69   643 980",
    "22   RYLEY HC              J CLIN PATHOL                   34   906 981",
    "23   RYLEY HC              J CLIN PATHOL                   34   179 981",
    "24   PARK RW               GASTROENTEROLOGY                81  1143 981",
    "25   SCHWACHMAN H          J PEDIATR                       98   576 981",
    "26   BRESLOW JL            N ENGL J MED                   304     1 981",
    "27   LITTLEFIELD JW        N ENGL J MED                   304    44 981",
    "28   KNOWLES M             N ENGL J MED                   305  1489 981",
    "29   SORSCHER EJ           LANCET                           1   368 982",
    "30   STERN RC              LANCET                           1  1401 982",
    "31   SEALE TW              ANN CLIN LAB SCI                12   415 982",
    "32   WIESEMANN HG          MONATSSCHR KINDERHEILKD        130    96 982",
    "33   BONFORTE RJ           LANCET                           1    71 983",
    "34   WEBSTER HL            CRC CRIT REV CLIN LAB SCI       18   313 983",
    "35   COURY AJ              CLIN CHEM                       29  1593 983",
    "36   HANSEN RC             ARCH DERMATOL                  119    51 983",
    "37   BONFORTE RJ           AM REV RESPIR DIS              127   392 983",
    "38   DAVIS PB              AM REV RESPIR DIS              128    34 983",
    "39   MASOERO G             AM J DIS CHILD                 137   167 983",
    "40   BOUCHER RC            LUNG                           161     1 983",
    "41   FRANCKX J             HELV PAEDIATR ACTA              39   347 984",
    "42   DAVIS PB              CHEST                           85   802 984",
    "43   SCHONI MH             J PEDIATR                      104   691 984",
    "44   WARWICK WJ            CLIN CHEM                       32   850 986",
    "45   LITTLEWOOD JM         J ROY SOC MED                   79    55 986",
    "46   ROBERTS DD            ARCH BIOCHEM BIOPHYS           245   292 986"
  ]
}