{
  "paperNumber": "76145",
  "recordNumber": "00499",
  "acessionNumber": "78071425",
  "authors": [
    "Lopez-Vidriero-M-T",
    "Reid-L."
  ],
  "title": "Pathophysiology of mucus secretion in cystic fibrosis.",
  "source": "Mod-Probl-Paediatr. 1976 Oct 24-27. 19. P 120-8.",
  "majorSubjects": [
    "BRONCHI: se",
    "CYSTIC-FIBROSIS: pp",
    "MUCUS: se."
  ],
  "minorSubjects": [
    "ADOLESCENCE",
    "ADULT",
    "BRONCHI: pa",
    "CHILD",
    "CHILD-PRESCHOOL.",
    "CYSTIC-FIBROSIS: pa",
    "GLYCOPROTEINS: se",
    "HUMAN",
    "IN-VITRO",
    "INFANT.",
    "INFANT-NEWBORN",
    "ORGAN-CULTURE",
    "SPUTUM: an",
    "TRACHEA: se."
  ],
  "abstractExtract": "Abnormality of mucus secretion, either biochemical or physical, has long been claimed to be the primary cause of pulmonary complications - obstruction and infection - in patients suffering from cystic fibrosis  (CF).  This review will draw in large measure on the experience of Prof. L. Reid and her research team who over the last 15 years have studied mucus-secreting structures and their secretions in the normal and diseased lung from various angles: development, structure and ultrastructure, histochemistry organ culture, biochemical analysis and rheological characterization.",
  "references": [
    "001   TAPPAN V              ANN NY ACAD SCI                106   722 963",
    "002   REID L                ADV INTERN MED                  12   256 964",
    "003   MEYRICK B             THORAX                          24   729 969",
    "004   LAMB D                J PATHOL                        98   213 969",
    "005   JONES R               HISTOCHEM J                      5    19 973",
    "006   JONES R               HISTOCHEM J                      5    19 973",
    "007   LAMB D                HISTOCHEM J                      4    91 972",
    "008   LAMB D                BR J DIS CHEST                  66   239 972",
    "009   REID L                MOD PROBL PEDIATR               10   195 967",
    "010   LAMB D                BR J DIS CHEST                  66   239 972",
    "011   LEV R                 AM J PATHOL                     46    23 965",
    "012   STURGESS J            EXP MOL PATH                    16   362 972",
    "013   MEYRICK B             J CELL BIOL                     67   320 975",
    "014   REID L                IN: BALLS M                          463 976",
    "015   STURGESS JM           CLIN SCI                        43   533 972",
    "017   KEAL EE               THESIS                                   970",
    "018   MEARNS MB             ARCH DIS CHILD                  43   528 968",
    "019   LOPEZ-VIDRIERO MT     THESIS                                   976",
    "020   STURGESS J            RHEOL ACTA                      10    36 971",
    "021   CHARMAN J             BIORHEOLOGY                      9   185 972",
    "022   MITCHELL-HEGGS PF     BIORHEOLOGY                     11   417 974"
  ],
  "citations": [
    "1   SPICER SS             ENVIRON HEALTH PERSPECT         55   193 984"
  ]
}