{
  "paperNumber": "75074",
  "recordNumber": "00240",
  "acessionNumber": "76002091",
  "authors": [
    "Dolan-T-F-Jr",
    "Meyers-A."
  ],
  "title": "Mild cystic fibrosis presenting as an asymptomatic distended appendiceal mass: A case report.",
  "source": "Clin-Pediatr (Phila). 1975 Sep. 14(9). P 862-3.",
  "majorSubjects": [
    "APPENDICITIS: di",
    "CYSTIC-FIBROSIS: di."
  ],
  "minorSubjects": [
    "APPENDECTOMY",
    "APPENDIX: pa",
    "CASE-REPORT",
    "CHILD-PRESCHOOL.",
    "CYSTIC-FIBROSIS: pa",
    "DIAGNOSIS-DIFFERENTIAL",
    "FEMALE",
    "HUMAN.",
    "PALPATION."
  ],
  "abstractExtract": "A case of cystic fibrosis presenting as a right lower quadrant mass in a five-year-old white female is presented. At laparotomy, a mucoid, impacted appendix was found which microscopically suggested the diagnosis of cystic fibrosis. Cystic fibrosis must be added to conditions presenting with abdominal masses.",
  "references": [
    "001   BECK AR               GASTROENTEROLOGIA              106    84 966",
    "002   HOLSCLAW DS           PEDIATRICS                      48    51 971",
    "003   SHWACHMAN H           N ENGL J MED                   286  1300 972",
    "004   SNYDER WH JR          PEDIATRICS                      34    72 964"
  ],
  "citations": [
    "1   STERN RC              J PEDIATR                       89   412 976",
    "2   WOOD RE               AM REV RESPIR DIS              113   833 976",
    "3   LOBER CW              JAMA                           235  1140 976",
    "4   ROSENSTEIN BJ         JOHNS HOPKINS MED J            150   113 982",
    "5   MCCARTHY VP           GASTROENTEROLOGY                86   564 984"
  ]
}