{
  "paperNumber": "76028",
  "recordNumber": "00383",
  "acessionNumber": "76251662",
  "authors": [
    "Yeates-D-B",
    "Sturgess-J-M",
    "Kahn-S-R",
    "Levison-H",
    "Aspin-N."
  ],
  "title": "Mucociliary transport in trachea of patients with cystic fibrosis.",
  "source": "Arch-Dis-Child. 1976 Jan. 51(1). P 28-33.",
  "majorSubjects": [
    "CYSTIC-FIBROSIS: pp",
    "TRACHEA: pp."
  ],
  "minorSubjects": [
    "ADOLESCENCE",
    "ADULT",
    "CHILD",
    "CILIA",
    "CYSTIC-FIBROSIS: bl, co.",
    "FEMALE",
    "HUMAN",
    "MALE",
    "SPUTUM: se."
  ],
  "abstractExtract": "Mucociliary tracheal transport rates were measured in 20 patients with cystic fibrosis, in whom these rates ranged from 0 to 12.8 mm/min. The patients were divided into 3 roughly equal groups on the basis of their transport rates. (1) Those in whom no abnormality in mucociliary transport was detected in the trachea; (2) those in whom normal transport rates were measured but in whom abnormalities such as cessation, or reversal of bolus movement were observed; (3) those in whom no normal transport rates were observed. In the first group the rates were similar to those observed in a population of healthy adults. These normal rates were observed in some patients who had a productive cough. The mean mucociliary tracheal transport rate increased with increasing maximum midexpiratory flow. Those patients with a low Shwachman score and poor arterial oxygen tension tended to fall into groups 2 and 3. In the ciliary dyskinesia assay in rabbit trachea the serum from the patients with the higher transport rates tended to initiate more rapid discharge of material from the epithelium and ciliary dyskinesia.",
  "references": [
    "001   CAMNER P              AM REV RESPIR DIS              108   131 973",
    "002   CAMNER P              IN: HERS JFP                         236 973",
    "003   CHARMAN J             BIORHEOLOGY                      9   185 972",
    "004   CONOVER JH            PEDIATR RES                      7   220 973",
    "005   DENTON R              PEDIATRICS                      25   611 960",
    "006   DUBOIS AB             J CLIN INVEST                   35   322 956",
    "007   ESTERLY JR            JOHNS HOPKINS MED J            122    94 968",
    "008   FEATHER EA            BR J DIS CHEST                  64   192 970",
    "009   HOORN B               ARCH GESAMTE VIRUSFORSCH        18   210 966",
    "010   LAMB D                BR J DIS CHEST                  66   239 972",
    "011   MATTHEWS LW           AM REV RESPIR DIS               88   199 963",
    "012   POTTER JL             ANN NY ACAD SCI                106   692 963",
    "013   REID L                MOD PROBL PEDIATR               10   195 967",
    "014   SAKAKURA Y            ANN OTOL RHINOL LARYNGOL        82   203 973",
    "015   SANCHIS J             N ENGL J MED                   288   651 973",
    "016   SPOCK A               PEDIATR RES                      1   173 967",
    "017   STURGESS JM           IN: LAWSON D PROC 5TH INT CF         368 969",
    "018   THOMSON ML            N ENGL J MED                   289   749 974",
    "019   WOOD RE               PEDIATR RES                      8   471 974",
    "020   YEATES DB             INT J APPL RADIAT ISOTOP        25   578 974",
    "021   YEATES DB             FED PROC                        33   365 974",
    "022   YEATES DB             J APPL PHYSIOL                  39   487 975",
    "023   ZUELZER WW            PEDIATRICS                       4    53 949"
  ],
  "citations": [
    "1   CZEGLEDYNAGY E        LAB INVEST                      35   588 976",
    "2   SORENSEN RU           INFECT IMMUN                    18   735 977",
    "3   WONG JW               PEDIATRICS                      60   146 977",
    "4   ROSSMAN CM            J PEDIATR                       90   579 977",
    "5   LOPEZVIDRIERO MT      BR MED BULL                     34    63 978",
    "6   KOLLBERG H            SCAND J RESPIR DIS              59   297 978",
    "7   BASSETT PG            COMPUT BIOL MED                  9    97 979",
    "8   GABRIDGE MG           PEDIATR RES                     13    31 979",
    "9   NAGY EC               PEDIATR RES                     13   729 979",
    "10   AFZELIUS BA           INT REV EXP PATHOL              19     1 979",
    "11   STURGESS JM           PEDIATR CLIN NORTH AM           26   481 979",
    "12   MOSSBERG B            ACTA PHARMACOL TOXICOL          44    41 979",
    "13   CAMNER P              SCAND J RESPIR DIS              60    56 979",
    "14   PAVIA D               CLIN RESP PHYSIOL               16   335 980",
    "15   LIPPMANN M            BR J IND MED                    37   337 980",
    "16   CAMNER P              CLIN SCI                        59    79 980",
    "17   MOSSBERG B            EUR J RESPIR DIS                61    51 980",
    "18   KATZ SM               AM J CLIN PATHOL                73   682 980",
    "19   STURGESS JM           N ENGL J MED                   303   318 980",
    "20   SORENSEN RU           PEDIATR RES                     15    14 981",
    "21   RUTLAND J             THORAX                          36   654 981",
    "22   MORROW PE             CHEST                           80   809 981",
    "23   SORENSEN RU           AM REV RESPIR DIS              123    37 981",
    "24   MITCHELL EA           AUST PAEDIATR J                 18    40 982",
    "25   SCHIOTZ PO            ACTA PAEDIATR SCAND SUPPL 301 1982    55 982",
    "26   SORENSEN RU           EUR J RESPIR DIS                64   524 983",
    "27   JACKSON AH            CLIN SCI                        65  P  3 983",
    "28   RUTLAND J             AM REV RESPIR DIS              128  1030 983",
    "29   KATZ S                CELL CALC                        5   421 984",
    "30   CAMNER P              ATEMWEGS LUNGENKRANKH           10   237 984",
    "31   JACKSON AH            EUR J RESPIR DIS                65   114 984",
    "32   DAVIS PB              SEM RESPIR MED                   6   261 985",
    "33   LEVANDOWSKI RA        J LAB CLIN MED                 106   428 985"
  ]
}