{
  "paperNumber": "74143",
  "recordNumber": "00142",
  "acessionNumber": "74251248",
  "authors": [
    "Barnett-D-R",
    "Bowman-B-H."
  ],
  "title": "Letter: Cystic fibrosis ciliary inhibitor.",
  "source": "Pediatr-Res. 1974 Jun. 8(6). P 687.",
  "majorSubjects": [
    "CYSTIC-FIBROSIS: me",
    "CILIA: de",
    "PROTEINS: ip."
  ],
  "minorSubjects": [
    "ANIMAL",
    "HUMAN",
    "CYSTIC-FIBROSIS: im",
    "FIBROBLASTS: me",
    "SKIN.",
    "MOLECULAR-WEIGHT",
    "CHROMATOGRAPHY-DEAE-CELLULOSE",
    "COMPLEMENT: an.",
    "MOLLUSCA."
  ],
  "abstractExtract": "The fact that amniotic cells from fetuses at high risk for the CF gene, as well as cells derived from heterozygous individuals, produce the ciliary inhibitor suggests a close relation to the genetic defect and necessitates further identification and characterization of the responsible molecule.",
  "references": [
    "002   BARNETT DR            TEX REP BIOL MED                31   703 973",
    "003   BERATIS NG            PEDIATR RES                      7   958 973",
    "004   BOWMAN BH             PROC NAT ACAD SCI USA           70   548 973",
    "005   BOWMAN BH             CLIN GENET                       4   461 973",
    "006   BOWMAN BH             AM J HUM GENET                  25   16A 973",
    "007   CONOVER JH            PEDIATR RES                      7   224 973",
    "008   CONOVER JH            AM J HUM GENET                  25   21A 973",
    "009   DANES BS              J EXP MED                      136  1313 972",
    "010   DANES BS              J EXP MED                      137  1538 973"
  ],
  "citations": [
    "1   WILSON GB             PEDIATR RES                     10    87 976",
    "2   DANES BS              TEX REP BIOL MED                34   135 976",
    "3   HARPER BL             TEX REP BIOL MED                34    73 976",
    "4   WILSON GB             TEX REP BIOL MED                34    51 976",
    "5   WILSON GB             PEDIATR RES                     11   317 977",
    "6   WILSON GB             NATURE                         266   463 977"
  ]
}