{
  "paperNumber": "76202",
  "recordNumber": "00555",
  "acessionNumber": "77038272",
  "authors": [
    "Hoiby-N",
    "Kilian-M."
  ],
  "title": "Haemophilus from the lower respiratory tract of patients with cystic fibrosis.",
  "source": "Scand-J-Respir-Dis. 1976. 57(3). P 103-7.",
  "majorSubjects": [
    "CYSTIC-FIBROSIS: mi",
    "HAEMOPHILUS",
    "RESPIRATORY-SYSTEM: mi."
  ],
  "minorSubjects": [
    "ADOLESCENCE",
    "ADULT",
    "CHILD",
    "CHILD-PRESCHOOL",
    "FEMALE.",
    "HAEMOPHILUS-INFLUENZAE: ip",
    "HAEMOPHILUS: cl, ip",
    "HUMAN.",
    "LARYNX:  mi",
    "MALE",
    "SPUTUM: mi."
  ],
  "abstractExtract": "Fifty-six non-haemolytic Haemophilus strains were isolated during current bacteriological examinations from material from the lower respiratory tract of 39 patients with cystic fibrosis during a 6- month period. Except for six strains which belonged to Haemophilus parainfluenzae, all strains were identified as Haemophilus influenzae. Biotype I of H. influenzae was the predominating taxon (38%) and was especially related to patients with recurrent or prolonged colonization. Only two strains were capsulated. An unexpectedly high percentage of the strains produced lysine decarboxylase. The significance of this property in the pathogenesis of the respiratory tract colonization is discussed.",
  "references": [
    "001   DENNY FW              J INFECT DIS                   129    93 974",
    "002   DIEM K                DOCUMENTA GEIGY SCIENTIFIC TA            962",
    "003   HOLDAWAY MD           LANCET                           1   358 967",
    "004   HOIBY N               ACTA PATH MICROBIOL SCAND (B)   82   541 974",
    "005   HOIBY N               SCAND J RESPIR DIS              56    38 975",
    "006   KILBOURN JP           LANCET                           2   439 969",
    "007   KILIAN M              ACTA PATH MICROBIOL SCAND       80   571 972",
    "008   KILIAN M              J GEN MICROBIOL                 93     9 976",
    "009   MAY JR                CHEMOTHERAPY OF CHRONIC BRONC            968",
    "010   MAY JR                ARCH DIS CHILD                  47   908 972",
    "011   MEARNS MB             ARCH DIS CHILD                  47   902 972",
    "012   SAGGERS BA            J CLIN PATHOL                   23   262 970",
    "013   WHITE A               PRINCIPLES OF BIOCHEMISTRY               964"
  ],
  "citations": [
    "1   HOIBY N               ACTA PATH MICROBIOL SCAND (C) S262     3 977",
    "2   HOIBY N               SCAND J RESPIR DIS              58    65 977",
    "3   OILL PA               ARCH INTERN MED                139   985 979",
    "4   CHAD ZH               PEDIATRICS                      66     9 980",
    "5   IVANOVA NM            TER ARKH                        53   131 981",
    "6   LISTON TE             SOUTH MED J                     75   753 982",
    "7   TILLER FW             ZENTRALBL BAKT MIKROB HYG (A)  253   236 982",
    "8   BECK B                ACTA PAEDIATR SCAND SUPPL 301 1982   125 982",
    "9   HOIBY N               ACTA PAEDIATR SCAND SUPPL 301 1982    33 982",
    "10   KILBOURN JP           AM REV RESPIR DIS              128  1093 983",
    "11   PRESSLER T            ACTA PAEDIATR SCAND             73   541 984",
    "12   NELSON JD             J PEDIATR                      106  1030 985",
    "13   LEVY J                ANTIMICROB AGENTS CHEMOTHER     29   474 986"
  ]
}