{
  "paperNumber": "74075",
  "recordNumber": "00074",
  "acessionNumber": "74299909",
  "authors": [
    "McManus-S-P",
    "Masterson-J."
  ],
  "title": "Cytoplasmic metachromasia in cultured skin fibroblasts from parents of children with cystic fibrosis.",
  "source": "Ir-J-Med-Sci. 1974 Jul. 143(4). P 227-31.",
  "majorSubjects": [
    "FIBROBLASTS: cy",
    "PARENTS",
    "CYSTIC-FIBROSIS: fg.",
    "TOLONIUM-CHLORIDE:  du."
  ],
  "minorSubjects": [
    "ADULT",
    "HUMAN",
    "MALE",
    "FEMALE",
    "CYTOPLASM",
    "CELLS-CULTURED.",
    "TIME-FACTORS",
    "HETEROZYGOTE",
    "SKIN: cy."
  ],
  "abstractExtract": "The cytoplasmic metachromasia phenomenon with Toluidine Blue 0 in cultured skin fibroblasts was studied in 12 parents of children with cystic fibrosis and in 12 controls.  Positive findings were recorded in 10 of the CF parents and in one of the controls.  The average culture time required for development of maximum metachromasia in positive cases was six weeks.  The possible significance of the ametachromatic CF patients in relation to the suggested genetic heterogeneity of cystic fibrosis is discussed.",
  "references": [
    "001   ANDERSON CM           MOD PROBL PEDIATR               10   381 967",
    "002   DANES BS              J EXP MED                      123     1 966",
    "003   DANES BS              LANCET                           1  1061 968",
    "004   DANES BS              J EXP MED                      129   775 969",
    "005   DANES BS              NATURE                         222   685 969",
    "006   DANKS DM              ANN HUM GENET                   28   323 965",
    "007   MCMANUS SP            IR J MED SCI                   142   358 973",
    "008   SMITH DW              LANCET                           2   309 968",
    "009   TAYSI K               N ENGL J MED                   281  1108 969"
  ],
  "citations": [
    "1   WARD JB               TEX REP BIOL MED                34    11 976",
    "2   OWEN E                J MOL MED                        3    49 978",
    "3   MAYAHARA H            ACTA HISTOCHEM CYTOCHEM         11   449 978",
    "4   JAKEL HP              BIOL ZENTRALBL                  98    55 979"
  ]
}