%YAML 1.1
%TAG !u! tag:unity3d.com,2011:
--- !u!1045 &1
EditorBuildSettings:
  m_ObjectHideFlags: 0
  serializedVersion: 2
  m_Scenes:
  - enabled: 1
    path: Assets/Scenes/MainMenu.unity
    guid: 2cda990e2423bbf4892e6590ba056729
  - enabled: 1
    path: Assets/Scenes/Level1.unity
    guid: 70dbc51f51c55ad4e847338a8106e915
  - enabled: 1
    path: Assets/Scenes/Level2.unity
    guid: 260c806b733d19840836544c07e8f836
  m_configObjects: {}
