AARD_B1_crRNA0223:223-249	5573
AARD_B2_crRNA0188:188-214	5810
AARD_B3_crRNA0327:339-365	6508
AARD_T1_crRNA0163:163-189	5760
AARD_T2_crRNA0653:720-746	4723
AARD_T3_crRNA0296:308-334	5326
ARCN1_B1_crRNA0543:669-695	4957
ARCN1_B2_crRNA0071:71-97	4108
ARCN1_B3_crRNA0603:729-755	6440
ARCN1_T1_crRNA1248:1451-1477	5732
ARCN1_T2_crRNA1188:1368-1394	2283
ARCN1_T3_crRNA0814:940-966	3465
CCT7_B1_crRNA0464:510-536	5888
CCT7_B2_crRNA1585:1775-1801	5128
CCT7_B3_crRNA1541:1708-1734	4478
CCT7_T1_crRNA0982:1075-1101	2089
CCT7_T2_crRNA0203:226-252	3770
CCT7_T3_crRNA0509:555-581	347
CDKN2A_B1_crRNA228:321-347	5533
CDKN2A_B2_crRNA324:417-443	3909
CDKN2A_B3_crRNA158:228-254	6479
CDKN2A_T1_crRNA255:348-374	5021
CDKN2A_T2_crRNA103:149-175	4210
CDKN2A_T3_crRNA208:301-327	6179
CHEK2_B1_crRNA1276:1663-1689	4834
CHEK2_B2_crRNA0226:226-252	5197
CHEK2_B3_crRNA0331:331-357	4797
CHEK2_T1_crRNA0726:850-876	6414
CHEK2_T2_crRNA0632:756-782	6464
CHEK2_T3_crRNA0942:1280-1306	5517
EIF3B_B1_crRNA0269:287-313	4500
EIF3B_B2_crRNA0464:505-531	4635
EIF3B_B3_crRNA0125:125-151	5526
EIF3B_T1_crRNA1359:1719-1745	1582
EIF3B_T2_crRNA0778:936-962	624
EIF3B_T3_crRNA0608:718-744	5061
MESDC1_B1_crRNA0705:820-846	5337
MESDC1_B2_crRNA0619:734-760	5536
MESDC1_B3_crRNA1588:1804-1830	6713
MESDC1_T1_crRNA1719:1959-1985	5513
MESDC1_T2_crRNA1775:2015-2041	4271
MESDC1_T3_crRNA1215:1404-1430	5695
NF1_B1_crRNA0277:423-449	5233
NF1_B2_crRNA2347:2955-2981	5449
NF1_B3_crRNA6472:7913-7939	4618
NF1_T1_crRNA2932:3633-3659	5438
NF1_T2_crRNA4425:5509-5535	3451
NF1_T3_crRNA2072:2657-2683	5129
NF2_B1_crRNA0205:205-231	4891
NF2_B2_crRNA0067:67-93	5742
NF2_B3_crRNA1676:1865-1891	4675
NF2_T1_crRNA1422:1611-1637	5544
NF2_T2_crRNA0884:1027-1053	5876
NF2_T3_crRNA0825:968-994	7793
NT_rc_000038	4504
NT_rc_000341	3514
NT_rc_000358	4083
NUP133_B1_crRNA0093:93-119	5557
NUP133_B2_crRNA0203:203-229	6109
NUP133_B3_crRNA1694:2067-2093	5646
NUP133_T1_crRNA1793:2191-2217	3826
NUP133_T2_crRNA0828:914-940	2505
NUP133_T3_crRNA0428:428-454	7438
PRPF19_B1_crRNA0375:398-424	4788
PRPF19_B2_crRNA0854:877-903	6475
PRPF19_B3_crRNA1287:1367-1393	5596
PRPF19_T1_crRNA1017:1097-1123	5683
PRPF19_T2_crRNA0275:298-324	5181
PRPF19_T3_crRNA0736:759-785	4199
PSMB2_B1_crRNA0164:238-264	4332
PSMB2_B2_crRNA1253:1634-1660	4246
PSMB2_B3_crRNA0379:453-479	5645
PSMB2_T1_crRNA0744:865-891	1689
PSMB2_T2_crRNA0630:727-753	3307
PSMB2_T3_crRNA0269:343-369	5387
PSMB6_B1_crRNA121:144-170	1257
PSMB6_B2_crRNA291:375-401	5076
PSMB6_B3_crRNA610:742-768	3329
PSMB6_T1_crRNA471:579-605	2451
PSMB6_T2_crRNA570:678-704	1537
PSMB6_T3_crRNA348:432-458	1459
PTCD1_B1_crRNA1336:1521-1547	6211
PTCD1_B2_crRNA1628:1896-1922	5972
PTCD1_B3_crRNA0374:397-423	5976
PTCD1_T1_crRNA1794:2085-2111	6384
PTCD1_T2_crRNA1414:1659-1685	6797
PTCD1_T3_crRNA0401:424-450	5382
PTEN_B1_crRNA0241:264-290	4446
PTEN_B2_crRNA0854:1120-1146	5565
PTEN_B3_crRNA0293:352-378	4607
PTEN_T1_crRNA0603:757-783	6066
PTEN_T2_crRNA1411:1817-1843	3983
PTEN_T3_crRNA1568:1997-2023	5907
RB1_B1_crRNA0137:247-273	4857
RB1_B2_crRNA0060:92-118	4495
RB1_B3_crRNA1470:2029-2055	5492
RB1_T1_crRNA0649:895-921	4680
RB1_T2_crRNA0999:1440-1466	6069
RB1_T3_crRNA2041:2773-2799	8311
SFPQ_B1_crRNA0348:393-419	4680
SFPQ_B2_crRNA0482:550-576	3965
SFPQ_B3_crRNA0533:601-627	4336
SFPQ_T1_crRNA1163:1313-1339	4375
SFPQ_T2_crRNA1843:2136-2162	5178
SFPQ_T3_crRNA1599:1892-1918	2248
SNRNP200_B1_crRNA1708:1874-1900	5244
SNRNP200_B2_crRNA2069:2329-2355	4764
SNRNP200_B3_crRNA0751:774-800	3080
SNRNP200_T1_crRNA0891:962-988	4003
SNRNP200_T2_crRNA1423:1543-1569	1420
SNRNP200_T3_crRNA2305:2613-2639	531
SUPT5H_B1_crRNA2474:2707-2733	4154
SUPT5H_B2_crRNA2671:2980-3006	4804
SUPT5H_B3_crRNA2590:2876-2902	4286
SUPT5H_T1_crRNA0902:973-999	6789
SUPT5H_T2_crRNA1128:1199-1225	2375
SUPT5H_T3_crRNA0404:452-478	7373
TSC2_B1_crRNA0493:540-566	5019
TSC2_B2_crRNA1407:1477-1503	5091
TSC2_B3_crRNA1243:1313-1339	4668
TSC2_T1_crRNA0762:832-858	5808
TSC2_T2_crRNA0110:133-159	7514
TSC2_T3_crRNA0902:972-998	6812
