PCA,regsubsets.fwd.indiv,stepAIC,GCcontent,stepBIC,MARS,Lasso,PLSR,SVM+tuning,RandomForest
0.22,0.2775,0.1806,0.1833,0.2102,0.3985,0.3431,0.5097,0.4505,0.4492
0.0652,0.223,0.1051,0.2898,0.3899,0.4014,0.3306,0.4642,0.5088,0.4915
-0.0058,0.2574,0.2089,0.24,0.318,0.286,0.346,0.4496,0.4624,0.4621
0.0454,0.2555,0.1741,0.3534,0.2644,0.2786,0.4114,0.2985,0.453,0.5242
-0.0469,0.068,0.2038,0.2058,0.271,0.3036,0.2739,0.4496,0.5035,0.4103
-0.0257,0.1911,0.0597,0.3137,0.2302,0.1958,0.3974,0.3458,0.3577,0.4576
0.0417,0.4105,0.3003,0.3534,0.2447,0.3642,0.4666,0.4643,0.4817,0.4644
0.0883,0.1527,0.3614,0.2384,0.3864,0.3828,0.4472,0.4145,0.3974,0.429
0.1633,0.3317,0.2151,0.3894,0.1609,0.2244,0.3825,0.4487,0.5765,0.4853
0.113,0.2244,0.0718,0.3251,0.209,0.2007,0.4512,0.3422,0.4013,0.5227
0.2491,0.2019,0.1383,0.2494,0.2435,0.4535,0.3323,0.478,0.5085,0.536
-0.0309,0.1148,0.2928,0.3676,0.2837,0.322,0.3857,0.4954,0.4782,0.4691
0.0559,0.2185,0.1123,0.2965,0.233,0.2763,0.314,0.4241,0.4175,0.4609
0.1664,0.2497,0.2509,0.3546,0.3416,0.4137,0.3836,0.4667,0.4922,0.4926
0.0185,0.1837,0.2866,0.2578,0.4155,0.3495,0.4221,0.4371,0.4399,0.542
0.1382,0.1168,0.1625,0.3247,0.329,0.2897,0.4337,0.4616,0.504,0.5117
-0.0703,0.1401,0.1373,0.2109,0.3423,0.3481,0.3419,0.5187,0.4935,0.3797
0.2338,0.2174,0.1913,0.1883,0.288,0.3556,0.3815,0.4841,0.4414,0.4468
0.0582,0.2109,0.3562,0.3435,0.3465,0.5322,0.5308,0.5258,0.5572,0.6119
0.209,0.2318,0.1827,0.3439,0.4263,0.3121,0.4381,0.5089,0.5217,0.4656
0.2259,0.153,0.3265,0.2329,0.3931,0.4038,0.3855,0.5209,0.4857,0.6042
0.1369,0.1874,0.0307,0.2236,0.2693,0.3096,0.3611,0.3341,0.4484,0.5142
0.1509,0.1429,0.2078,0.2727,0.3376,0.2447,0.2779,0.369,0.4733,0.4132
0.074,0.2085,0.0772,0.2487,0.2528,0.3232,0.3906,0.3395,0.3605,0.4305
-0.1329,0.3607,0.1671,0.2296,0.2343,0.4558,0.2426,0.3672,0.2288,0.3221
0.0207,0.382,0.2018,0.3428,0.2968,0.3367,0.4507,0.4608,0.4385,0.5944
0.1269,0.2791,0.2288,0.1831,0.2726,0.3797,0.273,0.4573,0.4378,0.4087
0.276,0.1797,0.2492,0.093,0.2588,0.2363,0.2112,0.4434,0.4429,0.412
0.0795,0.2257,0.2657,0.2513,0.3685,0.3014,0.4116,0.4746,0.4063,0.4765
0.0857,0.271,0.1186,0.3148,0.3411,0.3028,0.3462,0.3696,0.4559,0.5456
0.1139,0.2759,0.4167,0.2992,0.2942,0.4041,0.4022,0.4628,0.5197,0.5156
0.1215,0.2181,0.3236,0.3385,0.3207,0.3576,0.3413,0.3971,0.3754,0.4462
0.0875,0.1897,0.118,0.2003,0.2395,0.1868,0.3288,0.3808,0.3545,0.3858
0.1043,0.2443,0.1819,0.3175,0.3247,0.3342,0.2988,0.4178,0.3943,0.4634
0.0495,0.3209,0.3406,0.2659,0.3353,0.3774,0.387,0.3765,0.4689,0.4119
0.163,0.2293,0.2888,0.2491,0.3892,0.324,0.3553,0.5084,0.4989,0.4599
0.2061,0.3334,0.1912,0.3801,0.3366,0.3848,0.3675,0.4596,0.4243,0.5276
-0.0023,0.2891,0.2855,0.3023,0.4682,0.4201,0.3819,0.4828,0.4305,0.4313
0.114,0.3315,0.3465,0.2743,0.4332,0.4463,0.372,0.433,0.4883,0.512
0.0341,0.2156,0.2675,0.1411,0.3597,0.224,0.2233,0.4329,0.3883,0.3522
0.1205,-0.0267,0.1018,0.3837,0.2821,0.3052,0.3366,0.4365,0.4844,0.4986
0.1545,0.1499,0.1228,0.1755,0.3304,0.3017,0.3121,0.4028,0.3823,0.4108
0.1638,0.2101,0.1784,0.2411,0.2858,0.3846,0.3135,0.5056,0.4105,0.4307
0.3166,0.2237,0.0066,0.2569,0.2427,0.4326,0.2927,0.4459,0.4278,0.4545
0.2217,0.1916,0.3578,0.2339,0.38,0.3854,0.3677,0.4809,0.4796,0.5046
0.1114,0.1778,0.1916,0.1909,0.1687,0.1969,0.2116,0.358,0.3511,0.3444
0.006,0.3192,0.205,0.2161,0.2352,0.3467,0.2802,0.4379,0.3961,0.378
0.0782,0.2272,0.1825,0.2793,0.3645,0.2787,0.4181,0.3902,0.4525,0.4826
0.0183,0.101,0.1742,0.3757,0.324,0.3332,0.4286,0.4458,0.498,0.4758
0.1537,0.2965,0.2678,0.2102,0.4885,0.4251,0.2102,0.5437,0.4934,0.4246
0.2206,0.2181,0.2948,0.3101,0.4035,0.2605,0.3074,0.5208,0.5407,0.4851
0.0173,0.2893,0.3453,0.2956,0.3243,0.2958,0.3925,0.4356,0.4531,0.4855
0.0771,0.236,0.3077,0.3811,0.2978,0.2447,0.4648,0.438,0.4724,0.5611
0.1198,0.1817,0.2469,0.2289,0.3129,0.3373,0.3182,0.438,0.4766,0.5078
0.1137,0.2443,0.2514,0.1539,0.2537,0.3095,0.2312,0.3014,0.3065,0.2911
0.134,0.2279,0.2616,0.3163,0.2685,0.3448,0.3971,0.3826,0.4523,0.4497
0.107,0.106,0.2094,0.327,0.3902,0.3759,0.3741,0.4868,0.4122,0.4122
0.0199,0.2516,0.1976,0.2422,0.3176,0.2135,0.2751,0.3539,0.4059,0.4297
0.0686,0.3086,0.3284,0.3796,0.3957,0.4328,0.4569,0.5451,0.5142,0.5528
0.1476,0.2463,0.2426,0.2751,0.4329,0.3431,0.3279,0.5294,0.5123,0.5309
0.1912,0.215,0.2597,0.3332,0.4125,0.2074,0.4827,0.377,0.4137,0.6079
0.1208,0.2968,0.2209,0.3165,0.3445,0.346,0.3943,0.4679,0.4878,0.5422
0.0905,0.1936,0.2327,0.2862,0.4382,0.3794,0.3804,0.5042,0.4902,0.4058
0.0871,0.2159,0.3858,0.3175,0.3379,0.3756,0.3479,0.4231,0.4362,0.4343
0.1292,0.2651,0.1826,0.245,0.4543,0.4709,0.4016,0.552,0.5449,0.4511
0.1096,0.0987,0.1803,0.2201,0.3205,0.3827,0.2738,0.4387,0.491,0.4019
-0.0252,0.0502,0.4052,0.4,0.4043,0.3703,0.3283,0.4634,0.4485,0.4633
0.1,0.0585,0.2841,0.1631,0.2425,0.2463,0.3308,0.3625,0.3208,0.4118
0.0596,0.2888,0.3474,0.3209,0.3964,0.3716,0.3897,0.4335,0.5012,0.501
0.128,0.2587,0.1294,0.1746,0.3831,0.4372,0.2658,0.4941,0.5063,0.4521
0.0533,0.1458,0.163,0.1512,0.3634,0.3798,0.2542,0.4798,0.4234,0.3686
0.156,0.3094,0.1822,0.252,0.3884,0.3145,0.3144,0.4844,0.4293,0.4747
0.1494,0.322,0.2352,0.4696,0.3771,0.3339,0.3866,0.5175,0.5327,0.5455
0.1402,0.1654,0.1321,0.32,0.2049,0.3292,0.3421,0.3771,0.3219,0.4704
0.0412,0.205,0.2611,0.2462,0.226,0.2654,0.3374,0.4272,0.4001,0.4805
0.2036,0.0406,0.2414,0.1173,0.2409,0.3362,0.1838,0.4578,0.4419,0.3463
0.0373,0.1611,0.3256,0.219,0.2419,0.3328,0.34,0.4428,0.4212,0.4108
0.0466,0.1417,0.2313,0.24,0.2913,0.2897,0.2619,0.4259,0.4429,0.4455
0.1764,0.4984,0.2755,0.4314,0.4539,0.4039,0.4394,0.6024,0.5588,0.5542
0.0371,0.3968,0.2232,0.2916,0.2678,0.2401,0.4295,0.4493,0.4396,0.4939
0.1488,0.2051,0.1937,0.3377,0.3033,0.3389,0.4249,0.4818,0.5201,0.5564
0.0258,0.248,0.1968,0.3779,0.322,0.3473,0.3829,0.4621,0.4953,0.5005
0.1114,0.4661,0.2906,0.3836,0.3471,0.4184,0.5324,0.3572,0.4709,0.5819
0.0977,0.1758,0.2091,0.2227,0.3594,0.402,0.3241,0.3941,0.4005,0.4673
0.1205,0.3329,0.1821,0.3531,0.4366,0.4029,0.3971,0.5179,0.5118,0.4952
0.1237,0.2919,0.3029,0.2409,0.3642,0.3033,0.4162,0.3697,0.4045,0.4631
0.0083,0.0711,0.2264,0.1313,0.3845,0.3031,0.1721,0.4198,0.3947,0.4021
0.1109,0.2232,0.2967,0.331,0.3537,0.371,0.375,0.4203,0.4441,0.4773
0.0026,0.2805,0.1448,0.3834,0.3061,0.2528,0.3593,0.3317,0.4212,0.4611
0.0278,0.2597,0.3752,0.4033,0.342,0.1644,0.3855,0.3884,0.4558,0.4636
-0.0069,0.1487,0.3058,0.2545,0.3908,0.3101,0.4294,0.378,0.4134,0.4843
0.0771,0.1846,0.205,0.3112,0.4401,0.4299,0.4275,0.4848,0.4994,0.5493
0.1394,0.1882,0.2506,0.3027,0.1859,0.3294,0.389,0.4421,0.4134,0.512
0.1678,0.2479,0.2121,0.3261,0.2768,0.1437,0.3437,0.4038,0.4128,0.438
0.2631,0.2231,0.0518,0.372,0.2061,0.3925,0.4852,0.3773,0.4603,0.5459
-0.018,0.4085,0.2033,0.3603,0.3644,0.3485,0.3323,0.4246,0.4542,0.4896
0.1415,0.3032,0.2141,0.2637,0.2094,0.3042,0.3165,0.49,0.4943,0.4999
0.0335,0.2837,0.226,0.2494,0.2203,0.2239,0.3038,0.408,0.3687,0.3589
0.1124,0.2374,0.0637,0.2613,0.3663,0.2283,0.3887,0.4276,0.4283,0.4106
0.0569,0.4023,0.2841,0.2536,0.4383,0.3366,0.3438,0.3371,0.4361,0.4483
0.265,0.3516,0.1823,0.3168,0.2173,0.2848,0.3283,0.4115,0.4745,0.5031
0.0523,0.3161,0.1442,0.3114,0.3185,0.3614,0.3133,0.4767,0.4794,0.4571
0.1233,0.2467,0.1923,0.2492,0.2241,0.2642,0.3526,0.4885,0.4882,0.4225
0.1664,0.2842,0.3826,0.224,0.3569,0.4868,0.3222,0.4715,0.4947,0.4808
0.0435,0.3546,0.3421,0.3497,0.4012,0.3783,0.3532,0.4626,0.548,0.4917
-0.0017,-0.0396,0.2311,0.2777,0.3645,0.2561,0.374,0.4084,0.441,0.4788
0.0616,0.2222,0.1976,0.3362,0.435,0.4511,0.3571,0.4732,0.5028,0.4844
0.1017,0.1209,0.2294,0.1804,0.2803,0.3356,0.2421,0.5342,0.5423,0.4375
0.0583,0.1969,0.1221,0.2983,0.2755,0.3474,0.3461,0.4443,0.4317,0.5125
0.0239,-0.0217,0.1134,0.4464,0.2108,0.291,0.2987,0.4417,0.4558,0.3795
0.0519,0.228,0.2677,0.3424,0.4427,0.3503,0.4627,0.3832,0.4156,0.4593
0.0547,0.2515,0.1892,0.1906,0.4064,0.2403,0.3027,0.3852,0.381,0.3436
0.0279,0.1848,0.3082,0.2481,0.3325,0.474,0.4221,0.4627,0.4501,0.4743
0.0335,0.1469,0.1876,0.2378,0.1612,0.2586,0.2979,0.4463,0.436,0.3288
0.1268,0.393,0.3013,0.3838,0.4978,0.411,0.3657,0.5636,0.5203,0.4921
0.1344,0.1014,0.2741,0.3685,0.3184,0.3793,0.2855,0.4105,0.4564,0.4029
-0.0198,0.3594,0.2593,0.2995,0.3562,0.4045,0.2113,0.4198,0.4288,0.3625
0.2213,0.1624,0.2242,0.1912,0.3105,0.3344,0.211,0.4656,0.4447,0.3214
0.1482,0.3214,0.155,0.4626,0.3248,0.3352,0.4422,0.5396,0.4669,0.5288
0.0685,0.2043,0.3444,0.2942,0.2081,0.3927,0.3577,0.4644,0.4184,0.4621
-0.056,0.14,0.2496,0.354,0.2813,0.284,0.3726,0.2885,0.3468,0.4853
0.1857,0.1752,0.2411,0.3382,0.2821,0.2428,0.4083,0.4707,0.4852,0.5598
0.127,0.2101,0.2466,0.2234,0.3221,0.3574,0.4473,0.5321,0.5054,0.4572
0.0446,0.2957,0.1532,0.1605,0.2494,0.3137,0.2186,0.4293,0.3747,0.4354
0.1413,0.2302,0.0503,0.2743,0.2767,0.3856,0.2621,0.3035,0.3805,0.3922
-0.0792,0.2261,0.116,0.2551,0.337,0.3689,0.3068,0.3648,0.3185,0.3257
0.1195,0.2293,0.3143,0.394,0.3965,0.4292,0.3915,0.5833,0.5014,0.4963
0.1445,0.1203,0.2174,0.2969,0.3431,0.4891,0.3413,0.5122,0.4683,0.5302
0.1231,0.2324,0.0801,0.2906,0.4072,0.3406,0.3745,0.4084,0.4175,0.4988
0.096,0.1867,0.2052,0.3691,0.3249,0.3079,0.412,0.4533,0.5001,0.5275
0.1815,0.2591,0.3678,0.3295,0.142,0.314,0.4592,0.4115,0.4261,0.5225
0.0747,0.3357,0.1844,0.3618,0.3982,0.3186,0.3766,0.4414,0.4019,0.4525
0.0017,0.3186,0.1822,0.3236,0.3652,0.2926,0.4369,0.4586,0.486,0.5014
0.1006,0.2391,0.2773,0.2501,0.2756,0.3589,0.3541,0.5002,0.3368,0.5106
0.0655,0.0367,0.1961,0.2989,0.1813,0.2827,0.3228,0.2969,0.3744,0.4311
0.0174,0.1666,0.2197,0.3514,0.3993,0.267,0.3566,0.3734,0.4616,0.5195
0.0835,0.313,0.0673,0.4766,0.1113,0.4,0.2952,0.3687,0.3909,0.424
0.2558,0.3553,0.1718,0.2465,0.4845,0.499,0.2773,0.4799,0.5316,0.5329
0.1369,0.3028,0.1866,0.3205,0.2933,0.2192,0.3921,0.4495,0.4816,0.4515
0.1659,0.2398,0.14,0.3185,0.365,0.4173,0.3845,0.3975,0.4091,0.5251
0.1156,0.2933,0.3133,0.42,0.404,0.2555,0.5121,0.5161,0.5276,0.5838
0.1429,0.1311,0.193,0.3072,0.457,0.326,0.4077,0.4866,0.4839,0.5072
0.1321,0.1717,0.3413,0.2354,0.411,0.3422,0.3203,0.4387,0.465,0.4836
0.0934,0.2556,0.2787,0.2853,0.3806,0.3968,0.3227,0.4307,0.4587,0.4556
0.077,0.1351,0.1611,0.246,0.2903,0.3668,0.3415,0.285,0.4355,0.4023
0.1515,0.2202,0.2045,0.2343,0.3494,0.3775,0.3308,0.4388,0.4913,0.4145
0.1112,0.1801,0.2405,0.2593,0.2633,0.2758,0.2449,0.4253,0.4268,0.3406
0.0329,0.0488,0.1029,0.3815,0.2398,0.3917,0.3725,0.2957,0.3403,0.4019
0.1258,0.1281,0.2889,0.2653,0.4385,0.4636,0.3551,0.468,0.4988,0.5433
0.1698,0.3073,0.342,0.2972,0.3564,0.2805,0.3254,0.3922,0.4471,0.496
-0.0236,0.3892,0.1884,0.227,0.4159,0.0932,0.3979,0.5225,0.3996,0.4161
0.0939,0.1498,0.2071,0.1602,0.1892,0.3577,0.2609,0.2981,0.3498,0.3284
0.1216,0.0725,0.0928,0.1097,0.2763,0.2345,0.1949,0.4384,0.3509,0.2922
0.1426,0.2149,0.3613,0.4618,0.375,0.4788,0.4723,0.4617,0.5141,0.543
0.07,0.2849,0.166,0.3024,0.3006,0.3858,0.4075,0.4885,0.4803,0.4224
0.147,0.2997,0.2203,0.1813,0.1917,0.2093,0.3277,0.3611,0.3928,0.4755
0.0854,0.3037,0.3886,0.3143,0.3112,0.3285,0.3517,0.4346,0.4385,0.4775
0.1621,0.3147,0.1248,0.314,0.2554,0.2499,0.2902,0.4239,0.471,0.5194
0.1292,0.1349,0.1926,0.2858,0.2758,0.1685,0.4106,0.3819,0.4685,0.5114
0.1335,0.1277,0.2345,0.1673,0.3181,0.395,0.1673,0.4424,0.4699,0.476
0.1301,0.2359,0.1171,0.233,0.3552,0.3229,0.3688,0.3953,0.385,0.3946
0.0641,0.2201,0.2209,0.2659,0.4582,0.3687,0.3534,0.3988,0.4562,0.4206
-0.0342,0.2582,0.2228,0.3162,0.404,0.453,0.3382,0.4635,0.559,0.54
0.1244,0.2334,0.2544,0.422,0.3183,0.3806,0.5182,0.4623,0.5086,0.5192
-0.0011,0.2994,0.2525,0.2664,0.4457,0.3595,0.3707,0.4325,0.3938,0.5108
0.11,0.3443,0.2347,0.3127,0.3375,0.2372,0.4458,0.4669,0.4128,0.524
0.2259,0.0853,0.185,0.197,0.2943,0.3622,0.2909,0.4643,0.4421,0.3537
0.1371,0.1927,0.2223,0.2857,0.1996,0.3171,0.3345,0.4808,0.4939,0.4944
0.0324,0.1855,0.3445,0.2635,0.3716,0.3407,0.316,0.4718,0.4924,0.4317
0.1593,0.2244,0.207,0.4217,0.1725,0.2606,0.4147,0.3987,0.4219,0.5387
0.1403,0.2994,0.2776,0.2133,0.3402,0.3,0.3052,0.4626,0.4341,0.4708
-0.0233,0.1571,0.2179,0.3256,0.3379,0.3508,0.3311,0.446,0.3729,0.391
0.1419,0.2665,0.2939,0.2712,0.2965,0.4163,0.3817,0.5204,0.5292,0.563
0.0482,0.2333,0.4238,0.2868,0.4169,0.4417,0.3469,0.4764,0.4644,0.4538
0.0645,0.1731,0.3039,0.2593,0.5489,0.5717,0.2598,0.5492,0.5501,0.5424
0.1096,0.1447,0.2389,0.3116,0.3812,0.3931,0.3677,0.3914,0.4363,0.4673
0.2085,0.3187,0.2171,0.3347,0.3313,0.3516,0.4614,0.3692,0.4675,0.5693
-0.0522,0.227,0.1966,0.2717,0.2634,0.3773,0.3464,0.3994,0.4634,0.5101
0.0847,0.26,0.1517,0.2706,0.3807,0.2932,0.3183,0.3974,0.4097,0.4345
0.1402,0.3244,0.37,0.4335,0.3106,0.3526,0.3806,0.3834,0.4733,0.49
0.1173,0.1961,0.2154,0.4421,0.2084,0.3023,0.3732,0.3803,0.3923,0.5002
0.0342,0.2568,0.2482,0.3073,0.2258,0.3751,0.3668,0.4901,0.4356,0.4026
0.0985,0.2554,0.1192,0.3242,0.4672,0.3149,0.4405,0.4966,0.488,0.4803
0.2156,0.1058,0.1684,0.1364,0.2642,0.3123,0.2654,0.4565,0.4197,0.3795
0.1602,0.2303,0.2947,0.3375,0.3965,0.5553,0.4513,0.5422,0.547,0.5834
0.0773,0.0501,0.1296,0.3442,0.2741,0.3323,0.3081,0.3404,0.3557,0.4596
0.1093,0.2883,0.2708,0.3186,0.4369,0.401,0.4239,0.5215,0.4977,0.4795
0.1399,0.1943,0.3044,0.2928,0.3909,0.424,0.4156,0.4359,0.4371,0.5221
0.0322,0.231,0.1641,0.3852,0.283,0.3451,0.3438,0.3058,0.3309,0.3978
0.0839,0.0841,0.2955,0.3095,0.3915,0.2618,0.4568,0.4432,0.5229,0.5599
0.0811,0.3269,0.2837,0.2252,0.1438,0.3105,0.264,0.3624,0.3539,0.324
0.086,0.1884,0.2027,0.2335,0.3614,0.3457,0.3297,0.4818,0.4097,0.5064
0.2268,0.2924,0.2043,0.2535,0.265,0.3211,0.4208,0.4828,0.4818,0.5642
0.0608,0.1988,0.3117,0.204,0.2877,0.2533,0.426,0.513,0.4664,0.4007
-0.0288,0.1151,0.1633,0.3056,0.3823,0.4291,0.3429,0.4423,0.4484,0.4965
0.1941,-0.0912,0.1656,0.3909,0.1441,0.2607,0.3683,0.3732,0.3676,0.4443
0.0519,0.2101,0.3585,0.3997,0.2576,0.3342,0.4684,0.4041,0.44,0.5378
0.1627,0.2337,0.2899,0.1195,0.2975,0.4961,0.2329,0.503,0.4079,0.373
0.1628,0.2823,0.1727,0.2924,0.381,0.3131,0.3339,0.3891,0.4253,0.4729
-0.0076,0.1922,0.5107,0.3045,0.3782,0.3751,0.3248,0.5843,0.3993,0.4377
0.2223,0.3349,0.277,0.322,0.401,0.3991,0.3776,0.3773,0.3898,0.4372
0.1372,0.3025,0.1326,0.2277,0.285,0.2869,0.3572,0.36,0.3996,0.516
0.0876,0.1438,0.4042,0.3547,0.2678,0.3446,0.3502,0.3599,0.338,0.42
0.1247,0.2787,0.2773,0.3248,0.4161,0.417,0.4364,0.5032,0.4819,0.603
0.0832,0.2504,0.2949,0.151,0.3792,0.3887,0.2245,0.484,0.4091,0.4419
0.0195,0.2603,0.2055,0.3453,0.3389,0.2997,0.3833,0.3992,0.3679,0.3989
0.1779,0.1772,0.3182,0.3141,0.2736,0.2572,0.3543,0.3655,0.3938,0.4347
0.1198,0.3114,0.2929,0.3535,0.3942,0.3871,0.3892,0.4511,0.4319,0.4757
0.2365,0.2454,0.0934,0.2804,0.1747,0.1369,0.2739,0.3547,0.3229,0.3953
0.0404,0.2158,0.2886,0.2817,0.4582,0.4474,0.406,0.5222,0.3717,0.4876
0.0933,0.3986,0.2079,0.2599,0.3681,0.4408,0.4816,0.4794,0.5135,0.3758
0.1663,0.2236,0.0189,0.2885,0.3596,0.3172,0.3927,0.3723,0.3769,0.4491
0.1038,0.1724,0.2566,0.1572,0.342,0.3367,0.2396,0.3357,0.3589,0.3993
0.0479,0.1214,0.2392,0.2241,0.2473,0.3755,0.2241,0.3878,0.4327,0.4021
0.1732,0.095,0.2221,0.2105,0.314,0.3385,0.2872,0.438,0.4332,0.4586
0.2288,0.2593,0.1824,0.3025,0.4178,0.5454,0.3715,0.4508,0.4441,0.5428
0.2388,0.2586,0.1927,0.2305,0.3406,0.3491,0.4458,0.3975,0.4326,0.5137
0.2122,0.06,0.2771,0.2438,0.4628,0.4456,0.3333,0.3515,0.3993,0.433
-0.0847,0.2369,0.4969,0.304,0.3764,0.3656,0.3254,0.4902,0.4896,0.4512
-0.0643,0.3163,0.349,0.4124,0.4465,0.4002,0.3968,0.4039,0.4798,0.5487
0.0924,0.3458,0.3883,0.3692,0.4197,0.4115,0.4356,0.5017,0.5604,0.5712
0.0266,0.2913,0.2958,0.4237,0.4585,0.3821,0.4263,0.4696,0.4483,0.4953
-0.0077,0.3372,0.2156,0.3261,0.4157,0.3475,0.4339,0.4446,0.4412,0.5117
0.1823,0.1252,0.2932,0.382,0.207,0.3782,0.4568,0.5841,0.6073,0.5825
0.1289,-0.0499,0.2767,0.4061,0.3165,0.4425,0.355,0.503,0.5243,0.5704
0.1241,0.0553,0.0911,0.3906,0.2132,0.2389,0.3848,0.3264,0.3727,0.4836
0.166,0.1917,0.0721,0.1552,0.2778,0.3852,0.3302,0.4433,0.4331,0.3448
0.0712,0.2978,0.2051,0.3065,0.2532,0.3463,0.3623,0.3927,0.4329,0.4093
0.1614,0.4063,0.2715,0.3934,0.3956,0.1457,0.446,0.3767,0.3912,0.5581
0.102,0.1878,0.1992,0.1515,0.1139,0.2013,0.2377,0.4105,0.454,0.4313
0.1945,0.1876,0.0675,0.3171,0.4188,0.3661,0.3263,0.4634,0.5221,0.4837
0.1272,0.0674,0.2844,0.2963,0.4652,0.4204,0.416,0.5339,0.4513,0.5555
0.0193,0.2981,0.201,0.1997,0.4567,0.2884,0.3193,0.4642,0.4822,0.4347
0.0341,0.2985,0.1231,0.3401,0.1973,0.2607,0.2919,0.3272,0.3915,0.3854
0.1785,0.1214,0.2055,0.3292,0.4227,0.3044,0.2871,0.44,0.4426,0.4797
0.0905,0.1121,0.1302,0.3367,0.3797,0.2475,0.3821,0.4578,0.5018,0.486
0.0868,0.2504,0.3028,0.216,0.4411,0.3851,0.3879,0.4581,0.4304,0.4114
0.0599,0.3062,0.2569,0.3222,0.3408,0.3171,0.3721,0.5349,0.493,0.5162
0.0906,0.3141,0.2367,0.2392,0.3044,0.338,0.3715,0.3428,0.3408,0.4091
-0.0268,0.2259,0.2805,0.2946,0.2303,0.2857,0.3593,0.264,0.308,0.4462
0.2192,0.2287,0.1873,0.1477,0.2772,0.3237,0.2901,0.3913,0.4925,0.4622
0.0663,0.2401,0.0974,0.3098,0.3183,0.4021,0.4329,0.3812,0.4387,0.5163
0.1122,0.239,0.3459,0.3433,0.2982,0.3684,0.4696,0.4202,0.4953,0.4867
0.121,0.2019,0.1206,0.3176,0.3609,0.2413,0.3118,0.4181,0.4595,0.476
0.1413,-0.0045,0.2687,0.3491,0.2033,0.0793,0.3545,0.3314,0.3483,0.5672
0.1156,0.1565,0.1426,0.2167,0.3319,0.2618,0.2149,0.3858,0.3988,0.3736
0.0725,0.3073,0.3179,0.2532,0.4473,0.4196,0.3565,0.4107,0.3493,0.4538
0.098,0.2578,0.2637,0.3172,0.3243,0.3609,0.2928,0.4427,0.4626,0.5045
0.011,0.2121,0.2811,0.3274,0.2259,0.3624,0.3494,0.5207,0.5568,0.4955
0.1623,0.2467,0.2353,0.2893,0.3478,0.3393,0.4448,0.439,0.3774,0.4822
0.0213,0.2852,0.4078,0.3169,0.4469,0.4354,0.3568,0.5022,0.5069,0.5038
0.1044,0.3206,0.2339,0.3913,0.4354,0.4329,0.3323,0.5371,0.4957,0.5352
0.1654,0.0894,0.1761,0.2655,0.2133,0.2587,0.3312,0.4444,0.4126,0.4352
0.0482,0.0997,0.3606,0.3478,0.2335,0.3157,0.3442,0.429,0.4901,0.4159
0.236,0.3092,0.1087,0.3076,0.2336,0.28,0.3809,0.3928,0.3928,0.565
0.1039,0.1928,0.2862,0.316,0.3638,0.5045,0.3967,0.4314,0.4587,0.4573
0.0443,0.2269,0.3504,0.2738,0.3603,0.4678,0.3481,0.5268,0.5119,0.423
0.1434,0.1605,0.1954,0.4254,0.2014,0.3257,0.4017,0.3775,0.4899,0.5181
0.0443,0.3166,0.4738,0.2652,0.3706,0.4488,0.3627,0.6146,0.584,0.5715
0.0651,0.2876,0.1668,0.257,0.1615,0.3334,0.3366,0.4311,0.4777,0.4119
0.0767,0.2784,0.3239,0.2226,0.2443,0.4253,0.1819,0.3451,0.3988,0.265
0.1408,0.2857,0.1251,0.2882,0.3044,0.2186,0.3394,0.3779,0.3927,0.4645
0.1242,0.3233,0.2569,0.0671,0.27,0.3576,0.2123,0.3365,0.4075,0.3484
0.1972,0.2957,0.3213,0.4755,0.376,0.304,0.4927,0.4288,0.4837,0.4897
-0.0296,0.1099,0.194,0.2774,0.2892,0.2276,0.3354,0.4408,0.4215,0.4093
0.1575,0.3066,0.1766,0.3406,0.3326,0.5197,0.4659,0.4636,0.512,0.5881
0.2559,0.2405,0.2271,0.2091,0.2458,0.3897,0.371,0.3123,0.4162,0.3773
0.1508,0.1851,0.3855,0.3233,0.3113,0.3039,0.401,0.4253,0.4748,0.4491
0.0346,0.2743,0.1603,0.3781,0.2739,0.1969,0.2678,0.4364,0.438,0.4821
0.0848,0.1993,0.3615,0.3198,0.4208,0.3917,0.3373,0.4293,0.404,0.4076
0.0386,0.27,0.1882,0.1562,0.3525,0.3099,0.2735,0.4669,0.3533,0.4506
0.0807,0.2967,0.1706,0.2416,0.4696,0.3632,0.3172,0.4199,0.4118,0.5077
0.003,0.2274,0.2665,0.2836,0.3719,0.4141,0.3491,0.5222,0.2806,0.4888
0.1821,0.1965,0.1557,0.3529,0.1297,0.2456,0.2608,0.4276,0.3546,0.5053
0.0601,0.2078,0.3325,0.45,0.3008,0.3914,0.4096,0.3985,0.3865,0.4685
0.0162,0.4035,0.3107,0.3186,0.3193,0.4413,0.4055,0.5764,0.5923,0.6189
0.133,0.2528,0.2857,0.2846,0.3934,0.429,0.3826,0.36,0.3674,0.4497
0.085,0.2094,0.0979,0.2113,0.3479,0.4508,0.2749,0.39,0.4036,0.4863
0.045,0.1569,0.2725,0.2187,0.3506,0.2999,0.3728,0.4244,0.3551,0.3636
-0.0451,0.167,0.2573,0.2563,0.2931,0.3432,0.2918,0.4568,0.3575,0.363
0.0652,0.1386,0.2799,0.1594,0.2176,0.3372,0.2583,0.4408,0.3973,0.3969
0.1625,0.1798,0.1689,0.2746,0.2889,0.3119,0.3679,0.4149,0.423,0.53
-0.0548,0.294,0.4044,0.3377,0.4274,0.4944,0.3567,0.4859,0.4591,0.5081
0.102,0.3476,0.4035,0.3566,0.3685,0.3397,0.5001,0.4861,0.5145,0.5597
0.1279,0.1833,0.31,0.2869,0.3334,0.4063,0.4444,0.4784,0.4515,0.5112
0.0901,0.1096,0.3456,0.3879,0.3953,0.4571,0.4161,0.533,0.518,0.5351
0.1034,0.2056,0.2106,0.2804,0.3271,0.3466,0.3336,0.3531,0.4397,0.4947
-0.0722,0.2845,0.1402,0.2949,0.2816,0.3896,0.3072,0.4341,0.4242,0.4509
0.11,0.2253,0.169,0.323,0.28,0.3416,0.3696,0.3268,0.4135,0.4246
0.0664,0.163,0.3287,0.1909,0.4183,0.3629,0.2914,0.4596,0.5717,0.4576
0.0893,0.3507,0.2525,0.3536,0.3969,0.4251,0.4672,0.4276,0.4611,0.5584
0.0811,0.1201,0.2495,0.2919,0.3021,0.2728,0.3361,0.4317,0.4131,0.4307
0.0792,0.3246,0.2915,0.2453,0.3103,0.3976,0.351,0.4863,0.4923,0.4516
0.1834,0.2335,0.2637,0.2743,0.3116,0.3205,0.3567,0.3783,0.4025,0.4959
0.1103,0.2921,0.2141,0.3447,0.3376,0.4711,0.4204,0.4834,0.5306,0.5738
0.0942,0.2514,0.2681,0.1873,0.2151,0.2592,0.3423,0.3714,0.3652,0.4622
0.152,0.1743,0.1973,0.3655,0.3052,0.3655,0.32,0.4178,0.5192,0.4516
0.0089,0.1678,0.3406,0.2653,0.324,0.3781,0.3058,0.4798,0.4477,0.3362
0.0337,0.2201,0.1014,0.2829,0.1694,0.2916,0.3415,0.267,0.3363,0.3688
0.1678,0.1814,0.2283,0.2121,0.3839,0.3976,0.3532,0.3895,0.3796,0.4536
0.1497,0.2798,0.1484,0.2907,0.2336,0.2703,0.3684,0.4469,0.4136,0.512
0.0177,0.2011,0.2426,0.2269,0.3447,0.385,0.3687,0.5636,0.4953,0.523
0.2502,0.2856,0.2081,0.2519,0.3113,0.4342,0.3409,0.6198,0.5133,0.4994
0.0163,0.2637,0.1706,0.3338,0.3398,0.3493,0.3998,0.4755,0.4703,0.4538
0.0647,0.2868,0.2444,0.2735,0.305,0.3535,0.4905,0.468,0.4294,0.542
0.1467,0.332,0.2403,0.233,0.3315,0.3426,0.3181,0.4908,0.5096,0.4793
0.131,0.3282,0.2779,0.3632,0.4627,0.4205,0.3654,0.5022,0.527,0.5006
0.2419,0.2942,0.1608,0.1855,0.2438,0.224,0.3168,0.4545,0.3583,0.4238
0.0731,0.2885,0.1923,0.4088,0.3608,0.2462,0.3531,0.5151,0.5281,0.5585
0.1138,0.2915,0.2756,0.4392,0.2328,0.3499,0.2739,0.4339,0.4786,0.3636
0.0668,0.1222,0.4455,0.4335,0.4107,0.5097,0.4987,0.4844,0.5366,0.5672
0.0755,0.278,0.4078,0.306,0.3409,0.3837,0.384,0.4725,0.4848,0.5
0.0021,0.0809,0.2071,0.421,0.3024,0.3178,0.3441,0.5079,0.5042,0.5015
0.0791,0.2975,0.2056,0.2322,0.2663,0.3546,0.3364,0.4493,0.4443,0.3638
0.1609,0.1433,0.2689,0.1469,0.4665,0.4789,0.24,0.4637,0.428,0.4538
0.0746,0.1652,0.3041,0.1494,0.4328,0.4022,0.1853,0.5,0.4722,0.4446
0.0852,0.2102,0.1852,0.2587,0.3498,0.4455,0.333,0.4266,0.4454,0.479
0.2454,0.2794,0.2735,0.2507,0.233,0.2471,0.38,0.4418,0.3613,0.5489
0.0464,0.2672,0.2781,0.3248,0.2833,0.3729,0.335,0.3831,0.4412,0.4188
0.0981,0.2891,0.3134,0.2478,0.3216,0.367,0.3954,0.5064,0.4612,0.4722
0.2137,0.1983,0.2388,0.1759,0.3446,0.3777,0.2961,0.4693,0.4128,0.4806
0.1276,0.2724,0.1761,0.1145,0.2384,0.3085,0.2645,0.4035,0.3196,0.335
0.215,0.198,0.3107,0.3448,0.3896,0.2902,0.4451,0.4372,0.5175,0.5378
0.0396,0.2978,0.2609,0.2774,0.3246,0.3699,0.3824,0.423,0.4055,0.4115
0.0207,0.1349,0.2782,0.2599,0.2461,0.4967,0.3313,0.5178,0.506,0.4758
-0.0903,0.174,0.2503,0.2505,0.3883,0.2318,0.2867,0.411,0.4161,0.4319
0.1405,0.2117,0.2363,0.3815,0.3758,0.4054,0.4638,0.4858,0.4685,0.4746
0.0057,0.0989,0.2664,0.3478,0.3303,0.299,0.2822,0.4216,0.409,0.3933
0.1176,0.2357,0.3269,0.2428,0.3476,0.2783,0.3804,0.4916,0.4914,0.5008
0.0618,0.1042,0.1081,0.2947,0.0965,0.2831,0.3169,0.4138,0.4001,0.3751
0.0155,0.3145,0.1853,0.3089,0.1701,0.259,0.3695,0.3644,0.3907,0.4901
0.0971,0.3412,0.3432,0.3917,0.2927,0.2966,0.4236,0.4531,0.4668,0.5033
0.1361,0.1209,0.3163,0.1604,0.2911,0.1833,0.2788,0.4175,0.3672,0.3362
0.3762,0.153,0.2471,0.24,0.2243,0.2514,0.2627,0.3978,0.4203,0.3943
0.0439,0.2098,0.2822,0.2897,0.3129,0.3826,0.3805,0.4444,0.5157,0.501
0.1691,0.2631,0.1956,0.2214,0.2794,0.4203,0.4126,0.4257,0.4145,0.4076
0.2002,0.2903,0.2597,0.3492,0.2901,0.4033,0.4458,0.4573,0.4592,0.5424
0.1395,0.2737,0.1301,0.2963,0.2651,0.2604,0.4118,0.4012,0.4512,0.563
0.1321,0.148,0.0876,0.3351,0.3961,0.3238,0.3979,0.4105,0.372,0.4596
0.1413,0.3825,0.1274,0.3033,0.2768,0.3688,0.3954,0.3679,0.3834,0.4855
0.1679,0.1756,0.1876,0.3257,0.3976,0.2818,0.4955,0.4648,0.48,0.6089
0.0578,0.2474,0.2088,0.362,0.3163,0.294,0.3835,0.4056,0.4188,0.5332
0.174,0.2915,0.2307,0.2191,0.3438,0.3417,0.4079,0.3961,0.3821,0.4338
0.1407,0.2246,0.293,0.2298,0.2791,0.3223,0.293,0.4702,0.4603,0.4769
0.2867,0.3014,0.2258,0.149,0.389,0.2856,0.3483,0.4896,0.4915,0.4396
0.0761,0.3257,0.2035,0.1729,0.3591,0.352,0.3104,0.3488,0.38,0.375
0.02,0.2572,0.132,0.3213,0.1958,0.3122,0.3286,0.3736,0.3475,0.4694
0.1316,0.0459,0.1755,0.3626,0.2585,0.3224,0.2946,0.3918,0.4173,0.4961
-0.1369,0.4125,0.0643,0.3199,0.5424,0.4644,0.3243,0.555,0.5607,0.5825
0.2475,0.1158,0.1906,0.2,0.234,0.2113,0.2996,0.3465,0.3405,0.4195
0.2375,0.308,0.2561,0.2268,0.368,0.3473,0.3749,0.3938,0.4446,0.4361
0.0717,0.2143,0.2154,0.2601,0.2693,0.3837,0.3571,0.5264,0.4976,0.4444
0.0047,0.4123,0.2361,0.3124,0.2612,0.3727,0.3879,0.4276,0.4183,0.4779
0.0948,0.258,0.289,0.3824,0.4051,0.4273,0.4446,0.4154,0.5337,0.5525
0.1584,0.3234,0.2546,0.1687,0.354,0.3581,0.2961,0.5168,0.5132,0.5233
-0.0108,0.0342,0.3757,0.4264,0.3504,0.3519,0.4847,0.4213,0.512,0.6246
0.0948,0.2717,0.2182,0.2787,0.2717,0.2387,0.3029,0.4102,0.4751,0.5113
0.1865,0.2066,0.2368,0.3381,0.3257,0.2721,0.3905,0.4668,0.4842,0.4855
-0.0575,0.1922,0.0084,0.1692,0.2937,0.3852,0.2883,0.4297,0.3868,0.4586
-0.0299,0.2106,0.1752,0.2807,0.3462,0.2993,0.3057,0.3691,0.4261,0.4222
0.2131,0.2172,0.2331,0.3198,0.3537,0.3825,0.2935,0.4076,0.3529,0.4419
0.0971,0.2416,0.087,0.1556,0.2129,0.2977,0.266,0.3429,0.3458,0.3167
0.1844,0.2592,0.0974,0.1852,0.3143,0.3125,0.261,0.3867,0.4441,0.4031
0.0719,0.2968,0.1742,0.2595,0.3,0.2757,0.4584,0.4072,0.4652,0.5148
-0.0281,0.2353,0.1644,0.2749,0.3385,0.3849,0.3493,0.5008,0.4942,0.4341
0.1029,0.1371,0.1679,0.1847,0.3718,0.2459,0.3069,0.3966,0.4236,0.3767
0.1722,0.3998,0.1687,0.2758,0.2138,0.3122,0.4138,0.4311,0.3971,0.4759
0.0329,0.0706,0.1515,0.3718,0.2451,0.1781,0.3188,0.3177,0.3617,0.3713
0.233,0.3017,0.2843,0.1867,0.3614,0.3607,0.3059,0.5191,0.5329,0.4771
0.0769,0.3071,0.2782,0.201,0.2445,0.2955,0.3828,0.4065,0.4851,0.4212
0.1913,0.2971,0.369,0.1699,0.3065,0.4463,0.2413,0.5155,0.5221,0.4387
0.0874,0.2784,0.2225,0.2869,0.3913,0.4754,0.3739,0.4825,0.514,0.4618
0.0832,0.3176,0.1656,0.305,0.3518,0.364,0.4021,0.4597,0.479,0.4958
-0.0622,0.1541,0.2825,0.2434,0.318,0.3627,0.2811,0.3797,0.4024,0.3806
0.0477,0.1998,0.084,0.1671,0.2549,0.3303,0.2344,0.2828,0.3098,0.2468
0.0117,0.2862,0.1094,0.2991,0.2228,0.3698,0.2528,0.4429,0.4393,0.3877
0.1857,0.2858,0.3084,0.3295,0.3649,0.2484,0.4452,0.4962,0.4629,0.4793
0.2038,0.2458,0.1551,0.2031,0.3566,0.3227,0.4112,0.3876,0.4267,0.4388
0.0053,0.2136,0.2401,0.2667,0.2659,0.382,0.3683,0.468,0.4703,0.4728
0.1106,0.3343,0.1849,0.3102,0.3754,0.2228,0.3206,0.3233,0.395,0.4442
0.1386,0.2579,0.2437,0.379,0.3519,0.3914,0.3922,0.4802,0.4785,0.5074
0.1392,0.1078,0.1574,0.263,0.4025,0.2369,0.2986,0.372,0.3842,0.3368
0.1565,0.1571,0.3438,0.3272,0.3349,0.3708,0.4317,0.4358,0.4807,0.5235
0.1018,0.1942,0.2089,0.3401,0.2216,0.2737,0.3955,0.3582,0.3926,0.5136
0.1044,0.0012,0.2335,0.4067,0.2071,0.4739,0.4271,0.4792,0.4541,0.4295
0.0681,0.3342,0.2872,0.3602,0.3779,0.4055,0.4245,0.5401,0.4874,0.5087
0.1352,0.3175,0.1087,0.3408,0.3139,0.4443,0.4614,0.4446,0.4947,0.5529
0.2118,0.3812,0.0078,0.1746,0.1682,0.3348,0.244,0.39,0.311,0.3828
0.1166,0.2611,0.2938,0.2141,0.4768,0.3027,0.2939,0.4662,0.5363,0.4851
0.1104,0.338,0.217,0.2902,0.2705,0.4155,0.4579,0.4862,0.5089,0.4798
0.0991,0.2903,0.1982,0.3282,0.1639,0.1493,0.3882,0.2492,0.4063,0.4996
0.1479,0.1478,0.3139,0.3837,0.3259,0.3607,0.461,0.4287,0.517,0.5172
0.1195,0.2212,0.3245,0.3513,0.3994,0.3657,0.433,0.4441,0.4281,0.5083
0.0625,0.108,0.2551,0.3823,0.4987,0.4403,0.3882,0.5597,0.5991,0.5493
0.2399,0.069,0.3512,0.3697,0.3518,0.4832,0.2724,0.4446,0.4998,0.5042
0.1268,0.4277,0.205,0.3517,0.3861,0.3659,0.4159,0.4993,0.56,0.4731
0.0388,0.2741,0.0135,0.2857,0.3674,0.2105,0.3396,0.4653,0.4151,0.3947
0.1327,0.2092,0.2737,0.2734,0.4112,0.2695,0.3793,0.4715,0.5157,0.526
0.0817,0.2476,0.1543,0.178,0.2503,0.1778,0.2887,0.34,0.3721,0.3359
0.1262,0.2944,0.2608,0.2676,0.3806,0.3053,0.3479,0.4638,0.4488,0.4773
-0.0335,0.2098,0.2291,0.2163,0.3237,0.3203,0.354,0.4658,0.4417,0.4188
0.0535,0.1584,0.3051,0.2538,0.4035,0.3284,0.3305,0.456,0.471,0.4575
0.1589,0.2902,0.0357,0.2869,0.3257,0.4198,0.3318,0.4158,0.4931,0.4982
0.1466,0.2503,0.1572,0.4877,0.3791,0.3884,0.4537,0.4133,0.5094,0.5379
0.1523,-0.0101,0.2148,0.2887,0.3201,0.3056,0.3101,0.427,0.4654,0.3373
0.0618,0.0268,0.1704,0.3277,0.3627,0.3525,0.3032,0.2845,0.3504,0.4526
0.1423,0.3782,0.2468,0.3837,0.2462,0.3293,0.3119,0.3211,0.4258,0.4547
-0.0268,0.3968,0.2062,0.3179,0.414,0.3036,0.4355,0.4244,0.3511,0.3938
0.0756,0.2801,0.1731,0.3024,0.3612,0.5051,0.3345,0.439,0.4357,0.5118
0.201,0.3279,0.0389,0.2735,0.3125,0.3076,0.4349,0.4173,0.4201,0.5251
0.1633,0.3103,0.1864,0.3454,0.4159,0.3494,0.3851,0.4679,0.4232,0.4872
0.0815,0.2985,0.0409,0.3426,0.3572,0.3414,0.3799,0.4133,0.4025,0.4657
0.0466,0.1691,0.2025,0.2899,0.0631,0.2673,0.245,0.3371,0.3908,0.422
0.2462,0.3144,0.1727,0.3795,0.4504,0.4145,0.4254,0.5443,0.4959,0.5804
0.0645,0.2487,0.3644,0.3831,0.4202,0.3629,0.408,0.481,0.5037,0.5179
0.2053,0.1851,0.2618,0.1822,0.2378,0.174,0.2325,0.3885,0.3781,0.3864
0.0157,0.1342,0.289,0.3303,0.4033,0.4817,0.3084,0.4973,0.5037,0.4704
0.0258,0.1881,0.3833,0.3401,0.5386,0.4462,0.3396,0.6142,0.602,0.5838
0.1861,0.1824,0.2743,0.4126,0.4158,0.2734,0.416,0.4055,0.4807,0.5168
0.0263,0.268,0.0871,0.2864,0.262,0.3124,0.3875,0.4578,0.4124,0.4533
0.0705,0.1891,0.1636,0.1762,0.2081,0.3413,0.3192,0.4707,0.4741,0.4961
0.2125,0.2059,0.1781,0.3735,0.3511,0.3189,0.4489,0.4618,0.4737,0.5299
0.2699,0.3298,0.2515,0.2406,0.2879,0.3739,0.297,0.4034,0.4639,0.4733
0.1395,0.314,0.2646,0.2632,0.241,0.3703,0.2977,0.3933,0.4834,0.4703
0.2041,0.2013,0.3199,0.3738,0.3755,0.2058,0.4584,0.4251,0.458,0.4857
-0.0572,0.1714,0.271,0.3283,0.3648,0.3373,0.3192,0.3852,0.4137,0.4589
0.1477,0.257,0.1158,0.2143,0.3595,0.3887,0.2708,0.3558,0.4239,0.4913
-0.081,0.2308,0.2008,0.3427,0.2825,0.4426,0.3347,0.4357,0.47,0.4815
0.0797,0.1962,-0.0596,0.28,0.1824,0.2964,0.2878,0.3295,0.3353,0.3899
0.1564,0.3604,0.1396,0.3982,0.434,0.219,0.4048,0.4588,0.4223,0.5111
0.1501,0.288,0.375,0.3122,0.4353,0.469,0.3665,0.5538,0.5703,0.5856
0.1711,0.1786,0.1627,0.1301,0.3769,0.3266,0.3367,0.4829,0.4549,0.4562
0.07,0.3599,0.2166,0.3856,0.3383,0.3952,0.4655,0.4424,0.4445,0.4962
0.0964,0.1569,0.1551,0.2792,0.3317,0.3408,0.2994,0.4286,0.3791,0.3741
0.0609,0.2636,0.2965,0.366,0.3995,0.4102,0.3725,0.3496,0.4367,0.5212
0.0755,0.2017,0.2366,0.4524,0.3886,0.2887,0.2838,0.3998,0.4439,0.4856
0.1599,0.2034,0.3036,0.1773,0.3905,0.4691,0.2354,0.5529,0.5046,0.473
-0.0118,0.216,0.2267,0.2913,0.33,0.1844,0.2978,0.4332,0.4942,0.4611
0.1744,0.1945,0.1839,0.2696,0.3928,0.3706,0.3577,0.5006,0.4437,0.522
0.2438,0.3063,0.2557,0.2409,0.3166,0.3223,0.4108,0.4199,0.4548,0.4976
0.1001,0.2728,0.2378,0.3322,0.2517,0.3446,0.3369,0.3694,0.4544,0.4534
0.121,0.2089,0.2257,0.2578,0.3352,0.1776,0.1885,0.3758,0.3789,0.363
0.124,0.2424,0.1889,0.2573,0.3891,0.3013,0.3265,0.4144,0.4292,0.443
0.1491,0.3458,0.1919,0.4258,0.2079,0.3764,0.3914,0.3186,0.3802,0.5022
0.0476,0.2764,0.1995,0.3056,0.327,0.3506,0.378,0.3894,0.3964,0.436
0.0623,0.3781,0.1692,0.3458,0.3424,0.3088,0.4678,0.4521,0.4665,0.5365
0.2742,0.262,0.0812,0.337,0.2024,0.4492,0.3848,0.3252,0.4061,0.5061
0.1701,0.2351,0.3675,0.208,0.2665,0.3842,0.2928,0.4196,0.4293,0.3706
0.0765,0.124,0.1127,0.3778,0.3213,0.3314,0.4245,0.531,0.4706,0.4792
0.0841,0.0062,0.1864,0.2985,0.324,0.4132,0.3498,0.3818,0.331,0.4581
0.2326,0.2133,0.2163,0.322,0.1799,0.3087,0.3989,0.4181,0.421,0.4653
0.1578,0.3022,0.2647,0.2414,0.3101,0.2814,0.2802,0.4772,0.5027,0.4937
0.0996,0.3257,0.231,0.2363,0.3014,0.3727,0.4116,0.399,0.382,0.449
0.1116,0.0978,0.2681,0.2962,0.2131,0.3465,0.4084,0.3964,0.4221,0.3874
-0.0304,0.1628,0.3964,0.3377,0.4436,0.4243,0.3786,0.4614,0.4795,0.4432
0.1548,0.2317,0.0798,0.2508,0.2926,0.2015,0.3951,0.4289,0.445,0.4675
-0.0225,0.3387,0.2679,0.2694,0.2482,0.1341,0.3923,0.3601,0.3923,0.4492
0.0639,0.023,0.3279,0.3212,0.3664,0.397,0.3901,0.4174,0.501,0.5591
0.2067,0.2435,0.2839,0.3677,0.3802,0.2263,0.309,0.4309,0.4052,0.3939
0.2994,0.1801,0.1942,0.2243,0.357,0.3806,0.3676,0.4824,0.4811,0.4701
0.0991,0.3922,0.105,0.2953,0.2358,0.3666,0.3853,0.4455,0.4379,0.5164
0.0631,0.301,0.1801,0.3598,0.3572,0.3192,0.4235,0.4805,0.3774,0.4698
0.104,0.2192,0.2536,0.361,0.3122,0.231,0.4381,0.3809,0.4166,0.547
0.0781,0.2461,0.1474,0.2454,0.1681,0.2776,0.2675,0.3778,0.369,0.4555
-0.0261,0.293,0.135,0.2938,0.2455,0.2009,0.3115,0.4268,0.4098,0.4386
0.1133,0.2413,0.2022,0.3321,0.3049,0.3664,0.409,0.4716,0.4756,0.5276
0.0283,0.3515,0.3449,0.2341,0.4006,0.3788,0.3014,0.4586,0.4742,0.394
0.1361,0.3254,0.0921,0.3448,0.2634,0.3427,0.4323,0.4832,0.4801,0.4877
-0.0532,0.1611,0.2281,0.2986,0.3952,0.4833,0.4223,0.4599,0.4451,0.4462
0.1248,0.309,0.1298,0.3227,0.2612,0.3331,0.37,0.3455,0.3365,0.4464
0.1137,0.1192,0.3593,0.3609,0.3554,0.4024,0.3964,0.4607,0.4903,0.4508
-0.0101,0.0394,0.1902,0.3234,0.2705,0.3007,0.284,0.3974,0.3813,0.4284
0.1153,0.1715,0.0931,0.299,0.2387,0.2765,0.3652,0.4099,0.4935,0.459
0.0682,0.4122,0.2609,0.3111,0.3177,0.4018,0.4526,0.4158,0.4609,0.5752
0.1528,0.2176,0.3718,0.1951,0.3762,0.2639,0.3206,0.4649,0.4776,0.3944
0.2331,0.2461,0.3604,0.2953,0.4294,0.4075,0.3604,0.5669,0.5285,0.5225
0.1255,0.1658,0.1002,0.1918,0.1163,0.3451,0.2916,0.4935,0.4423,0.4511
0.1683,0.0824,0.2812,0.1768,0.3833,0.4284,0.2559,0.4378,0.43,0.4289
0.1283,0.1494,0.3039,0.2805,0.1819,0.2885,0.4245,0.442,0.4417,0.4852
0.1017,0.1123,0.1595,0.3121,0.1331,0.3812,0.2947,0.4204,0.504,0.4969
0.2672,0.2567,0.2431,0.3043,0.4952,0.2488,0.4818,0.422,0.4569,0.555
-0.012,0.2453,0.3343,0.2597,0.3252,0.3112,0.3855,0.4135,0.444,0.4489
0.0781,0.3215,0.2563,0.2168,0.3438,0.2581,0.2901,0.4115,0.359,0.387
0.0851,0.2625,0.2313,0.2667,0.3651,0.33,0.3549,0.4088,0.3571,0.4465
-0.0268,0.2383,0.2367,0.1093,0.18,0.438,0.1759,0.4142,0.35,0.3166
0.165,0.3933,0.2019,0.3077,0.2668,0.1929,0.4214,0.3312,0.4044,0.5191
-0.036,0.0193,0.1552,0.2561,0.215,0.2997,0.2345,0.3447,0.4395,0.3815
0.2422,0.1492,0.1702,0.2893,0.2861,0.5386,0.4141,0.5122,0.603,0.5636
0.0521,0.2078,0.4267,0.3804,0.3625,0.3814,0.4969,0.4586,0.4429,0.5372
0.0308,0.252,0.2871,0.292,0.3357,0.3961,0.403,0.5371,0.4909,0.466
0.0916,0.3925,0.3676,0.4162,0.4005,0.3427,0.4477,0.4905,0.4682,0.5281
0.0446,0.2585,0.1112,0.3204,0.4006,0.4247,0.4196,0.4223,0.481,0.4567
0.1126,0.2953,0.1054,0.3045,0.37,0.4358,0.4305,0.4637,0.4727,0.4678
0.0179,0.1605,0.3074,0.3142,0.3869,0.4401,0.4122,0.4708,0.4816,0.5338
0.1329,0.3134,0.3028,0.2301,0.4679,0.2846,0.4198,0.3233,0.3787,0.4602
0.1881,0.3179,0.2576,0.2581,0.1904,0.3928,0.364,0.3707,0.416,0.4597
0.1964,0.2019,0.2524,0.28,0.3713,0.3268,0.3036,0.3965,0.3433,0.4104
0.0976,0.1097,0.2821,0.3701,0.3208,0.2275,0.4333,0.4167,0.4609,0.4836
0.1495,0.1448,0.3738,0.336,0.3836,0.3658,0.4336,0.3964,0.4779,0.4739
0.1539,0.1025,0.2113,0.2536,0.262,0.2288,0.4263,0.4699,0.4562,0.4987
0.1486,0.2702,0.2318,0.3045,0.3448,0.4974,0.4308,0.4135,0.4929,0.4606
0.2121,0.3702,0.3401,0.3737,0.4511,0.4637,0.3495,0.5263,0.5546,0.547
0.0358,0.2848,0.2385,0.2697,0.3684,0.342,0.3141,0.4576,0.4034,0.4552
0.1743,0.2034,0.326,0.1779,0.3306,0.3641,0.3213,0.4244,0.4695,0.4024
0.2484,0.3516,0.203,0.2725,0.3368,0.2593,0.4135,0.4352,0.4897,0.4814
0.2008,0.1388,0.167,0.4111,0.2972,0.3691,0.1126,0.4092,0.3496,0.4189
-0.1067,0.1059,0.2895,0.2938,0.3195,0.4694,0.3462,0.5473,0.5072,0.4985
0.2211,0.1318,0.1447,0.2201,0.3193,0.3921,0.3949,0.5056,0.5051,0.4677
-0.1051,0.271,0.2359,0.3683,0.3437,0.3305,0.4288,0.3766,0.3778,0.4533
0.0575,0.2594,0.2604,0.0971,0.1965,0.3166,0.1847,0.3962,0.3655,0.3024
0.1248,0.2816,0.14,0.3316,0.2374,0.2022,0.3029,0.4458,0.4944,0.538
0.0873,0.1838,0.234,0.2341,0.2792,0.2521,0.299,0.4296,0.4063,0.4908
0.2551,0.2952,0.2012,0.2404,0.391,0.4561,0.2159,0.4834,0.442,0.4495
0.0462,0.1574,0.3444,0.2348,0.4937,0.3538,0.3464,0.5354,0.5166,0.502
0.0247,0.3567,0.3488,0.3279,0.3035,0.3512,0.3673,0.4903,0.5092,0.544
-0.0381,0.2403,0.3757,0.2225,0.3687,0.295,0.2997,0.4233,0.4716,0.4383
0.0564,0.0252,0.3174,0.3828,0.4311,0.3908,0.34,0.5124,0.5012,0.5115
0.1647,0.2255,0.2333,0.2193,0.2524,0.2635,0.3443,0.4429,0.4356,0.4249
0.0248,0.3389,0.3411,0.2805,0.3417,0.4648,0.3642,0.5492,0.4851,0.5206
0.1819,0.2017,0.3193,0.2256,0.3012,0.221,0.2563,0.4497,0.44,0.4092
0.0871,0.2856,0.3115,0.1927,0.2579,0.3636,0.2964,0.3732,0.3717,0.4118
0.0565,0.3528,0.2629,0.2771,0.4723,0.3699,0.3846,0.5266,0.4762,0.4889
0.0992,0.3313,0.2369,0.3034,0.3182,0.4482,0.3344,0.4296,0.3881,0.4855
0.0392,0.2408,0.2984,0.2461,0.5371,0.4641,0.357,0.5265,0.5382,0.4293
0.1867,0.3648,0.2608,0.3467,0.3724,0.2061,0.3598,0.4411,0.4494,0.5007
0.0775,0.2047,0.2398,0.4789,0.2684,0.3055,0.1428,0.4417,0.4421,0.5337
0.0966,0.2967,0.3761,0.3565,0.45,0.5392,0.3609,0.4014,0.4891,0.4657
0.0795,0.1965,0.249,0.2879,0.3847,0.2976,0.2768,0.3789,0.4008,0.3837
0.1783,0.2777,0.41,0.2489,0.2841,0.4046,0.3299,0.5589,0.5118,0.4913
0.1858,0.3715,0.2588,0.3055,0.3783,0.4808,0.4577,0.5006,0.5341,0.5838
0.2048,-0.0587,0.2422,0.3224,0.4248,0.3877,0.333,0.4655,0.4715,0.4983
0.2161,0.3055,0.4533,0.2632,0.4039,0.3396,0.4117,0.4576,0.4777,0.4956
-0.0097,0.1154,0.1908,0.2534,0.3016,0.2236,0.4124,0.4087,0.4424,0.4156
0.1338,0.2722,0.3751,0.2483,0.4521,0.394,0.3746,0.4725,0.4696,0.4991
0.2059,0.1664,0.2309,0.3736,0.2767,0.315,0.35,0.4158,0.4924,0.4629
0.1056,0.0618,0.15,0.2771,0.4044,0.5023,0.3221,0.3901,0.4027,0.4103
0.0714,0.1677,0.1604,0.083,0.2705,0.3078,0.1821,0.3307,0.3436,0.2271
0.2117,0.2681,0.1969,0.1683,0.2624,0.3617,0.2846,0.3886,0.452,0.3543
0.119,0.2366,0.2159,0.3622,0.3457,0.3935,0.3502,0.4346,0.3935,0.3894
0.2085,0.2459,0.0402,0.4175,0.3568,0.213,0.3499,0.3495,0.4664,0.5284
0.114,0.1872,0.2205,0.2973,0.3903,0.3818,0.4072,0.3841,0.4049,0.4646
0.1094,0.2052,0.1764,0.2262,0.2399,0.3672,0.2826,0.2984,0.3239,0.3951
0.178,0.2261,0.2887,0.2966,0.3971,0.435,0.401,0.4986,0.531,0.5186
0.086,0.2777,0.0192,0.287,0.231,0.2902,0.377,0.3956,0.46,0.5411
0.1053,0.1774,0.3522,0.1783,0.246,0.3273,0.3057,0.4922,0.3826,0.3575
0.0492,0.309,0.2876,0.4089,0.4654,0.3422,0.4591,0.4699,0.4988,0.4954
0.0863,0.2196,0.3519,0.2567,0.3227,0.1882,0.3412,0.4324,0.3999,0.4136
0.0468,0.2628,0.2612,0.272,0.3715,0.3056,0.4392,0.535,0.5221,0.5697
-0.0488,0.0952,0.2609,0.3368,0.3295,0.262,0.4374,0.4967,0.4223,0.4002
0.1293,0.1754,0.3034,0.2491,0.3061,0.2735,0.4012,0.4444,0.453,0.451
0.1172,0.195,0.2755,0.3335,0.4368,0.3766,0.3471,0.5192,0.4669,0.524
-0.0018,0.2169,0.282,0.2155,0.3641,0.4199,0.3389,0.4377,0.432,0.4643
0.0333,0.2954,0.2465,0.2953,0.4545,0.4514,0.388,0.4076,0.4361,0.4262
0.0926,0.2537,0.1598,0.2074,0.3213,0.3375,0.3388,0.4237,0.3984,0.4861
0.0222,0.1281,0.3818,0.2747,0.3064,0.3089,0.2821,0.3293,0.3089,0.4042
0.0819,0.2205,0.1036,0.3092,0.4478,0.4525,0.327,0.4596,0.5354,0.4722
0.1113,0.3716,0.3175,0.3555,0.3505,0.375,0.4033,0.5061,0.4473,0.5492
0.1521,0.2208,0.1329,0.1638,0.3547,0.2785,0.422,0.4207,0.4572,0.4595
0.0685,0.3028,0.1371,0.4222,0.3511,0.3646,0.3873,0.457,0.4999,0.5473
0.0654,0.3143,0.2275,0.353,0.3985,0.4151,0.3917,0.4922,0.4424,0.5516
0.1102,0.2688,0.2654,0.3113,0.376,0.3105,0.3849,0.5089,0.5279,0.521
0.1388,0.1686,0.3278,0.1814,0.4063,0.3995,0.2709,0.4468,0.4125,0.5001
0.156,0.0489,0.2724,0.2023,0.3275,0.2601,0.2676,0.3482,0.365,0.3341
0.1577,0.3773,0.184,0.3113,0.393,0.354,0.3792,0.3441,0.4026,0.5352
-0.2077,0.3435,0.2709,0.2873,0.2462,0.3787,0.3486,0.3985,0.449,0.4649
0.1002,0.3517,0.1481,0.3047,0.3262,0.333,0.3957,0.4751,0.5409,0.4732
0.0585,0.0983,0.2517,0.2812,0.382,0.3648,0.3579,0.4101,0.4024,0.4768
0.0757,0.2929,0.2659,0.4274,0.3442,0.371,0.3559,0.4131,0.4417,0.5698
0.0169,0.3726,0.3361,0.3258,0.4428,0.3795,0.3717,0.5115,0.5585,0.5573
0.3231,0.296,0.3398,0.2879,0.348,0.4344,0.361,0.4992,0.498,0.5559
0.1392,0.1557,0.3138,0.224,0.3176,0.278,0.2227,0.3934,0.4053,0.3819
0.1612,0.3656,0.3076,0.2762,0.3247,0.4484,0.4074,0.4581,0.4338,0.471
0.0278,0.3489,0.2322,0.3459,0.3369,0.3524,0.3813,0.5509,0.5148,0.5464
0.1686,0.2948,0.2411,0.2194,0.3706,0.3897,0.3503,0.4307,0.4022,0.4137
0.0121,0.3619,0.2034,0.4478,0.3166,0.4073,0.4901,0.4377,0.5174,0.5732
0.1816,0.1531,0.0881,0.3243,0.2323,0.2604,0.3428,0.412,0.4198,0.4654
0.1402,0.4076,0.2168,0.2511,0.285,0.2999,0.3565,0.4793,0.4495,0.4795
-0.0367,0.1309,0.2442,0.1485,0.2782,0.369,0.254,0.4213,0.3804,0.3831
-0.0538,0.2595,0.3461,0.3137,0.367,0.3718,0.3394,0.4814,0.4538,0.4008
0.0179,0.1441,-0.0354,0.2128,0.2391,0.2652,0.2559,0.2963,0.3863,0.3535
0.0438,0.1651,0.1866,0.3845,0.3525,0.3023,0.4842,0.3618,0.4034,0.4729
0.0673,0.2331,0.2866,0.1599,0.397,0.2658,0.2164,0.4289,0.4155,0.3825
0.2563,0.0317,0.2063,0.3089,0.141,0.2988,0.4881,0.4822,0.4943,0.4831
0.1351,0.2425,0.2632,0.1455,0.3688,0.2742,0.262,0.3956,0.4129,0.3998
0.1975,0.1149,0.1962,0.2526,0.3589,0.2398,0.3058,0.4286,0.4505,0.506
-0.0282,0.292,0.2802,0.2832,0.3747,0.4394,0.4273,0.4737,0.5211,0.5068
0.2512,0.344,0.3351,0.3046,0.5332,0.4268,0.4844,0.4788,0.5844,0.5558
0.224,0.1795,0.2028,0.2262,0.228,0.1508,0.2537,0.3483,0.4123,0.378
0.1739,0.1806,0.1236,0.1793,0.351,0.1998,0.2542,0.35,0.3104,0.3273
0.1561,0.2708,0.2576,0.2459,0.2497,0.2815,0.3674,0.4024,0.3928,0.4466
-0.0488,0.2224,0.2132,0.2445,0.3995,0.4459,0.3006,0.4199,0.4184,0.4137
0.1469,0.3006,0.2804,0.3411,0.3164,0.349,0.4518,0.4722,0.5014,0.5564
0.093,0.2159,0.3162,0.2537,0.2297,0.4038,0.3413,0.4066,0.3827,0.3528
0.1305,0.1913,0.2949,0.294,0.3595,0.3608,0.3522,0.4792,0.5206,0.5024
0.0518,0.1977,0.1846,0.2413,0.3115,0.3953,0.3526,0.3727,0.3573,0.427
0.1795,0.1815,0.2492,0.3261,0.2967,0.2579,0.2298,0.4982,0.4406,0.3771
0.1464,0.1858,0.3049,0.2534,0.3261,0.4072,0.4339,0.4569,0.4467,0.501
0.1617,0.3593,0.3017,0.3259,0.2911,0.3145,0.4306,0.4126,0.4735,0.5231
0.1431,0.2596,0.3181,0.3608,0.3205,0.3845,0.5134,0.4286,0.4045,0.5473
0.0737,0.2485,0.2951,0.3089,0.3556,0.4211,0.3772,0.4175,0.4094,0.4911
0.0689,0.3345,0.1144,0.348,0.2862,0.2801,0.3364,0.4135,0.4374,0.475
0.1605,0.1642,0.2943,0.2613,0.4642,0.3125,0.4139,0.431,0.4379,0.4769
0.062,0.126,0.3672,0.1369,0.287,0.3396,0.2174,0.3955,0.352,0.3135
-0.0018,0.1176,0.2024,0.2939,0.3053,0.3975,0.3594,0.3612,0.3445,0.4332
0.1373,0.1259,0.1811,0.3338,0.27,0.3171,0.2845,0.3405,0.3636,0.3763
0.0566,0.1303,0.3037,0.259,0.351,0.4436,0.3274,0.5197,0.4782,0.5039
0.1959,0.1564,0.2409,0.2016,0.3795,0.2687,0.3435,0.364,0.4819,0.4599
0.0062,0.3914,0.3584,0.138,0.2772,0.4057,0.2731,0.4048,0.4121,0.4416
0.0437,0.1975,0.3162,0.3418,0.2956,0.4002,0.3441,0.4562,0.4517,0.4432
0.1304,0.3714,0.1948,0.32,0.4054,0.4085,0.4007,0.4418,0.4338,0.479
0.1363,0.1906,0.3251,0.288,0.3909,0.4287,0.4725,0.5562,0.5194,0.5477
-0.0379,0.29,0.2964,0.2372,0.3748,0.3546,0.3068,0.3459,0.3322,0.3045
0.098,0.2046,0.2214,0.3892,0.3135,0.2996,0.2873,0.444,0.4996,0.4566
0.1144,0.2211,0.1385,0.3519,0.3958,0.4808,0.3733,0.4643,0.5111,0.4911
0.2068,0.2606,0.3561,0.2764,0.2808,0.3934,0.4149,0.4147,0.401,0.4969
0.1579,0.3017,0.1198,0.2226,0.3498,0.3488,0.3221,0.4823,0.526,0.4429
-0.0364,0.2469,0.2295,0.3526,0.2766,0.3697,0.3781,0.4547,0.5085,0.5925
0.1546,0.2396,0.4746,0.2415,0.4154,0.3955,0.3866,0.576,0.4434,0.4745
0.055,0.2983,0.275,0.2521,0.3972,0.2939,0.3214,0.5059,0.4777,0.5029
0.1271,0.3014,0.3323,0.2633,0.296,0.3702,0.4337,0.498,0.5341,0.5402
0.1311,0.1909,0.2064,0.3939,0.3565,0.2964,0.3557,0.4828,0.4541,0.4924
0.1206,0.1468,0.2223,0.2374,0.1977,0.2131,0.2984,0.4807,0.4275,0.4085
0.287,0.0835,0.1769,0.3911,0.2944,0.3668,0.3705,0.3795,0.4526,0.4843
-0.0189,0.2535,0.2233,0.3628,0.2306,0.3431,0.2945,0.4581,0.5291,0.5231
0.1609,0.3179,0.2092,0.3167,0.2431,0.1716,0.3281,0.3668,0.4737,0.4851
0.0125,0.2768,0.3738,0.2938,0.502,0.5028,0.3576,0.5116,0.507,0.4776
0.0777,0.1172,0.1977,0.3003,0.2943,0.2375,0.3707,0.433,0.4113,0.5135
0.0968,0.297,0.1951,0.2324,0.3872,0.1551,0.2902,0.344,0.3209,0.4233
0.1989,0.163,0.0875,0.1772,0.3133,0.3125,0.2318,0.3949,0.3781,0.3126
0.0439,0.1777,0.2672,0.3461,0.1838,0.3604,0.3578,0.3705,0.4062,0.4673
0.0761,0.3419,0.2691,0.3536,0.4535,0.3818,0.4122,0.5173,0.4188,0.5695
0.2264,0.4145,0.3037,0.3422,0.3351,0.3237,0.4056,0.439,0.4734,0.4869
0.0959,0.1692,0.1533,0.147,0.2618,0.3648,0.3169,0.4285,0.4001,0.3646
0.1357,0.3035,0.3114,0.3057,0.3132,0.4192,0.4006,0.4985,0.5494,0.4558
0.0122,0.2429,0.1807,0.2744,0.2533,0.2066,0.3802,0.3098,0.4079,0.3668
0.0657,0.2139,0.2029,0.188,0.3853,0.2836,0.2629,0.508,0.4925,0.4313
0.1654,0.2646,0.1555,0.3388,0.2211,0.3238,0.3662,0.4128,0.4161,0.4262
0.0655,0.2464,0.3107,0.3408,0.4797,0.4465,0.3763,0.5367,0.5226,0.5229
0.0029,0.3,0.2989,0.3347,0.3796,0.2622,0.3677,0.4348,0.4163,0.4859
0.0357,0.159,0.057,0.2356,0.2407,0.2711,0.3128,0.3337,0.3769,0.416
-0.0407,0.1853,0.1287,0.357,0.4093,0.2629,0.3698,0.3523,0.3512,0.4744
0.1307,0.2958,0.3957,0.2555,0.3956,0.4671,0.3279,0.4799,0.4042,0.4316
0.0981,0.3205,0.2658,0.1971,0.3742,0.2663,0.2547,0.4701,0.4189,0.3731
0.049,0.305,0.2073,0.3584,0.3624,0.3634,0.4406,0.5642,0.5595,0.5434
-0.0539,0.3081,0.3525,0.3523,0.2598,0.3059,0.4582,0.4496,0.4197,0.4806
0.0223,0.4655,0.2637,0.3408,0.4431,0.4867,0.4147,0.5613,0.5782,0.5666
0.1186,0.0881,0.1057,0.4086,0.1651,0.205,0.4229,0.3988,0.417,0.5544
0.0232,0.2631,0.1703,0.1935,0.411,0.3325,0.3067,0.4549,0.4798,0.4106
0.087,0.3567,0.254,0.3211,0.5345,0.3855,0.4103,0.4784,0.4782,0.4822
0.0015,0.0882,0.2442,0.1962,0.3005,0.3284,0.3231,0.4319,0.3822,0.4052
0.1883,0.1684,0.3365,0.287,0.3934,0.4018,0.3231,0.3853,0.3929,0.5074
-0.0088,0.3611,0.187,0.2621,0.2659,0.4488,0.3918,0.3933,0.414,0.4786
-0.0036,0.3851,0.1965,0.3499,0.1767,0.2925,0.3557,0.317,0.3716,0.4366
0.1042,0.1492,0.2267,0.1886,0.2521,0.3664,0.3573,0.3965,0.3875,0.3877
0.0945,0.1566,0.1693,0.1807,0.2731,0.296,0.3541,0.4228,0.41,0.4374
0.0759,0.2479,0.2384,0.2362,0.2643,0.2501,0.3656,0.3247,0.3775,0.4977
0.1839,0.139,0.3478,0.1485,0.3005,0.31,0.3001,0.5125,0.5228,0.4438
0.1081,0.1574,0.2732,0.1874,0.3533,0.2489,0.3115,0.4118,0.3762,0.4242
0.0727,0.1932,0.1719,0.206,0.3311,0.3422,0.2459,0.4524,0.4397,0.4363
0.0439,0.1459,0.2247,0.2337,0.1658,0.2525,0.3097,0.3654,0.3915,0.3904
0.0689,0.366,0.3439,0.3894,0.316,0.3653,0.463,0.4427,0.4674,0.6225
0.0269,0.1987,0.0817,0.2645,0.3268,0.2037,0.3985,0.3778,0.4492,0.4445
0.1351,0.3637,0.2868,0.2354,0.3308,0.3284,0.3044,0.4246,0.4231,0.4865
0.0555,0.3064,0.1868,0.3732,0.3409,0.3196,0.3216,0.4206,0.4334,0.5057
0.0707,0.252,0.3339,0.3947,0.3349,0.3293,0.3473,0.4894,0.4897,0.4908
0.0827,0.2094,0.1342,0.1934,0.4002,0.4371,0.2737,0.473,0.4925,0.4441
0.0338,0.3557,0.2326,0.33,0.3652,0.4092,0.487,0.4763,0.4848,0.5428
-0.0207,0.159,0.2769,0.2869,0.4815,0.2717,0.3768,0.4369,0.3677,0.4321
0.0238,0.2607,0.3534,0.2496,0.4234,0.42,0.3837,0.4053,0.4358,0.5345
0.1998,0.1166,0.2258,0.2799,0.3476,0.377,0.333,0.4019,0.4772,0.5047
0.1157,0.1286,0.1295,0.134,0.2942,0.2783,0.2309,0.364,0.3538,0.2927
0.2202,0.2173,0.3393,0.3834,0.341,0.4102,0.4177,0.5156,0.476,0.5095
0.1815,0.1402,0.1482,0.1313,0.3608,0.2999,0.2799,0.4643,0.4217,0.3962
0.0152,0.2954,0.0627,0.2669,0.3064,0.287,0.3301,0.358,0.3052,0.4311
0.066,0.1633,0.3035,0.3166,0.3143,0.2845,0.4042,0.4506,0.496,0.5184
-0.1122,0.1876,0.233,0.0949,0.1979,0.3362,0.2315,0.3799,0.3421,0.2521
0.0855,0.4482,0.2556,0.4044,0.3409,0.3898,0.3527,0.4231,0.4946,0.491
0.1505,0.2356,0.2495,0.2956,0.4543,0.4077,0.3431,0.4703,0.4512,0.4588
0.0598,0.2207,0.2201,0.2877,0.3524,0.3662,0.2933,0.4505,0.457,0.44
0.1194,0.1032,0.2221,0.4457,0.3868,0.2817,0.3593,0.3382,0.3989,0.3928
-0.0546,-0.0449,0.4059,0.4475,0.3147,0.4257,0.2885,0.3819,0.4142,0.429
-0.0765,0.3666,0.3269,0.3525,0.299,0.31,0.2661,0.3814,0.3619,0.4054
0.1148,0.3133,0.2402,0.2298,0.3297,0.1357,0.3068,0.3755,0.4172,0.4492
0.0471,0.2101,0.2234,0.3891,0.4129,0.5007,0.4153,0.4654,0.5452,0.6201
0.1293,0.2716,0.3816,0.345,0.4163,0.2469,0.4746,0.4602,0.407,0.521
0.0946,0.1399,0.1703,0.066,0.2864,0.247,0.2302,0.4173,0.2936,0.3213
0.0256,0.2767,0.3637,0.3405,0.4971,0.4963,0.4966,0.4639,0.4498,0.5209
0.0307,0.1387,0.3344,0.2708,0.3514,0.3553,0.3729,0.4783,0.4672,0.4694
0.1449,0.1193,0.1595,0.3091,0.3252,0.3832,0.3934,0.3547,0.4283,0.5431
0.0759,0.0673,0.2397,0.3585,0.2594,0.2689,0.3791,0.4288,0.4079,0.5103
0.126,0.1498,0.1546,0.2127,0.2925,0.2022,0.2871,0.3945,0.4112,0.4102
0.0673,0.2015,0.1144,0.3374,0.2243,0.3162,0.4172,0.2815,0.3995,0.4681
0.1799,0.1259,0.2994,0.434,0.3408,0.4877,0.3962,0.51,0.6205,0.5313
0.1413,0.3083,0.2894,0.273,0.2731,0.2624,0.1803,0.3964,0.3992,0.3129
0.0792,0.1519,0.3424,0.3738,0.4724,0.3691,0.4449,0.3729,0.4557,0.5253
0.1035,0.3134,0.1535,0.3812,0.3559,0.4028,0.5195,0.4051,0.4275,0.5739
0.1196,0.1843,0.1775,0.1829,0.3301,0.2346,0.3409,0.35,0.474,0.3767
-0.0971,0.2065,0.2015,0.325,0.393,0.3481,0.4091,0.4666,0.4259,0.4777
-0.16,0.2211,0.2724,0.2203,0.3572,0.2327,0.4069,0.4448,0.4375,0.4882
0.1571,0.3737,0.1443,0.4706,0.4318,0.3344,0.1991,0.5005,0.508,0.5258
0.0707,0.2058,0.274,0.1915,0.2871,0.3476,0.3367,0.5116,0.4356,0.4286
0.0161,0.238,0.2857,0.2767,0.274,0.322,0.3176,0.4628,0.4432,0.4537
0.0686,0.3163,0.2776,0.3901,0.4014,0.3231,0.3265,0.4615,0.4801,0.4174
0.2076,0.321,0.2318,0.3333,0.3424,0.4092,0.3845,0.3966,0.4428,0.4871
0.009,0.2779,0.3002,0.2874,0.3481,0.4372,0.4259,0.4791,0.4277,0.4562
0.1215,0.1634,0.1609,0.3116,0.2933,0.1391,0.334,0.2948,0.3598,0.4134
0.2237,0.2289,0.2139,0.2633,0.4459,0.2265,0.3406,0.4536,0.4005,0.512
0.0094,0.2855,0.1465,0.2685,0.3633,0.4101,0.4125,0.4054,0.482,0.5067
0.1658,0.029,0.2629,0.2401,0.3429,0.2268,0.3164,0.39,0.3829,0.3834
0.1012,0.2307,0.1764,0.3217,0.1885,0.3537,0.3356,0.4784,0.4862,0.5241
0.1734,0.4375,0.1803,0.4329,0.3277,0.3665,0.4464,0.5164,0.5346,0.5843
0.1236,0.392,0.1749,0.3785,0.1866,0.2197,0.3441,0.3883,0.4234,0.5585
0.1836,0.3782,0.3079,0.2695,0.2571,0.2121,0.3619,0.4873,0.4585,0.4596
0.1835,0.2169,0.2212,0.2315,0.3785,0.3327,0.3728,0.438,0.4259,0.4858
0.0365,0.3839,0.3123,0.3736,0.3009,0.3758,0.3333,0.4559,0.463,0.4423
0.1739,0.305,0.1389,0.2198,0.193,0.4204,0.219,0.3919,0.4013,0.4423
0.0821,0.3356,0.3813,0.3466,0.3095,0.4077,0.461,0.4352,0.4494,0.6352
0.2237,0.4039,0.1766,0.3418,0.3575,0.4381,0.4205,0.4115,0.5212,0.545
0.1173,0.1465,0.1285,0.2401,0.3547,0.2508,0.4187,0.4736,0.4502,0.5254
-0.0048,0.2225,0.2291,0.2351,0.3713,0.3358,0.3552,0.5231,0.4703,0.4761
0.0935,0.2881,0.2246,0.3368,0.4128,0.3947,0.371,0.487,0.5248,0.4797
0.2815,0.1741,0.2418,0.1855,0.1753,0.3227,0.28,0.4206,0.3754,0.3492
0.0303,0.3001,0.3191,0.3335,0.4796,0.4472,0.4052,0.5638,0.5228,0.5174
0.1637,0.2595,0.2082,0.3978,0.3432,0.3981,0.4455,0.3615,0.5036,0.5034
-0.0169,0.2966,0.1993,0.3104,0.3441,0.3228,0.3673,0.4292,0.4961,0.5043
0.0134,0.1602,0.2446,0.2738,0.3364,0.4074,0.2264,0.3992,0.3238,0.3434
0.1419,0.2677,0.2337,0.1523,0.2984,0.3354,0.2881,0.4386,0.3802,0.4871
0.0721,0.3066,0.1662,0.2196,0.3654,0.3108,0.3037,0.3922,0.4245,0.4038
0.031,0.0344,0.2384,0.2591,0.1465,0.4294,0.3991,0.4512,0.4326,0.444
0.1453,0.2772,0.4233,0.1488,0.3363,0.3889,0.2901,0.5284,0.5178,0.4163
0.0129,0.1339,0.3437,0.34,0.31,0.3017,0.3568,0.4416,0.5145,0.5674
0.0263,0.2478,0.3175,0.2857,0.405,0.369,0.3515,0.3734,0.3863,0.4355
0.1215,0.3379,0.1249,0.3033,0.2596,0.287,0.3244,0.4069,0.4153,0.4393
0.1465,0.366,0.1856,0.24,0.3798,0.4479,0.3368,0.4508,0.5036,0.4617
0.0726,0.3521,0.2725,0.3164,0.2157,0.2963,0.3012,0.4867,0.4369,0.4662
0.1656,0.1531,0.2608,0.1372,0.3542,0.3899,0.3403,0.3715,0.4003,0.3651
0.1854,0.2423,0.239,0.2463,0.3563,0.3544,0.3611,0.3381,0.3567,0.5027
0.0323,0.1286,0.3154,0.3173,0.1417,0.3,0.4419,0.343,0.3919,0.4771
-0.0235,0.1325,0.2172,0.3312,0.2516,0.3231,0.3724,0.5087,0.4476,0.4835
0.0954,0.3315,0.1771,0.3076,0.3685,0.4274,0.4191,0.5196,0.4659,0.4514
0.3083,0.215,0.1238,0.2807,0.3982,0.2748,0.3554,0.3893,0.4403,0.4828
0.1939,0.1297,0.3414,0.1478,0.3893,0.3787,0.283,0.4472,0.4419,0.4133
0.1666,0.1821,0.3006,0.237,0.4271,0.4001,0.3655,0.5218,0.4878,0.4846
0.0705,0.2927,0.2782,0.224,0.2427,0.2473,0.3811,0.3365,0.3617,0.5194
0.1407,0.2448,0.2364,0.2811,0.3899,0.273,0.3483,0.3698,0.4103,0.4257
0.0529,0.2099,0.1414,0.4494,0.4585,0.4501,0.4089,0.4076,0.4506,0.5207
0.133,0.2679,0.1273,0.2172,0.2605,0.3072,0.3362,0.402,0.3619,0.3978
0.1002,0.1868,0.3932,0.3267,0.3173,0.3798,0.3671,0.4053,0.4585,0.3832
0.0341,0.2321,0.3216,0.1788,0.3013,0.3815,0.3109,0.3988,0.411,0.3363
0.1366,0.2469,0.0401,0.2425,0.3427,0.192,0.3207,0.4528,0.3847,0.4678
0.0582,0.1205,0.1719,0.2176,0.2822,0.4006,0.3025,0.3817,0.472,0.4333
0.0667,0.4123,0.2365,0.3105,0.3669,0.3932,0.4425,0.4402,0.502,0.5155
0.0488,0.34,0.1201,0.2496,0.3723,0.372,0.4279,0.3854,0.4024,0.4337
-0.0774,0.2225,0.2473,0.2355,0.3325,0.3456,0.3723,0.3799,0.411,0.4199
0.1902,0.1551,0.1845,0.1072,0.2357,0.3368,0.1554,0.3946,0.2769,0.3073
0.0842,0.3542,0.2303,0.2093,0.355,0.345,0.428,0.4817,0.4381,0.5073
0.1296,0.2961,0.4,0.4308,0.3081,0.3495,0.4071,0.4999,0.4793,0.5
0.1454,0.2938,0.2021,0.2538,0.357,0.2708,0.4314,0.3273,0.3231,0.4314
0.0552,0.3313,0.1464,0.1974,0.2642,0.3442,0.3405,0.4487,0.4259,0.3763
0.0764,0.2345,0.2302,0.3017,0.3102,0.3476,0.4336,0.5082,0.4734,0.537
0.0724,0.2867,0.3212,0.3873,0.3753,0.4333,0.1836,0.4645,0.4825,0.583
0.1698,0.2075,0.2798,0.0995,0.3046,0.3248,0.1827,0.4522,0.4338,0.3447
0.0666,0.3172,0.1884,0.1664,0.2911,0.3311,0.2794,0.4266,0.4443,0.4774
0.1326,0.213,0.3308,0.3649,0.3187,0.4342,0.4753,0.4357,0.5493,0.5502
0.104,0.2676,0.3261,0.4537,0.3667,0.326,0.3187,0.3933,0.4505,0.4853
0.2009,0.1815,0.2788,0.2298,0.2661,0.3748,0.2781,0.4529,0.5066,0.4747
-0.0276,0.1301,0.184,0.2254,0.2574,0.2794,0.2813,0.3948,0.4245,0.3873
0.1328,0.1762,0.2155,0.2807,0.0873,0.3481,0.3528,0.3909,0.4479,0.4253
0.2511,0.3968,0.1059,0.3002,0.4042,0.314,0.3652,0.4243,0.4207,0.4973
0.063,0.2866,0.1023,0.2514,0.2286,0.3166,0.2059,0.3482,0.2973,0.3497
0.0817,0.278,0.3329,0.2779,0.3222,0.2484,0.3673,0.4368,0.4219,0.4885
0.1615,0.3876,0.2218,0.4124,0.2705,0.3587,0.4413,0.4399,0.4957,0.5227
-0.0277,0.2646,0.08,0.226,0.2,0.2809,0.2705,0.4462,0.4042,0.4532
0.0916,0.2867,0.1035,0.2979,0.2578,0.2399,0.3174,0.2994,0.3885,0.4593
-0.0069,0.2757,0.2673,0.1105,0.2968,0.3977,0.2403,0.4894,0.4414,0.3634
-8e-04,0.169,0.1659,0.3285,0.2851,0.422,0.299,0.4056,0.4558,0.4219
0.1567,0.1965,0.3147,0.2556,0.4545,0.4266,0.4835,0.5235,0.5583,0.5387
0.1775,0.2601,0.4219,0.34,0.301,0.3926,0.3834,0.4553,0.4555,0.5077
0.02,0.2296,0.2735,0.3165,0.2616,0.2689,0.3545,0.4328,0.4563,0.4801
-0.0322,0.2114,0.2541,0.3256,0.3554,0.3525,0.3166,0.4089,0.3972,0.5037
0.0764,0.3868,0.1221,0.3552,0.3736,0.2957,0.3815,0.4701,0.4185,0.5386
0.129,0.3081,0.2051,0.1928,0.3749,0.4268,0.3007,0.4992,0.4476,0.458
-0.016,0.1817,0.2713,0.285,0.221,0.4096,0.3865,0.4432,0.4781,0.4675
0.1027,0.129,0.3965,0.2614,0.2615,0.2316,0.3569,0.3661,0.3528,0.4086
0.1711,0.2563,0.304,0.3939,0.4799,0.4192,0.5795,0.5043,0.6043,0.5844
0.1382,0.283,0.1791,0.2581,0.4377,0.3464,0.4223,0.4135,0.386,0.4751
0.2076,0.2687,0.2801,0.2634,0.3258,0.3417,0.3415,0.5102,0.4723,0.5021
0.0382,0.1751,0.2334,0.2014,0.3453,0.2769,0.3032,0.3947,0.3777,0.3929
0.1218,0.2278,0.2487,0.3108,0.2785,0.4408,0.3751,0.3873,0.387,0.4478
0.2678,0.3495,0.3627,0.3421,0.4885,0.4705,0.4269,0.5165,0.4985,0.4941
0.0028,0.168,0.2848,0.3491,0.2614,0.3576,0.3933,0.521,0.5104,0.5097
0.0697,0.1596,0.2025,0.2527,0.299,0.3289,0.3469,0.4399,0.4584,0.4788
0.135,0.2323,0.3933,0.2872,0.4012,0.4013,0.373,0.4439,0.5124,0.4609
0.116,0.2757,0.3421,0.3359,0.3369,0.3631,0.3313,0.5003,0.5146,0.5372
0.1293,0.1685,0.2811,0.2981,0.4372,0.3636,0.3381,0.5842,0.4322,0.4714
0.0946,0.3864,0.1626,0.2894,0.3587,0.4839,0.4793,0.5087,0.4807,0.5475
0.1353,0.223,0.3942,0.3247,0.4892,0.4485,0.4353,0.6462,0.6145,0.6296
0.2334,0.0988,0.3381,0.1563,0.2946,0.3584,0.2194,0.3385,0.3608,0.4236
-0.0173,0.3315,0.3245,0.3544,0.3421,0.362,0.4111,0.4052,0.4459,0.448
-0.0249,0.2598,0.2363,0.2597,0.3078,0.2751,0.415,0.2929,0.3783,0.4176
0.1082,0.0885,0.1661,0.3028,0.3536,0.3618,0.4371,0.5079,0.453,0.4632
0.1395,0.3436,0.3098,0.3235,0.3674,0.4956,0.3936,0.4789,0.5595,0.5781
0.2919,0.1529,0.3127,0.1609,0.2826,0.2638,0.2474,0.3803,0.3796,0.4246
-0.1136,0.1674,0.1542,0.3556,0.2412,0.2227,0.3209,0.353,0.3335,0.4134
0.0483,0.2693,0.3168,0.2833,0.431,0.5392,0.2886,0.4849,0.4285,0.4758
0.1787,0.3315,0.3834,0.318,0.3524,0.4601,0.3836,0.4207,0.458,0.438
0.1816,0.3364,0.2765,0.3056,0.3329,0.3375,0.4589,0.5119,0.576,0.5512
0.1866,0.148,0.3433,0.3213,0.3187,0.3293,0.5123,0.4488,0.4873,0.5916
0.1279,0.1702,0.3554,0.2897,0.3501,0.3633,0.4094,0.4519,0.4548,0.4697
0.1929,0.0023,0.1517,0.1763,0.1987,0.2189,0.3307,0.3934,0.4794,0.4328
0.0243,0.3691,0.2634,0.2701,0.3539,0.3784,0.4002,0.4844,0.5138,0.5012
0.1027,0.293,0.2634,0.3881,0.4183,0.4304,0.4505,0.4882,0.5008,0.5499
0.042,0.2656,0.2605,0.4446,0.4465,0.4163,0.4505,0.4898,0.5475,0.534
0.193,0.0415,0.2783,0.3285,0.3466,0.4254,0.3418,0.5508,0.5164,0.4883
0.0914,0.1331,0.122,0.2372,0.2204,0.3369,0.3691,0.387,0.3928,0.4647
-0.0661,0.256,0.2759,0.3293,0.4367,0.3791,0.3883,0.4981,0.4909,0.4829
0.1384,0.2007,0.2073,0.3555,0.3034,0.2423,0.4163,0.3402,0.4253,0.5284
0.0982,0.1351,0.2281,0.2768,0.3777,0.3576,0.347,0.4215,0.3475,0.4243
0.0561,0.1885,0.2546,0.2527,0.4372,0.3676,0.291,0.5071,0.4218,0.455
0.0583,0.2779,0.3185,0.1775,0.3391,0.4815,0.3545,0.5023,0.5023,0.4477
-0.0078,0.3425,0.1338,0.2746,0.3261,0.3884,0.2841,0.495,0.5082,0.4674
0.0342,0.4096,0.1334,0.386,0.3688,0.3256,0.4333,0.4925,0.5391,0.5055
0.139,0.1967,0.1493,0.3659,0.2046,0.2682,0.3367,0.3115,0.3894,0.4501
0.0675,0.3622,0.1392,0.284,0.2886,0.3924,0.3794,0.4729,0.3801,0.5005
0.1466,0.2655,0.2739,0.3143,0.3534,0.2538,0.362,0.4614,0.3742,0.5394
0.1881,0.2019,0.2725,0.2653,0.41,0.4229,0.4761,0.3972,0.5073,0.5495
0.0913,0.1418,0.2409,0.4393,0.2807,0.34,0.4889,0.489,0.4516,0.5288
0.1174,0.2622,0.2217,0.2526,0.4114,0.4244,0.3805,0.4071,0.4908,0.5184
0.1434,0.1673,0.283,0.3481,0.327,0.1525,0.3176,0.4029,0.4229,0.4689
0.1247,0.4413,0.2575,0.411,0.2505,0.2683,0.5127,0.4262,0.4329,0.5798
0.1115,0.2174,0.4103,0.3115,0.5268,0.3771,0.4214,0.5571,0.6001,0.6086
-0.038,0.3046,0.3173,0.2418,0.3949,0.4267,0.4005,0.4371,0.3769,0.4422
0.2131,0.2152,0.2241,0.3632,0.4325,0.4131,0.4318,0.4412,0.5176,0.4632
-0.0169,0.2972,0.3134,0.3772,0.322,0.4063,0.3584,0.3568,0.4033,0.4684
0.219,0.3678,0.2168,0.2367,0.4227,0.4165,0.3264,0.4963,0.5041,0.5158
0.0734,0.2601,0.2747,0.3167,0.3166,0.2327,0.4155,0.4323,0.4689,0.5227
0.164,0.3099,0.0639,0.2725,0.1606,0.3069,0.329,0.4628,0.4292,0.4905
-0.0027,0.1865,0.1919,0.2444,0.2515,0.3105,0.3584,0.3786,0.401,0.4561
0.2593,0.1667,0.1052,0.0824,0.1632,0.1016,0.2816,0.3381,0.3452,0.385
-0.046,-0.0578,0.1391,0.4272,0.322,0.277,0.3808,0.5262,0.4703,0.5436
0.0077,0.4168,0.2738,0.3963,0.2911,0.4301,0.451,0.4367,0.4673,0.5254
0.1217,0.2009,0.2168,0.4107,0.3487,0.4096,0.5823,0.4506,0.4055,0.5711
0.1586,0.1736,0.1652,0.2788,0.3762,0.3668,0.3691,0.4493,0.4428,0.5437
0.0172,0.2455,0.0015,0.1833,0.3394,0.3117,0.1783,0.3454,0.2835,0.2975
0.0813,0.2404,0.3617,0.2862,0.3827,0.2874,0.3982,0.4501,0.4611,0.5071
0.1026,0.1368,0.3189,0.2686,0.3716,0.3563,0.3448,0.4454,0.4173,0.4383
0.0563,0.3015,0.1518,0.2273,0.3063,0.3903,0.3586,0.3543,0.4155,0.4625
0.0554,0.2628,0.2344,0.2765,0.3374,0.3704,0.3812,0.4928,0.4599,0.4612
0.0627,0.1668,0.2836,0.2684,0.2578,0.4008,0.3191,0.4115,0.3913,0.4034
0.2185,-0.0043,0.2023,0.258,0.2598,0.2536,0.4258,0.434,0.3982,0.4564
0.1226,0.2027,0.1822,0.2404,0.1778,0.239,0.2815,0.4364,0.4207,0.4731
0.172,0.2988,0.1553,0.2484,0.2432,0.3115,0.2484,0.4366,0.4588,0.4312
0.005,0.3202,0.2515,0.4047,0.3659,0.3297,0.3564,0.475,0.5156,0.4815
0.1676,0.111,0.3032,0.218,0.3667,0.1992,0.3477,0.3734,0.3974,0.461
0.1066,0.2126,0.3147,0.3081,0.3372,0.3248,0.36,0.4548,0.4265,0.4404
0.1329,0.0918,0.2444,0.2676,0.2737,0.2759,0.3483,0.4216,0.445,0.4457
-0.0121,0.1279,0.1577,0.2147,0.2887,0.2253,0.282,0.3772,0.3477,0.3824
0.072,0.0853,0.0963,0.3766,0.1947,0.2853,0.2539,0.3695,0.4161,0.3196
0.1024,0.1383,0.2425,0.2839,0.3179,0.4019,0.4115,0.4018,0.3878,0.4394
0.1601,0.2842,0.2832,0.2444,0.3355,0.4508,0.3388,0.4041,0.4036,0.445
0.0867,0.3302,0.2138,0.3399,0.4211,0.3362,0.4878,0.4136,0.4634,0.483
0.2064,0.291,0.3572,0.2951,0.2744,0.3975,0.3958,0.5406,0.5399,0.5117
0.0978,-0.0439,0.1608,0.4165,0.3237,0.3742,0.3731,0.4041,0.4548,0.4476
0.1439,0.342,0.2418,0.3206,0.365,0.3525,0.4539,0.3371,0.4255,0.4571
0.0089,0.2377,0.1979,0.2474,0.2959,0.2285,0.3669,0.4444,0.4405,0.4685
0.0921,0.1586,0.2654,0.4067,0.237,0.2883,0.4146,0.3877,0.4261,0.5055
0.1842,0.2042,0.3547,0.2736,0.3365,0.3243,0.2912,0.4117,0.4114,0.4515
-0.0016,0.0989,0.1132,0.2864,0.2581,0.4246,0.3654,0.4275,0.412,0.4868
0.1312,0.222,0.3134,0.2714,0.3089,0.3377,0.3772,0.4258,0.4433,0.3614
-0.0176,0.1483,0.33,0.3333,0.4242,0.4564,0.3076,0.4303,0.3875,0.4655
0.3247,0.2952,0.1774,0.3582,0.3953,0.4444,0.3556,0.5154,0.4691,0.5675
0.0633,0.2782,0.1661,0.3222,0.2495,0.2948,0.3533,0.3572,0.4496,0.4225
0.1645,0.1895,0.1999,0.2448,0.2827,0.4239,0.3434,0.5027,0.5016,0.4712
0.2294,0.1639,0.1541,0.2703,0.3141,0.1296,0.2869,0.3914,0.4406,0.4704
-0.0834,0.1126,0.2475,0.4648,0.3888,0.4513,0.3417,0.5031,0.5089,0.4431
0.065,0.0611,0.0118,0.2767,0.3516,0.2248,0.3747,0.4827,0.4745,0.4605
0.1985,0.3557,0.2601,0.2324,0.428,0.2825,0.3185,0.4789,0.4088,0.4127
0.14,0.1657,0.1867,0.2784,0.3733,0.4148,0.298,0.5074,0.5344,0.5168
0.0833,0.0888,0.202,0.3712,0.3284,0.3431,0.2341,0.3998,0.4388,0.3958
0.25,0.2801,0.2517,0.1963,0.3262,0.2007,0.2434,0.4437,0.5008,0.473
0.1819,0.2479,0.2471,0.3147,0.078,0.3212,0.4215,0.3707,0.4411,0.4961
0.1734,0.2724,0.1104,0.0451,0.348,0.3232,0.229,0.4056,0.292,0.3126
-0.101,0.1594,0.0983,0.2886,0.1757,0.1584,0.3198,0.378,0.434,0.5105
0.2063,0.2436,0.0849,0.2433,0.0815,0.3233,0.2868,0.4634,0.4797,0.4101
-0.0351,0.1354,0.1424,0.4133,0.255,0.306,0.5015,0.4081,0.3878,0.5015
0.0947,0.2303,0.3179,0.2903,0.2326,0.4088,0.3653,0.5227,0.5241,0.4882
0.1074,0.1664,0.2554,0.3208,0.1276,0.361,0.3268,0.3577,0.3958,0.4582
0.1957,0.2117,0.2598,0.1205,0.3043,0.36,0.2407,0.3901,0.3712,0.3565
0.1674,0.1462,0.1853,0.2497,0.122,0.2638,0.3262,0.3871,0.4284,0.4493
0.1343,0.2321,0.1052,0.1602,0.1284,0.3932,0.1987,0.5134,0.4684,0.4632
0.1266,0.255,0.2631,0.285,0.3973,0.3684,0.3309,0.4711,0.4914,0.5617
0.2175,0.3225,0.0966,0.2268,0.2796,0.2261,0.3604,0.3948,0.4539,0.4706
0.1534,0.2816,0.337,0.1406,0.207,0.2682,0.3217,0.341,0.3881,0.4189
0.1065,0.1789,0.2225,0.2391,0.2323,0.3895,0.3481,0.4753,0.4685,0.4912
0.0865,0.1453,0.3731,0.3677,0.3807,0.4005,0.4237,0.3875,0.4659,0.4965
0.1591,0.1476,0.2083,0.3449,0.3174,0.3407,0.2928,0.4427,0.4982,0.5207
0.0582,0.111,0.2118,0.2437,0.3162,0.395,0.2972,0.3807,0.3808,0.3777
0.1637,0.3916,0.1387,0.2453,0.2798,0.3457,0.3255,0.554,0.4682,0.5614
0.2285,0.152,0.318,0.3389,0.3808,0.3487,0.4868,0.4782,0.5091,0.6188
0.1441,0.3303,0.2516,0.232,0.2805,0.3711,0.3759,0.3913,0.404,0.4245
0.108,0.1838,0.1886,0.2108,0.2957,0.3455,0.3157,0.4638,0.4237,0.4453
0.0436,0.1984,0.3319,0.2964,0.4429,0.2927,0.3425,0.5185,0.482,0.5389
0.1787,0.1117,0.1997,0.2216,0.154,0.1633,0.3478,0.3826,0.4054,0.4692
0.0038,0.2127,0.2652,0.368,0.3386,0.4809,0.4136,0.4787,0.4753,0.521
0.255,0.1537,0.1604,0.2642,0.3318,0.3881,0.3795,0.4149,0.4512,0.4019
0.1712,0.1621,0.2897,0.1824,0.2933,0.4658,0.317,0.506,0.5026,0.4369
0.0823,0.2956,0.1863,0.1622,0.3103,0.398,0.2762,0.4233,0.454,0.3837
0.2682,0.3477,0.2122,0.4237,0.4556,0.3108,0.5476,0.5715,0.602,0.6119
0.0215,0.4126,0.3113,0.4028,0.2111,0.4294,0.4147,0.5052,0.5235,0.5335
0.1739,0.0389,0.231,0.3354,0.2697,0.2659,0.2975,0.3388,0.4018,0.446
0.1528,0.2632,0.1462,0.3239,0.2884,0.2401,0.3987,0.3687,0.4278,0.4977
0.0551,0.1441,0.3532,0.3988,0.1656,0.3549,0.3888,0.4065,0.4083,0.4776
0.1295,0.1419,0.2906,0.3332,0.1985,0.3841,0.3531,0.3793,0.4706,0.5085
0.3165,0.3575,0.1572,0.3243,0.4255,0.4382,0.3657,0.4937,0.5567,0.5895
0.1241,0.3697,0.2132,0.3135,0.5229,0.5267,0.3721,0.4923,0.5539,0.5456
0.0345,0.4071,0.4054,0.3141,0.4219,0.3332,0.4261,0.4892,0.5216,0.5912
0.1299,0.2234,0.3509,0.3157,0.2885,0.3808,0.3806,0.4565,0.3893,0.5476
0.2028,0.3472,0.3011,0.2591,0.3678,0.4915,0.3893,0.4846,0.4559,0.5089
0.1705,0.129,0.138,0.2601,0.1981,0.3226,0.3007,0.3705,0.4178,0.3731
-0.0615,0.2236,0.2714,0.3609,0.2127,0.3785,0.28,0.4402,0.4859,0.453
0.1015,0.2898,0.0838,0.3992,0.1866,0.3219,0.512,0.4132,0.4665,0.5733
0.1187,0.3175,0.3745,0.2248,0.3498,0.3529,0.3633,0.4618,0.4573,0.4759
0.1013,0.2629,0.1924,0.1021,0.1999,0.3403,0.2133,0.3994,0.3457,0.3055
0.0396,0.0606,0.2246,0.3506,0.3771,0.3857,0.3929,0.3925,0.3933,0.5717
0.0748,0.4826,0.0851,0.3502,0.3898,0.3142,0.4215,0.406,0.4221,0.4867
0.0708,0.1521,0.2518,0.4015,0.3196,0.3107,0.2815,0.4004,0.4303,0.485
0.1965,0.1955,0.1175,0.2935,0.1334,0.2888,0.3496,0.4218,0.4319,0.5032
0.1358,0.2236,0.2193,0.2608,0.3589,0.3276,0.3632,0.4176,0.2425,0.5085
0.1301,0.3597,0.3221,0.3627,0.2129,0.2841,0.4352,0.3963,0.4453,0.5544
0.068,0.3144,0.2629,0.3359,0.3255,0.3359,0.423,0.5276,0.5061,0.5215
0.1817,0.1795,0.1376,0.2082,0.1619,0.2024,0.1869,0.3622,0.405,0.39
0.1058,0.1952,0.158,0.279,0.4129,0.3758,0.355,0.4168,0.3783,0.436
0.0544,0.2478,0.0185,0.2984,0.2327,0.2285,0.2525,0.4242,0.3913,0.4407
0.0325,0.13,0.1968,0.3033,0.2999,0.4376,0.2819,0.3803,0.491,0.4296
0.1039,0.1375,0.2378,0.2934,0.3679,0.3787,0.3915,0.3616,0.403,0.4455
0.1843,0.3273,0.1908,0.3708,0.3062,0.2979,0.4453,0.3449,0.3642,0.4971
0.1786,0.3439,0.2456,0.3036,0.2236,0.3225,0.4596,0.4013,0.4119,0.4676
0.1061,0.3192,0.3286,0.3405,0.3563,0.3276,0.4676,0.4098,0.3944,0.44
0.1569,0.2035,0.2344,0.2484,0.3034,0.3623,0.3466,0.3791,0.4013,0.4785
0.1427,0.2395,0.2162,0.4235,0.2849,0.3615,0.3732,0.3068,0.3618,0.4659
0.1015,0.1764,0.3387,0.2047,0.3301,0.3707,0.3118,0.4673,0.4385,0.441
0.1607,0.3186,0.2125,0.366,0.3466,0.4844,0.4435,0.5221,0.4572,0.4887
0.0702,0.0749,0.3755,0.3295,0.4591,0.3472,0.3934,0.4459,0.5005,0.4652
0.0994,0.2848,0.2346,0.3416,0.4723,0.4264,0.4669,0.4853,0.5407,0.5705
0.0471,0.1691,0.3455,0.2931,0.4723,0.3557,0.4274,0.4192,0.4394,0.5547
0.206,0.2139,0.3667,0.2431,0.3565,0.3865,0.3479,0.5089,0.475,0.4379
0.1311,0.3308,0.0969,0.2859,0.265,0.3582,0.3732,0.3768,0.4682,0.4716
0.116,0.2411,0.1505,0.3644,0.1877,0.3599,0.4118,0.4969,0.5253,0.4851
0.1324,0.2916,0.3804,0.3332,0.3366,0.4743,0.408,0.4472,0.5276,0.5304
0.0088,0.2468,0.23,0.2533,0.3416,0.4073,0.3298,0.5112,0.4654,0.4471
0.0309,0.2596,0.1672,0.2602,0.1954,0.3243,0.2146,0.3612,0.3804,0.3574
