GuideName,GuideSeq,MatchPos,GuideScores,Rank,standardizedGuideScores,quartiles
crRNA528:546-568,CATAGCCATAGATGTAGGAGCTC,568,1.46055957606083,0.9988,0.970001878761564,4
crRNA527:545-567,ATAGCCATAGATGTAGGAGCTCC,567,1.3639516451195,0.9975,0.916350330963803,4
crRNA757:775-797,CTTATTGCATACTAGAATCCCAG,797,1.35623571141015,0.9963,0.912065260554181,4
crRNA756:774-796,TTATTGCATACTAGAATCCCAGG,796,1.27610619066844,0.995,0.867565054720186,4
crRNA786:804-826,ATTAAATTTTGCATCAGTACAGG,826,1.26363027422499,0.9938,0.860636511474671,4
crRNA341:341-363,CAGTTCAATGCTGTGGAAACCGA,363,1.23179505743292,0.9925,0.842956713980515,4
crRNA755:773-795,TATTGCATACTAGAATCCCAGGA,795,1.21028447678418,0.9913,0.831010738794129,4
crRNA758:776-798,TCTTATTGCATACTAGAATCCCA,798,1.18238752166933,0.99,0.815518068511548,4
crRNA785:803-825,TTAAATTTTGCATCAGTACAGGG,825,1.16379793012202,0.9888,0.805194274701622,4
crRNA587:605-627,ATTGGCAGTGAATTGCAGACACT,627,1.14389338792982,0.9876,0.794140218513777,4
crRNA434:434-456,TGCGATGATGATTCCCGCCATCA,456,1.13505163077015,0.9863,0.789229918166317,4
crRNA540:558-580,AGGTAGCATCAACATAGCCATAG,580,1.13284578487355,0.9851,0.78800489403628,4
crRNA782:800-822,AATTTTGCATCAGTACAGGGCAT,822,1.09449312678715,0.9838,0.766705613030636,4
crRNA588:606-628,CATTGGCAGTGAATTGCAGACAC,628,1.09279775120696,0.9826,0.765764080352215,4
crRNA473:473-495,CACTGAGTACACCTGCCCTCCTT,495,1.058325732457,0.9813,0.746619925792357,4
crRNA791:809-831,ACTTTATTAAATTTTGCATCAGT,831,1.04794825589081,0.9801,0.740856758373427,4
crRNA749:767-789,ATACTAGAATCCCAGGATTCAGG,789,1.03621188215508,0.9789,0.734338922722468,4
crRNA526:544-566,TAGCCATAGATGTAGGAGCTCCC,566,1.03536588896589,0.9776,0.73386909748572,4
crRNA483:483-505,CCCCCATAGGCACTGAGTACACC,505,1.02532194887764,0.9764,0.728291160700694,4
crRNA686:704-726,TCCCAAAAGTACTTGCCGCTCTA,726,1.02407992202227,0.9751,0.727601396800901,4
crRNA661:679-701,CCTGACTCTGCAATGGCTGCCAG,701,1.02292943648124,0.9739,0.726962470685896,4
crRNA480:480-502,CCATAGGCACTGAGTACACCTGC,502,1.01551974828496,0.9726,0.722847474778671,4
crRNA481:481-503,CCCATAGGCACTGAGTACACCTG,503,0.998073753330909,0.9714,0.713158781282839,4
crRNA787:805-827,TATTAAATTTTGCATCAGTACAG,827,0.993266250828855,0.9701,0.710488918179845,4
crRNA525:543-565,AGCCATAGATGTAGGAGCTCCCG,565,0.983289784079807,0.9689,0.704948452946568,4
crRNA005:5-27,AGCAACTGTCGTAAAGCGCTCTG,27,0.979594205260671,0.9677,0.702896100497619,4
crRNA479:479-501,CATAGGCACTGAGTACACCTGCC,501,0.978612873935168,0.9664,0.702351114759879,4
crRNA435:435-457,CTGCGATGATGATTCCCGCCATC,457,0.978025331938149,0.9652,0.702024821284497,4
crRNA538:556-578,GTAGCATCAACATAGCCATAGAT,578,0.975728504478043,0.9639,0.700749270229233,4
crRNA050:50-72,AGCTAGTAAGGTAGCCGCCATCT,72,0.968077357634175,0.9627,0.696500179428906,4
crRNA532:550-572,TCAACATAGCCATAGATGTAGGA,572,0.967065741058497,0.9614,0.695938374672979,4
crRNA436:436-458,CCTGCGATGATGATTCCCGCCAT,458,0.964411294901075,0.9602,0.694464218840184,4
crRNA340:340-362,AGTTCAATGCTGTGGAAACCGAG,362,0.96258155295287,0.959,0.69344806533565,4
crRNA484:502-524,GACTGCCTTACCATCATACCCCC,524,0.959735725197073,0.9577,0.691867625071827,4
crRNA342:342-364,TCAGTTCAATGCTGTGGAAACCG,364,0.959722015499558,0.9565,0.691860011344006,4
crRNA790:808-830,CTTTATTAAATTTTGCATCAGTA,830,0.958397673830467,0.9552,0.691124533628383,4
crRNA690:708-730,GGTCTCCCAAAAGTACTTGCCGC,730,0.953512704959961,0.954,0.688411649310369,4
crRNA440:440-462,CCAGCCTGCGATGATGATTCCCG,462,0.951724631968628,0.9527,0.687418636804816,4
crRNA337:337-359,TCAATGCTGTGGAAACCGAGCTG,359,0.948052737950143,0.9515,0.685379437791634,4
crRNA711:729-751,CAACGGCGAATTTGGGTATCTGG,751,0.94650370807309,0.9502,0.684519178704424,4
crRNA007:7-29,AAAGCAACTGTCGTAAAGCGCTC,29,0.94547321105496,0.949,0.683946888629634,4
crRNA237:237-259,GTGTCAGCTTGTCAGTCACTCGA,259,0.943123667898521,0.9478,0.682642061730514,4
crRNA687:705-727,CTCCCAAAAGTACTTGCCGCTCT,727,0.941327900775036,0.9465,0.681644776262121,4
crRNA582:600-622,CAGTGAATTGCAGACACTCTTCC,622,0.940084850759364,0.9453,0.680954444146725,4
crRNA051:51-73,CAGCTAGTAAGGTAGCCGCCATC,73,0.938355021076659,0.944,0.679993777263588,4
crRNA339:339-361,GTTCAATGCTGTGGAAACCGAGC,361,0.937665161498543,0.9428,0.679610661366494,4
crRNA432:432-454,CGATGATGATTCCCGCCATCAGG,454,0.933247133097682,0.9415,0.677157094049493,4
crRNA108:108-130,CCCAGTCTGGAGTGAACGCCTCC,130,0.930847681845383,0.9403,0.675824550517127,4
crRNA111:111-133,TTTCCCAGTCTGGAGTGAACGCC,133,0.930437528768601,0.9391,0.675596770590687,4
crRNA006:6-28,AAGCAACTGTCGTAAAGCGCTCT,28,0.924567462238011,0.9378,0.672336808888027,4
crRNA004:4-26,GCAACTGTCGTAAAGCGCTCTGT,26,0.923479810242321,0.9366,0.671732777599234,4
crRNA482:482-504,CCCCATAGGCACTGAGTACACCT,504,0.917801484290306,0.9353,0.668579299688494,4
crRNA220:220-242,ACTCGATTGGCGATGTAGGACCC,242,0.917610660902576,0.9341,0.668473325261674,4
crRNA662:680-702,CCCTGACTCTGCAATGGCTGCCA,702,0.910420371037924,0.9328,0.664480172974959,4
crRNA780:798-820,TTTTGCATCAGTACAGGGCATCT,820,0.910158896971698,0.9316,0.664334962450054,4
crRNA779:797-819,TTTGCATCAGTACAGGGCATCTC,819,0.906181113726878,0.9303,0.662125886799545,4
crRNA110:110-132,TTCCCAGTCTGGAGTGAACGCCT,132,0.899217401589689,0.9291,0.658258565235592,4
crRNA009:9-31,TCAAAGCAACTGTCGTAAAGCGC,31,0.89374423276879,0.9279,0.655219022045519,4
crRNA474:474-496,GCACTGAGTACACCTGCCCTCCT,496,0.889793009755125,0.9266,0.653024696711029,4
crRNA437:437-459,GCCTGCGATGATGATTCCCGCCA,459,0.889444516839109,0.9254,0.652831159967631,4
crRNA162:162-184,CCCCGTCAAACTGCACGGCCATG,184,0.885406106578471,0.9241,0.650588414894691,4
crRNA112:112-134,CTTTCCCAGTCTGGAGTGAACGC,134,0.883098803729644,0.9229,0.649307046296155,4
crRNA744:762-784,AGAATCCCAGGATTCAGGCGGGT,784,0.882012088948045,0.9216,0.648703535492442,4
crRNA688:706-728,TCTCCCAAAAGTACTTGCCGCTC,728,0.880512635678773,0.9204,0.647870808945429,4
crRNA781:799-821,ATTTTGCATCAGTACAGGGCATC,821,0.872235228077547,0.9192,0.643273922072564,4
crRNA529:547-569,ACATAGCCATAGATGTAGGAGCT,569,0.871245804530427,0.9179,0.642724442291626,4
crRNA748:766-788,TACTAGAATCCCAGGATTCAGGC,788,0.869222837976235,0.9167,0.641600980835429,4
crRNA008:8-30,CAAAGCAACTGTCGTAAAGCGCT,30,0.865826665778252,0.9154,0.639714904886653,4
crRNA029:29-51,CTTTCTCCTCCGGTACTGCCTCA,51,0.856725732172351,0.9142,0.634660670005483,4
crRNA388:388-410,ATCTCCTTAAAGAGGCTGGCTGC,410,0.854791364222511,0.9129,0.633586412089927,4
crRNA685:703-725,CCCAAAAGTACTTGCCGCTCTAC,725,0.852624424952582,0.9117,0.632382994889261,4
crRNA431:431-453,GATGATGATTCCCGCCATCAGGT,453,0.852049876524143,0.9104,0.632063917437026,4
crRNA161:161-183,CCCGTCAAACTGCACGGCCATGA,183,0.84985488929999,0.9092,0.630844923708202,4
crRNA572:590-612,CAGACACTCTTCCTTGGTCATGC,612,0.848819375523299,0.908,0.630269847559235,4
crRNA028:28-50,TTTCTCCTCCGGTACTGCCTCAA,50,0.848630296949266,0.9067,0.630164842120723,4
crRNA523:541-563,CCATAGATGTAGGAGCTCCCGGA,563,0.846171613190822,0.9055,0.628799403611685,4
crRNA778:796-818,TTGCATCAGTACAGGGCATCTCT,818,0.843654325623117,0.9042,0.62740141927496,4
crRNA392:392-414,ACACATCTCCTTAAAGAGGCTGG,414,0.842284417542818,0.903,0.626640636095643,4
crRNA586:604-626,TTGGCAGTGAATTGCAGACACTC,626,0.840913125479064,0.9017,0.62587908431634,4
crRNA393:393-415,AACACATCTCCTTAAAGAGGCTG,415,0.837973747685182,0.9005,0.624246690716068,4
crRNA689:707-729,GTCTCCCAAAAGTACTTGCCGCT,729,0.837749808989094,0.8993,0.624122325588487,4
crRNA163:163-185,CCCCCGTCAAACTGCACGGCCAT,185,0.831575978171735,0.898,0.620693667341018,4
crRNA679:697-719,AGTACTTGCCGCTCTACCCCTGA,719,0.829204965266616,0.8968,0.619376917142886,4
crRNA248:248-270,GTCGTGAATAGGTGTCAGCTTGT,270,0.828855086578934,0.8955,0.619182610806412,4
crRNA663:681-703,CCCCTGACTCTGCAATGGCTGCC,703,0.828660220782796,0.8943,0.619074391414134,4
crRNA263:263-285,ACAGCAGAAAATGCGGTCGTGAA,285,0.82543016497396,0.893,0.617280568775261,4
crRNA533:551-573,ATCAACATAGCCATAGATGTAGG,573,0.82365040775244,0.8918,0.616292174461168,4
crRNA439:439-461,CAGCCTGCGATGATGATTCCCGC,461,0.822518931787996,0.8905,0.615663805380111,4
crRNA680:698-720,AAGTACTTGCCGCTCTACCCCTG,720,0.818763470342308,0.8893,0.61357819690788,4
crRNA218:218-240,TCGATTGGCGATGTAGGACCCAG,240,0.818138743098012,0.8881,0.613231252477114,4
crRNA167:167-189,CACGCCCCCGTCAAACTGCACGG,189,0.816910803090512,0.8868,0.612549311756893,4
crRNA405:405-427,CCCGGTATCGGTAACACATCTCC,427,0.815991116873006,0.8856,0.612038560842587,4
crRNA217:217-239,CGATTGGCGATGTAGGACCCAGT,239,0.815061706242341,0.8843,0.611522409441879,4
crRNA309:309-331,TGACAGCATCAGCTACTGCCTGG,331,0.813627135307965,0.8831,0.610725715523429,4
crRNA530:548-570,AACATAGCCATAGATGTAGGAGC,570,0.809808506186323,0.8818,0.608605026664394,4
crRNA684:702-724,CCAAAAGTACTTGCCGCTCTACC,724,0.808769795678743,0.8806,0.608028175199898,4
crRNA706:724-746,GCGAATTTGGGTATCTGGTCTCC,746,0.808741968432936,0.8794,0.60801272124292,4
crRNA433:433-455,GCGATGATGATTCCCGCCATCAG,455,0.808090077399,0.8781,0.607650691307848,4
crRNA682:700-722,AAAAGTACTTGCCGCTCTACCCC,722,0.802174750222998,0.8769,0.604365593949584,4
crRNA389:389-411,CATCTCCTTAAAGAGGCTGGCTG,411,0.802097025585773,0.8756,0.604322429304109,4
crRNA385:385-407,TCCTTAAAGAGGCTGGCTGCTGT,407,0.798933417665561,0.8744,0.602565508729465,4
crRNA109:109-131,TCCCAGTCTGGAGTGAACGCCTC,131,0.798268926939286,0.8731,0.602196481511777,4
crRNA240:240-262,TAGGTGTCAGCTTGTCAGTCACT,262,0.796358473228971,0.8719,0.601135504451657,4
crRNA164:164-186,GCCCCCGTCAAACTGCACGGCCA,186,0.795284504990475,0.8706,0.600539072484638,4
crRNA681:699-721,AAAGTACTTGCCGCTCTACCCCT,721,0.794906510046726,0.8694,0.600329151688341,4
crRNA241:241-263,ATAGGTGTCAGCTTGTCAGTCAC,263,0.793225386100926,0.8682,0.599395533704256,4
crRNA003:3-25,CAACTGTCGTAAAGCGCTCTGTC,25,0.791983981448214,0.8669,0.598706115346856,4
crRNA705:723-745,CGAATTTGGGTATCTGGTCTCCC,745,0.786693292242179,0.8657,0.595767912840552,4
crRNA477:477-499,TAGGCACTGAGTACACCTGCCCT,499,0.786062170803412,0.8644,0.595417417371823,4
crRNA427:427-449,ATGATTCCCGCCATCAGGTCTTC,449,0.785830554262593,0.8632,0.595288788326677,4
crRNA438:438-460,AGCCTGCGATGATGATTCCCGCC,460,0.783300278920362,0.8619,0.593883591184554,4
crRNA522:540-562,CATAGATGTAGGAGCTCCCGGAG,562,0.782548346208664,0.8607,0.593466002758539,4
crRNA531:549-571,CAACATAGCCATAGATGTAGGAG,571,0.781166972760051,0.8595,0.592698852247368,4
crRNA542:560-582,GTAGGTAGCATCAACATAGCCAT,582,0.7811393270542,0.8582,0.592683499109231,4
crRNA524:542-564,GCCATAGATGTAGGAGCTCCCGG,564,0.779742194383781,0.857,0.591907596659852,4
crRNA678:696-718,GTACTTGCCGCTCTACCCCTGAC,718,0.779315353389692,0.8557,0.591670549040953,4
crRNA683:701-723,CAAAAGTACTTGCCGCTCTACCC,723,0.776376968527063,0.8545,0.590038706868479,4
crRNA038:38-60,AGCCGCCATCTTTCTCCTCCGGT,60,0.775619309002998,0.8532,0.589617938037454,4
crRNA485:503-525,GGACTGCCTTACCATCATACCCC,525,0.774131732898073,0.852,0.588791807514644,4
crRNA672:690-712,GCCGCTCTACCCCTGACTCTGCA,712,0.773989338383466,0.8507,0.588712728229619,4
crRNA053:53-75,AGCAGCTAGTAAGGTAGCCGCCA,75,0.771394273526042,0.8495,0.587271550006675,4
crRNA030:30-52,TCTTTCTCCTCCGGTACTGCCTC,52,0.770658601806971,0.8483,0.586862992179024,4
crRNA478:478-500,ATAGGCACTGAGTACACCTGCCC,500,0.769446511089731,0.847,0.586189853416838,4
crRNA175:175-197,CCCAGAACCACGCCCCCGTCAAA,197,0.767563725594942,0.8458,0.585144241995681,4
crRNA236:236-258,TGTCAGCTTGTCAGTCACTCGAT,258,0.764597107904199,0.8445,0.583496720624695,3
crRNA476:476-498,AGGCACTGAGTACACCTGCCCTC,498,0.759408382853259,0.8433,0.580615144263753,3
crRNA537:555-577,TAGCATCAACATAGCCATAGATG,577,0.757260512091392,0.842,0.579422316824837,3
crRNA168:168-190,CCACGCCCCCGTCAAACTGCACG,190,0.756124099570433,0.8408,0.578791206210087,3
crRNA032:32-54,CATCTTTCTCCTCCGGTACTGCC,54,0.754168049874488,0.8396,0.577704907262016,3
crRNA707:725-747,GGCGAATTTGGGTATCTGGTCTC,747,0.754159082648813,0.8383,0.577699927282296,3
crRNA750:768-790,CATACTAGAATCCCAGGATTCAG,790,0.752267846677315,0.8371,0.57664962285974,3
crRNA124:124-146,GAAACTTCTCGGCTTTCCCAGTC,146,0.751473898082191,0.8358,0.576208700767887,3
crRNA543:561-583,GGTAGGTAGCATCAACATAGCCA,583,0.751005513823546,0.8346,0.57594858195367,3
crRNA176:176-198,CCCCAGAACCACGCCCCCGTCAA,198,0.748342360414891,0.8333,0.574469590518857,3
crRNA539:557-579,GGTAGCATCAACATAGCCATAGA,579,0.741943095535089,0.8321,0.570915736686942,3
crRNA673:691-713,TGCCGCTCTACCCCTGACTCTGC,713,0.736098239205655,0.8308,0.567669775556482,3
crRNA107:107-129,CCAGTCTGGAGTGAACGCCTCCG,129,0.735041063655284,0.8296,0.567082669466757,3
crRNA751:769-791,GCATACTAGAATCCCAGGATTCA,791,0.731891433993767,0.8284,0.565333511766312,3
crRNA346:346-368,TCATTCAGTTCAATGCTGTGGAA,368,0.73016758249769,0.8271,0.564376164889747,3
crRNA759:777-799,CTCTTATTGCATACTAGAATCCC,799,0.730142159345371,0.8259,0.564362046054383,3
crRNA001:1-23,ACTGTCGTAAAGCGCTCTGTCAC,23,0.730101241726925,0.8246,0.564339322313792,3
crRNA026:26-48,TCTCCTCCGGTACTGCCTCAAAG,48,0.728540588317087,0.8234,0.563472608057542,3
crRNA676:694-716,ACTTGCCGCTCTACCCCTGACTC,716,0.727144040236758,0.8221,0.562697030262287,3
crRNA496:514-536,CCAATGGCAAAGGACTGCCTTAC,536,0.727112871072707,0.8209,0.562679720359481,3
crRNA387:387-409,TCTCCTTAAAGAGGCTGGCTGCT,409,0.726803142156427,0.8197,0.562507711337092,3
crRNA585:603-625,TGGCAGTGAATTGCAGACACTCT,625,0.72654778809321,0.8184,0.562365899576975,3
crRNA253:253-275,ATGCGGTCGTGAATAGGTGTCAG,275,0.724530075671801,0.8172,0.561245356021549,3
crRNA251:251-273,GCGGTCGTGAATAGGTGTCAGCT,273,0.722655082888032,0.8159,0.560204072309346,3
crRNA166:166-188,ACGCCCCCGTCAAACTGCACGGC,188,0.72217841411419,0.8147,0.559939352661029,3
crRNA336:336-358,CAATGCTGTGGAAACCGAGCTGG,358,0.721737562645083,0.8134,0.559694524276485,3
crRNA391:391-413,CACATCTCCTTAAAGAGGCTGGC,413,0.721477304764861,0.8122,0.559549989164673,3
crRNA031:31-53,ATCTTTCTCCTCCGGTACTGCCT,53,0.720062263257272,0.8109,0.558764140980777,3
crRNA325:325-347,AAACCGAGCTGGTAGGTGACAGC,347,0.719815846247765,0.8097,0.558627292444275,3
crRNA570:588-610,GACACTCTTCCTTGGTCATGCCT,610,0.719000533952098,0.8085,0.558174505947609,3
crRNA386:386-408,CTCCTTAAAGAGGCTGGCTGCTG,408,0.71889185590177,0.8072,0.558114151217362,3
crRNA039:39-61,TAGCCGCCATCTTTCTCCTCCGG,61,0.717394439061168,0.806,0.557282555608037,3
crRNA310:310-332,GTGACAGCATCAGCTACTGCCTG,332,0.717208414134424,0.8047,0.557179246023084,3
crRNA472:472-494,ACTGAGTACACCTGCCCTCCTTC,494,0.716246644880493,0.8035,0.55664512414929,3
crRNA568:586-608,CACTCTTCCTTGGTCATGCCTTC,608,0.715728074511622,0.8022,0.55635713430559,3
crRNA184:184-206,GAGTCCGCCCCCAGAACCACGCC,206,0.715055460917037,0.801,0.555983596024957,3
crRNA425:425-447,GATTCCCGCCATCAGGTCTTCCC,447,0.71092823455251,0.7998,0.553691526622259,3
crRNA569:587-609,ACACTCTTCCTTGGTCATGCCTT,609,0.710540108197406,0.7985,0.553475979311707,3
crRNA497:515-537,TCCAATGGCAAAGGACTGCCTTA,537,0.707840939752479,0.7973,0.551976986802229,3
crRNA183:183-205,AGTCCGCCCCCAGAACCACGCCC,205,0.706972805743985,0.796,0.551494865585081,3
crRNA384:384-406,CCTTAAAGAGGCTGGCTGCTGTG,406,0.706631993246125,0.7948,0.551305594188407,3
crRNA675:693-715,CTTGCCGCTCTACCCCTGACTCT,715,0.706556242173104,0.7935,0.551263525568623,3
crRNA226:226-248,TCAGTCACTCGATTGGCGATGTA,248,0.705195941550283,0.7923,0.550508077923968,3
crRNA262:262-284,CAGCAGAAAATGCGGTCGTGAAT,284,0.704251374263473,0.791,0.549983509221971,3
crRNA181:181-203,TCCGCCCCCAGAACCACGCCCCC,203,0.702423171121402,0.7898,0.548968210298735,3
crRNA664:682-704,ACCCCTGACTCTGCAATGGCTGC,704,0.701913311733099,0.7886,0.54868505812815,3
crRNA783:801-823,AAATTTTGCATCAGTACAGGGCA,823,0.701818598799519,0.7873,0.548632458973676,3
crRNA249:249-271,GGTCGTGAATAGGTGTCAGCTTG,271,0.700379908092236,0.7861,0.547833477125127,3
crRNA404:404-426,CCGGTATCGGTAACACATCTCCT,426,0.700214233226978,0.7848,0.547741469017038,3
crRNA040:40-62,GTAGCCGCCATCTTTCTCCTCCG,62,0.699223961193854,0.7836,0.54719151802647,3
crRNA180:180-202,CCGCCCCCAGAACCACGCCCCCG,202,0.698851120713659,0.7823,0.546984459779293,3
crRNA789:807-829,TTTATTAAATTTTGCATCAGTAC,829,0.695831224464937,0.7811,0.545307349977293,3
crRNA252:252-274,TGCGGTCGTGAATAGGTGTCAGC,274,0.695171142575203,0.7799,0.544940771222191,3
crRNA745:763-785,TAGAATCCCAGGATTCAGGCGGG,785,0.694919292016967,0.7786,0.544800905145654,3
crRNA160:160-182,CCGTCAAACTGCACGGCCATGAT,182,0.694910072414329,0.7774,0.544795785007517,3
crRNA600:618-640,CCAAAGCGAGAGCATTGGCAGTG,640,0.692828606454479,0.7761,0.543639835704533,3
crRNA178:178-200,GCCCCCAGAACCACGCCCCCGTC,200,0.692119563076551,0.7749,0.543246066018019,3
crRNA565:583-605,TCTTCCTTGGTCATGCCTTCCCG,605,0.692045403974626,0.7736,0.543204881504876,3
crRNA238:238-260,GGTGTCAGCTTGTCAGTCACTCG,260,0.691634442807044,0.7724,0.542976652802421,3
crRNA122:122-144,AACTTCTCGGCTTTCCCAGTCTG,144,0.690929492456744,0.7711,0.542585156192923,3
crRNA182:182-204,GTCCGCCCCCAGAACCACGCCCC,204,0.689664461147618,0.7699,0.541882616690359,3
crRNA441:441-463,CCCAGCCTGCGATGATGATTCCC,463,0.688505163042328,0.7687,0.541238796487382,3
crRNA417:417-439,CCATCAGGTCTTCCCGGTATCGG,439,0.688222645749496,0.7674,0.541081899533971,3
crRNA784:802-824,TAAATTTTGCATCAGTACAGGGC,824,0.688184012097722,0.7662,0.541060444202151,3
crRNA725:743-765,GGGTGGTAAAGTGGCAACGGCGA,765,0.687593626621617,0.7649,0.540732571590848,3
crRNA674:692-714,TTGCCGCTCTACCCCTGACTCTG,714,0.687295656594623,0.7637,0.540567092908199,3
crRNA426:426-448,TGATTCCCGCCATCAGGTCTTCC,448,0.685795629276235,0.7624,0.539734047561029,3
crRNA494:512-534,AATGGCAAAGGACTGCCTTACCA,534,0.685384204241488,0.7612,0.539505561248344,3
crRNA608:626-648,CTCCATGGCCAAAGCGAGAGCAT,648,0.682449323551625,0.76,0.537875665130306,3
crRNA712:730-752,GCAACGGCGAATTTGGGTATCTG,752,0.680392532957694,0.7587,0.536733419376929,3
crRNA177:177-199,CCCCCAGAACCACGCCCCCGTCA,199,0.675800331578134,0.7575,0.534183124495217,3
crRNA095:95-117,GAACGCCTCCGGCCCCCAAGCCG,117,0.67576095847145,0.7562,0.534161258504562,3
crRNA703:721-743,AATTTGGGTATCTGGTCTCCCAA,743,0.675281355241858,0.755,0.533894909196118,3
crRNA338:338-360,TTCAATGCTGTGGAAACCGAGCT,360,0.674706854178508,0.7537,0.533575858048248,3
crRNA132:132-154,TCCCAGTGGAAACTTCTCGGCTT,154,0.674348506373412,0.7525,0.533376848358195,3
crRNA590:608-630,AGCATTGGCAGTGAATTGCAGAC,630,0.673807978971532,0.7512,0.53307666460045,3
crRNA165:165-187,CGCCCCCGTCAAACTGCACGGCC,187,0.673088282215484,0.75,0.532676978523636,3
crRNA754:772-794,ATTGCATACTAGAATCCCAGGAT,794,0.671815603216746,0.7488,0.531970191850258,3
crRNA282:282-304,CAGCAGCTGAGCCTGAGCGACAG,304,0.670188392416438,0.7475,0.531066514717551,3
crRNA578:596-618,GAATTGCAGACACTCTTCCTTGG,618,0.667594829417131,0.7463,0.529626170556694,3
crRNA130:130-152,CCAGTGGAAACTTCTCGGCTTTC,152,0.667532441539449,0.745,0.529591523233551,3
crRNA216:216-238,GATTGGCGATGTAGGACCCAGTG,238,0.666331005787893,0.7438,0.528924301743323,3
crRNA049:49-71,GCTAGTAAGGTAGCCGCCATCTT,71,0.665800041130194,0.7425,0.528629428688555,3
crRNA179:179-201,CGCCCCCAGAACCACGCCCCCGT,201,0.66466528076164,0.7413,0.527999235602343,3
crRNA634:652-674,ATCACTCCTCCACTGGAGCCATC,674,0.664548993556669,0.74,0.527934655101809,3
crRNA406:406-428,TCCCGGTATCGGTAACACATCTC,428,0.66395618371984,0.7388,0.527605436113412,3
crRNA416:416-438,CATCAGGTCTTCCCGGTATCGGT,438,0.663419108633644,0.7376,0.527307169611094,3
crRNA424:424-446,ATTCCCGCCATCAGGTCTTCCCG,446,0.662924687164589,0.7363,0.527032590942234,3
crRNA710:728-750,AACGGCGAATTTGGGTATCTGGT,750,0.661602165501169,0.7351,0.52629812397304,3
crRNA607:625-647,TCCATGGCCAAAGCGAGAGCATT,647,0.660875165339097,0.7338,0.52589438192449,3
crRNA792:810-832,AACTTTATTAAATTTTGCATCAG,832,0.658974201776855,0.7326,0.524838675250849,3
crRNA581:599-621,AGTGAATTGCAGACACTCTTCCT,621,0.658388672800772,0.7313,0.52451349971359,3
crRNA034:34-56,GCCATCTTTCTCCTCCGGTACTG,56,0.65806310088655,0.7301,0.524332692227629,3
crRNA628:646-668,CCTCCACTGGAGCCATCCCGCTC,668,0.657826261914941,0.7289,0.524201162887523,3
crRNA691:709-731,TGGTCTCCCAAAAGTACTTGCCG,731,0.656693516147546,0.7276,0.523572088617016,3
crRNA037:37-59,GCCGCCATCTTTCTCCTCCGGTA,59,0.654040395832675,0.7264,0.522098669095456,3
crRNA033:33-55,CCATCTTTCTCCTCCGGTACTGC,55,0.652120056183064,0.7251,0.521032201844837,3
crRNA133:133-155,GTCCCAGTGGAAACTTCTCGGCT,155,0.651275104308028,0.7239,0.520562954905495,3
crRNA187:187-209,CTGGAGTCCGCCCCCAGAACCAC,209,0.649067142455616,0.7226,0.519336755672098,3
crRNA428:428-450,GATGATTCCCGCCATCAGGTCTT,450,0.649057558875543,0.7214,0.519331433397836,3
crRNA284:284-306,ATCAGCAGCTGAGCCTGAGCGAC,306,0.648043195432835,0.7201,0.518768103159827,3
crRNA097:97-119,GTGAACGCCTCCGGCCCCCAAGC,119,0.647552004502903,0.7189,0.518495318582016,3
crRNA631:649-671,ACTCCTCCACTGGAGCCATCCCG,671,0.647450451891206,0.7177,0.518438920988698,3
crRNA723:741-763,GTGGTAAAGTGGCAACGGCGAAT,763,0.646536295148883,0.7164,0.517931240887515,3
crRNA098:98-120,AGTGAACGCCTCCGGCCCCCAAG,120,0.644700111801993,0.7152,0.516911510129996,3
crRNA633:651-673,TCACTCCTCCACTGGAGCCATCC,673,0.643217672544197,0.7139,0.516088232372964,3
crRNA285:285-307,TATCAGCAGCTGAGCCTGAGCGA,307,0.642697588274915,0.7127,0.515799401779446,3
crRNA174:174-196,CCAGAACCACGCCCCCGTCAAAC,196,0.64235707109644,0.7114,0.515610294389413,3
crRNA221:221-243,CACTCGATTGGCGATGTAGGACC,243,0.642270112719421,0.7102,0.515562001754682,3
crRNA677:695-717,TACTTGCCGCTCTACCCCTGACT,717,0.638971119628327,0.709,0.513729894558236,3
crRNA131:131-153,CCCAGTGGAAACTTCTCGGCTTT,153,0.638106087056042,0.7077,0.513249495734389,3
crRNA563:581-603,TTCCTTGGTCATGCCTTCCCGGT,603,0.63644402555495,0.7065,0.512326464144748,3
crRNA665:683-705,TACCCCTGACTCTGCAATGGCTG,705,0.635780168368571,0.7052,0.511957788765627,3
crRNA128:128-150,AGTGGAAACTTCTCGGCTTTCCC,150,0.635105263969723,0.704,0.511582978278942,3
crRNA027:27-49,TTCTCCTCCGGTACTGCCTCAAA,49,0.633883959518674,0.7027,0.510904722637893,3
crRNA453:453-475,CTTCTTGAGGGTCCCAGCCTGCG,475,0.630775878212001,0.7015,0.509178638959674,3
crRNA724:742-764,GGTGGTAAAGTGGCAACGGCGAA,764,0.629937115440392,0.7002,0.508712829160277,3
crRNA632:650-672,CACTCCTCCACTGGAGCCATCCC,672,0.629826406515916,0.699,0.508651346577063,3
crRNA738:756-778,CCAGGATTCAGGCGGGTGGTAAA,778,0.628600654848436,0.6978,0.507970621159024,3
crRNA777:795-817,TGCATCAGTACAGGGCATCTCTT,817,0.628056934105321,0.6965,0.507668663968205,3
crRNA430:430-452,ATGATGATTCCCGCCATCAGGTC,452,0.626860186687196,0.6953,0.507004046160125,3
crRNA729:747-769,AGGCGGGTGGTAAAGTGGCAACG,769,0.624062887085101,0.694,0.505450556173908,3
crRNA630:648-670,CTCCTCCACTGGAGCCATCCCGC,670,0.621456030565812,0.6928,0.504002829410859,3
crRNA134:134-156,GGTCCCAGTGGAAACTTCTCGGC,156,0.620972817009304,0.6915,0.503734475094905,3
crRNA335:335-357,AATGCTGTGGAAACCGAGCTGGT,357,0.619587716613071,0.6903,0.502965254810513,3
crRNA324:324-346,AACCGAGCTGGTAGGTGACAGCA,346,0.619457303988971,0.6891,0.502892829709726,3
crRNA564:582-604,CTTCCTTGGTCATGCCTTCCCGG,604,0.618399542300152,0.6878,0.502305398105991,3
crRNA015:15-37,ACTGCCTCAAAGCAACTGTCGTA,37,0.617507626083926,0.6866,0.501810069357718,3
crRNA041:41-63,GGTAGCCGCCATCTTTCTCCTCC,63,0.616362213091171,0.6853,0.501173960299898,3
crRNA019:19-41,CGGTACTGCCTCAAAGCAACTGT,41,0.61599768203493,0.6841,0.500971516719986,3
crRNA713:731-753,GGCAACGGCGAATTTGGGTATCT,753,0.615790740663164,0.6828,0.500856591115117,3
crRNA099:99-121,GAGTGAACGCCTCCGGCCCCCAA,121,0.615590680948956,0.6816,0.500745487262517,3
crRNA411:411-433,GGTCTTCCCGGTATCGGTAACAC,433,0.615458139191886,0.6803,0.500671879740388,3
crRNA126:126-148,TGGAAACTTCTCGGCTTTCCCAG,148,0.61399060944694,0.6791,0.499856882032762,3
crRNA455:455-477,TCCTTCTTGAGGGTCCCAGCCTG,477,0.611996370710367,0.6779,0.498749374669207,3
crRNA016:16-38,TACTGCCTCAAAGCAACTGTCGT,38,0.609201676174751,0.6766,0.497197331415648,3
crRNA052:52-74,GCAGCTAGTAAGGTAGCCGCCAT,74,0.608879754316908,0.6754,0.497018551001091,3
crRNA553:571-593,ATGCCTTCCCGGTAGGTAGCATC,593,0.606951876757447,0.6741,0.495947897546226,3
crRNA635:653-675,GATCACTCCTCCACTGGAGCCAT,675,0.606103013450583,0.6729,0.495476478379723,3
crRNA566:584-606,CTCTTCCTTGGTCATGCCTTCCC,606,0.60417696642384,0.6716,0.49440684151752,3
crRNA629:647-669,TCCTCCACTGGAGCCATCCCGCT,669,0.603993922412408,0.6704,0.49430518739417,3
crRNA442:442-464,TCCCAGCCTGCGATGATGATTCC,464,0.603904802849618,0.6692,0.494255694537464,3
crRNA125:125-147,GGAAACTTCTCGGCTTTCCCAGT,147,0.602690169280117,0.6679,0.4935811435935,3
crRNA471:471-493,CTGAGTACACCTGCCCTCCTTCT,493,0.602508322117706,0.6667,0.493480154144385,3
crRNA302:302-324,ATCAGCTACTGCCTGGGTATCAG,324,0.599885419967864,0.6654,0.492023516385042,3
crRNA185:185-207,GGAGTCCGCCCCCAGAACCACGC,207,0.598067318694976,0.6642,0.491013827569713,3
crRNA584:602-624,GGCAGTGAATTGCAGACACTCTT,624,0.596626774511052,0.6629,0.490213816386516,3
crRNA254:254-276,AATGCGGTCGTGAATAGGTGTCA,276,0.595629806884524,0.6617,0.489660146975047,3
crRNA659:677-699,TGACTCTGCAATGGCTGCCAGGC,699,0.595394684949728,0.6604,0.489529571197261,3
crRNA562:580-602,TCCTTGGTCATGCCTTCCCGGTA,602,0.595287169331254,0.6592,0.489469862027554,3
crRNA728:746-768,GGCGGGTGGTAAAGTGGCAACGG,768,0.595054835635898,0.658,0.489340834708162,3
crRNA135:135-157,TGGTCCCAGTGGAAACTTCTCGG,157,0.592471109745605,0.6567,0.487905953619739,3
crRNA671:689-711,CCGCTCTACCCCTGACTCTGCAA,711,0.592384146877066,0.6555,0.487857658490627,3
crRNA193:193-215,GTTGTTCTGGAGTCCGCCCCCAG,215,0.590393030922569,0.6542,0.486751885374873,3
crRNA475:475-497,GGCACTGAGTACACCTGCCCTCC,497,0.588233669011235,0.653,0.485552676286449,3
crRNA452:452-474,TTCTTGAGGGTCCCAGCCTGCGA,474,0.587642494902804,0.6517,0.485224365705463,3
crRNA583:601-623,GCAGTGAATTGCAGACACTCTTC,623,0.587411182296484,0.6505,0.48509590545139,3
crRNA731:749-771,TCAGGCGGGTGGTAAAGTGGCAA,771,0.584756480537922,0.6493,0.483621607669619,3
crRNA612:630-652,CCCGCTCCATGGCCAAAGCGAGA,652,0.5835665009255,0.648,0.482960748385788,3
crRNA614:632-654,ATCCCGCTCCATGGCCAAAGCGA,654,0.583113626784744,0.6468,0.482709243169059,3
crRNA410:410-432,GTCTTCCCGGTATCGGTAACACA,432,0.58310898560405,0.6455,0.482706665673346,3
crRNA598:616-638,AAAGCGAGAGCATTGGCAGTGAA,638,0.582823017816662,0.6443,0.482547852475877,3
crRNA618:636-658,AGCCATCCCGCTCCATGGCCAAA,658,0.582419240198181,0.643,0.482323613182203,3
crRNA247:247-269,TCGTGAATAGGTGTCAGCTTGTC,269,0.582081357354107,0.6418,0.482135968778868,3
crRNA121:121-143,ACTTCTCGGCTTTCCCAGTCTGG,143,0.576544814611896,0.6405,0.479061230662921,3
crRNA260:260-282,GCAGAAAATGCGGTCGTGAATAG,282,0.575708892936235,0.6393,0.478596998675962,3
crRNA667:685-707,TCTACCCCTGACTCTGCAATGGC,707,0.573977825048888,0.6381,0.477635644151605,3
crRNA225:225-247,CAGTCACTCGATTGGCGATGTAG,247,0.573579209748491,0.6368,0.477414271769092,3
crRNA456:456-478,CTCCTTCTTGAGGGTCCCAGCCT,478,0.571357642611708,0.6356,0.476180516794074,3
crRNA048:48-70,CTAGTAAGGTAGCCGCCATCTTT,70,0.570903907490578,0.6343,0.475928533428923,3
crRNA727:745-767,GCGGGTGGTAAAGTGGCAACGGC,767,0.570017340569939,0.6331,0.475436175430412,3
crRNA259:259-281,CAGAAAATGCGGTCGTGAATAGG,281,0.569447459398204,0.6318,0.475119689955291,3
crRNA345:345-367,CATTCAGTTCAATGCTGTGGAAA,367,0.568627374913881,0.6306,0.474664253207189,3
crRNA704:722-744,GAATTTGGGTATCTGGTCTCCCA,744,0.566000946082897,0.6294,0.473205656893305,3
crRNA343:343-365,TTCAGTTCAATGCTGTGGAAACC,365,0.565844663290906,0.6281,0.473118864705513,3
crRNA702:720-742,ATTTGGGTATCTGGTCTCCCAAA,742,0.563987039860382,0.6269,0.472087227123568,3
crRNA521:539-561,ATAGATGTAGGAGCTCCCGGAGC,561,0.563882831115614,0.6256,0.472029354437585,3
crRNA743:761-783,GAATCCCAGGATTCAGGCGGGTG,783,0.563039969638174,0.6244,0.471561268407762,3
crRNA245:245-267,GTGAATAGGTGTCAGCTTGTCAG,267,0.562859399986694,0.6231,0.471460988428749,3
crRNA422:422-444,TCCCGCCATCAGGTCTTCCCGGT,444,0.562786495205172,0.6219,0.471420500506771,3
crRNA549:567-589,CTTCCCGGTAGGTAGCATCAACA,589,0.562636487921187,0.6206,0.471337193444003,3
crRNA002:2-24,AACTGTCGTAAAGCGCTCTGTCA,24,0.56187528083205,0.6194,0.470914454460476,3
crRNA617:635-657,GCCATCCCGCTCCATGGCCAAAG,657,0.561561189834335,0.6182,0.470740022941111,3
crRNA619:637-659,GAGCCATCCCGCTCCATGGCCAA,659,0.560445408880562,0.6169,0.470120370138387,3
crRNA223:223-245,GTCACTCGATTGGCGATGTAGGA,245,0.559629183427754,0.6157,0.469667076516752,3
crRNA419:419-441,CGCCATCAGGTCTTCCCGGTATC,441,0.556804383576813,0.6144,0.468098314172448,3
crRNA233:233-255,CAGCTTGTCAGTCACTCGATTGG,255,0.55405621922641,0.6132,0.466572111617802,3
crRNA239:239-261,AGGTGTCAGCTTGTCAGTCACTC,261,0.553593296126961,0.6119,0.466315025677188,3
crRNA265:265-287,CGACAGCAGAAAATGCGGTCGTG,287,0.552478924117781,0.6107,0.465696155336705,3
crRNA498:516-538,CTCCAATGGCAAAGGACTGCCTT,538,0.551508394054645,0.6095,0.46515716811729,3
crRNA120:120-142,CTTCTCGGCTTTCCCAGTCTGGA,142,0.551226128220298,0.6082,0.465000410812216,3
crRNA573:591-613,GCAGACACTCTTCCTTGGTCATG,613,0.549963124320997,0.607,0.464298997238694,3
crRNA589:607-629,GCATTGGCAGTGAATTGCAGACA,629,0.548772355004746,0.6057,0.463637699390118,3
crRNA308:308-330,GACAGCATCAGCTACTGCCTGGG,330,0.547202568486878,0.6045,0.462765913030809,3
crRNA423:423-445,TTCCCGCCATCAGGTCTTCCCGG,445,0.54682202422938,0.6032,0.462554576464324,3
crRNA054:54-76,GAGCAGCTAGTAAGGTAGCCGCC,76,0.546656507763518,0.602,0.462462656323887,3
crRNA742:760-782,AATCCCAGGATTCAGGCGGGTGG,782,0.544244196624093,0.6007,0.461122971008832,3
crRNA192:192-214,TTGTTCTGGAGTCCGCCCCCAGA,214,0.543513114068142,0.5995,0.460716961788755,3
crRNA666:684-706,CTACCCCTGACTCTGCAATGGCT,706,0.541467050367452,0.5983,0.459580673252553,3
crRNA159:159-181,CGTCAAACTGCACGGCCATGATA,181,0.541057425192687,0.597,0.459353186498319,3
crRNA154:154-176,AACTGCACGGCCATGATAGTGGT,176,0.540523923925059,0.5958,0.459056904728475,3
crRNA714:732-754,TGGCAACGGCGAATTTGGGTATC,754,0.539632085654445,0.5945,0.458561619267566,3
crRNA055:55-77,CGAGCAGCTAGTAAGGTAGCCGC,77,0.539383152589101,0.5933,0.458423373430774,3
crRNA350:350-372,AGGCTCATTCAGTTCAATGCTGT,372,0.538695795532723,0.592,0.458041647317761,3
crRNA035:35-57,CGCCATCTTTCTCCTCCGGTACT,57,0.538506244827633,0.5908,0.457936379679637,3
crRNA486:504-526,AGGACTGCCTTACCATCATACCC,526,0.538274228549869,0.5896,0.4578075286392,3
crRNA383:383-405,CTTAAAGAGGCTGGCTGCTGTGT,405,0.537702045827841,0.5883,0.457489764990182,3
crRNA127:127-149,GTGGAAACTTCTCGGCTTTCCCA,149,0.537119439238296,0.5871,0.457166212410372,3
crRNA018:18-40,GGTACTGCCTCAAAGCAACTGTC,40,0.5362751326278,0.5858,0.456697323820919,3
crRNA344:344-366,ATTCAGTTCAATGCTGTGGAAAC,366,0.534213839849382,0.5846,0.455552577763852,3
crRNA224:224-246,AGTCACTCGATTGGCGATGTAGG,246,0.533786196632584,0.5833,0.455315084627804,3
crRNA571:589-611,AGACACTCTTCCTTGGTCATGCC,611,0.532422263949239,0.5821,0.454557619905804,3
crRNA765:783-805,GGGCATCTCTTATTGCATACTAG,805,0.53182774777822,0.5808,0.454227453298827,3
crRNA149:149-171,CACGGCCATGATAGTGGTCCCAG,171,0.531429724075339,0.5796,0.454006409462035,3
crRNA351:351-373,GAGGCTCATTCAGTTCAATGCTG,373,0.53069039909086,0.5784,0.453595822780835,3
crRNA186:186-208,TGGAGTCCGCCCCCAGAACCACG,208,0.52968063026444,0.5771,0.453035044178835,3
crRNA264:264-286,GACAGCAGAAAATGCGGTCGTGA,286,0.52900002896658,0.5759,0.452657069899627,3
crRNA222:222-244,TCACTCGATTGGCGATGTAGGAC,244,0.528500500150496,0.5746,0.452379654847971,3
crRNA195:195-217,TGGTTGTTCTGGAGTCCGCCCCC,217,0.528334891361748,0.5734,0.4522876834357,3
crRNA155:155-177,AAACTGCACGGCCATGATAGTGG,177,0.527655361126531,0.5721,0.451910303974826,3
crRNA390:390-412,ACATCTCCTTAAAGAGGCTGGCT,412,0.526964701578671,0.5709,0.451526743811774,3
crRNA613:631-653,TCCCGCTCCATGGCCAAAGCGAG,653,0.526169772402271,0.5697,0.451085277150725,3
crRNA191:191-213,TGTTCTGGAGTCCGCCCCCAGAA,213,0.526063837071969,0.5684,0.451026445599508,3
crRNA020:20-42,CCGGTACTGCCTCAAAGCAACTG,42,0.526062144863344,0.5672,0.451025505825609,3
crRNA747:765-787,ACTAGAATCCCAGGATTCAGGCG,787,0.525967192647923,0.5659,0.450972773785139,3
crRNA753:771-793,TTGCATACTAGAATCCCAGGATT,793,0.525586539360535,0.5647,0.450761376668529,3
crRNA726:744-766,CGGGTGGTAAAGTGGCAACGGCG,766,0.52502684263044,0.5634,0.450450547158215,3
crRNA188:188-210,TCTGGAGTCCGCCCCCAGAACCA,210,0.524786444361361,0.5622,0.450317041149978,3
crRNA313:313-335,TAGGTGACAGCATCAGCTACTGC,335,0.524280076311562,0.5609,0.450035827906279,3
crRNA348:348-370,GCTCATTCAGTTCAATGCTGTGG,370,0.522898355559317,0.5597,0.449268484518838,3
crRNA269:269-291,TGAGCGACAGCAGAAAATGCGGT,291,0.522818118933325,0.5585,0.449223924831733,3
crRNA148:148-170,ACGGCCATGATAGTGGTCCCAGT,170,0.522701522415979,0.5572,0.449159172553504,3
crRNA499:517-539,CCTCCAATGGCAAAGGACTGCCT,539,0.522557097357892,0.556,0.449078965599151,3
crRNA266:266-288,GCGACAGCAGAAAATGCGGTCGT,288,0.522378999342487,0.5547,0.448980058251762,3
crRNA044:44-66,TAAGGTAGCCGCCATCTTTCTCC,66,0.521295287675665,0.5535,0.448378215238202,3
crRNA194:194-216,GGTTGTTCTGGAGTCCGCCCCCA,216,0.521218176727673,0.5522,0.44833539140716,3
crRNA418:418-440,GCCATCAGGTCTTCCCGGTATCG,440,0.520963624226684,0.551,0.448194024797393,3
crRNA722:740-762,TGGTAAAGTGGCAACGGCGAATT,762,0.520790181305748,0.5498,0.448097702672779,3
crRNA219:219-241,CTCGATTGGCGATGTAGGACCCA,241,0.519251785099094,0.5485,0.447243349031117,3
crRNA669:687-709,GCTCTACCCCTGACTCTGCAATG,709,0.51860568965746,0.5473,0.446884537698228,3
crRNA739:757-779,CCCAGGATTCAGGCGGGTGGTAA,779,0.518309157885323,0.546,0.446719857755376,3
crRNA651:669-691,CAATGGCTGCCAGGCGGATCACT,691,0.516673134556675,0.5448,0.445811286554648,3
crRNA500:518-540,GCCTCCAATGGCAAAGGACTGCC,540,0.515809402150851,0.5435,0.445331609782731,3
crRNA289:289-311,TGGGTATCAGCAGCTGAGCCTGA,311,0.515582888784048,0.5423,0.445205814802884,3
crRNA347:347-369,CTCATTCAGTTCAATGCTGTGGA,369,0.511397471426004,0.541,0.442881428831146,3
crRNA730:748-770,CAGGCGGGTGGTAAAGTGGCAAC,770,0.511164698096465,0.5398,0.442752157359392,3
crRNA561:579-601,CCTTGGTCATGCCTTCCCGGTAG,601,0.508900598500444,0.5386,0.441494781836377,3
crRNA235:235-257,GTCAGCTTGTCAGTCACTCGATT,257,0.508484391675162,0.5373,0.441263639939818,3
crRNA144:144-166,CCATGATAGTGGTCCCAGTGGAA,166,0.507771570728714,0.5361,0.440867772367591,3
crRNA740:758-780,TCCCAGGATTCAGGCGGGTGGTA,780,0.506565320034155,0.5348,0.440197876882152,3
crRNA232:232-254,AGCTTGTCAGTCACTCGATTGGC,254,0.505300868823303,0.5336,0.439495659539166,3
crRNA752:770-792,TGCATACTAGAATCCCAGGATTC,792,0.504924866233106,0.5323,0.439286845203289,3
crRNA139:139-161,ATAGTGGTCCCAGTGGAAACTTC,161,0.504782414657689,0.5311,0.439207734229346,3
crRNA025:25-47,CTCCTCCGGTACTGCCTCAAAGC,47,0.50459840498345,0.5299,0.439105543821825,3
crRNA606:624-646,CCATGGCCAAAGCGAGAGCATTG,646,0.503952868728029,0.5286,0.438747043034928,3
crRNA559:577-599,TTGGTCATGCCTTCCCGGTAGGT,599,0.503804927020087,0.5274,0.438664883096944,3
crRNA670:688-710,CGCTCTACCCCTGACTCTGCAAT,710,0.50374591191807,0.5261,0.438632108856405,3
crRNA349:349-371,GGCTCATTCAGTTCAATGCTGTG,371,0.502936259367482,0.5249,0.438182465518698,3
crRNA234:234-256,TCAGCTTGTCAGTCACTCGATTG,256,0.502521505859433,0.5236,0.437952130726879,3
crRNA326:326-348,GAAACCGAGCTGGTAGGTGACAG,348,0.500924361948638,0.5224,0.437065151345011,3
crRNA636:654-676,GGATCACTCCTCCACTGGAGCCA,676,0.500700547202596,0.5211,0.436940855053515,3
crRNA066:66-88,GCCCGGCTCCCCGAGCAGCTAGT,88,0.499708399583659,0.5199,0.436389862449893,3
crRNA169:169-191,ACCACGCCCCCGTCAAACTGCAC,191,0.499479369863765,0.5187,0.436262670004674,3
crRNA123:123-145,AAACTTCTCGGCTTTCCCAGTCT,145,0.496509090605748,0.5174,0.434613115169668,3
crRNA242:242-264,AATAGGTGTCAGCTTGTCAGTCA,264,0.495238453171432,0.5162,0.433907462286136,3
crRNA468:468-490,AGTACACCTGCCCTCCTTCTTGA,490,0.495118755473339,0.5149,0.433840987756478,3
crRNA650:668-690,AATGGCTGCCAGGCGGATCACTC,690,0.490613096343307,0.5137,0.43133875441166,3
crRNA281:281-303,AGCAGCTGAGCCTGAGCGACAGC,303,0.490064830230534,0.5124,0.431034272934117,3
crRNA036:36-58,CCGCCATCTTTCTCCTCCGGTAC,58,0.490024801831412,0.5112,0.431012043024545,3
crRNA415:415-437,ATCAGGTCTTCCCGGTATCGGTA,437,0.489864244578634,0.51,0.430922877000206,3
crRNA668:686-708,CTCTACCCCTGACTCTGCAATGG,708,0.487443343660153,0.5087,0.429578421321713,3
crRNA627:645-667,CTCCACTGGAGCCATCCCGCTCC,667,0.484242871131142,0.5075,0.427801027859369,3
crRNA298:298-320,GCTACTGCCTGGGTATCAGCAGC,320,0.484177267238979,0.5062,0.427764594511488,3
crRNA616:634-656,CCATCCCGCTCCATGGCCAAAGC,656,0.482912850163494,0.505,0.427062396125696,3
crRNA158:158-180,GTCAAACTGCACGGCCATGATAG,180,0.482753787018032,0.5037,0.42697405985901,3
crRNA150:150-172,GCACGGCCATGATAGTGGTCCCA,172,0.482673374853356,0.5025,0.426929402685892,3
crRNA129:129-151,CAGTGGAAACTTCTCGGCTTTCC,151,0.480995410067526,0.5012,0.425997539152197,3
crRNA709:727-749,ACGGCGAATTTGGGTATCTGGTC,749,0.479064226600849,0.5,0.424925049750353,3
crRNA230:230-252,CTTGTCAGTCACTCGATTGGCGA,252,0.478693185303022,0.4988,0.424718990685312,3
crRNA283:283-305,TCAGCAGCTGAGCCTGAGCGACA,305,0.47800211571012,0.4975,0.424335202802331,3
crRNA597:615-637,AAGCGAGAGCATTGGCAGTGAAT,637,0.477983832784023,0.4963,0.424325049316237,3
crRNA056:56-78,CCGAGCAGCTAGTAAGGTAGCCG,78,0.477793234744085,0.495,0.424219200037091,3
crRNA246:246-268,CGTGAATAGGTGTCAGCTTGTCA,268,0.477215735869379,0.4938,0.42389848404434,3
crRNA469:469-491,GAGTACACCTGCCCTCCTTCTTG,491,0.477063652915863,0.4925,0.423814024251337,3
crRNA291:291-313,CCTGGGTATCAGCAGCTGAGCCT,313,0.476089616041107,0.4913,0.423273089511988,3
crRNA737:755-777,CAGGATTCAGGCGGGTGGTAAAG,777,0.47486247014414,0.49,0.422591589803792,3
crRNA592:610-632,AGAGCATTGGCAGTGAATTGCAG,632,0.474483533792669,0.4888,0.422381146193468,3
crRNA451:451-473,TCTTGAGGGTCCCAGCCTGCGAT,473,0.473616149646917,0.4876,0.421899441415181,3
crRNA287:287-309,GGTATCAGCAGCTGAGCCTGAGC,309,0.473315749751244,0.4863,0.421732613296577,3
crRNA660:678-700,CTGACTCTGCAATGGCTGCCAGG,700,0.472232915611112,0.4851,0.421131257620493,3
crRNA421:421-443,CCCGCCATCAGGTCTTCCCGGTA,443,0.472175646464914,0.4838,0.421099453002543,3
crRNA599:617-639,CAAAGCGAGAGCATTGGCAGTGA,639,0.471407489174668,0.4826,0.420672854200847,3
crRNA113:113-135,GCTTTCCCAGTCTGGAGTGAACG,135,0.470465670174286,0.4813,0.420149811769201,3
crRNA170:170-192,AACCACGCCCCCGTCAAACTGCA,192,0.469589895201526,0.4801,0.419663447116182,3
crRNA010:10-32,CTCAAAGCAACTGTCGTAAAGCG,32,0.468842903141134,0.4789,0.419248602497918,3
crRNA042:42-64,AGGTAGCCGCCATCTTTCTCCTC,64,0.468605293811938,0.4776,0.419116645337069,3
crRNA454:454-476,CCTTCTTGAGGGTCCCAGCCTGC,476,0.46395341241156,0.4764,0.416533206949868,3
crRNA197:197-219,AGTGGTTGTTCTGGAGTCCGCCC,219,0.463892259770161,0.4751,0.416499245619457,3
crRNA576:594-616,ATTGCAGACACTCTTCCTTGGTC,616,0.462967504853143,0.4739,0.415985679785388,3
crRNA268:268-290,GAGCGACAGCAGAAAATGCGGTC,290,0.460560882925812,0.4726,0.4146491539939,3
crRNA470:470-492,TGAGTACACCTGCCCTCCTTCTT,492,0.460267553814475,0.4714,0.414486252659775,3
crRNA708:726-748,CGGCGAATTTGGGTATCTGGTCT,748,0.458774088053369,0.4701,0.413656851296082,3
crRNA615:633-655,CATCCCGCTCCATGGCCAAAGCG,655,0.456695930325304,0.4689,0.412502739231036,3
crRNA544:562-584,CGGTAGGTAGCATCAACATAGCC,584,0.456621169144807,0.4677,0.41246122035148,3
crRNA043:43-65,AAGGTAGCCGCCATCTTTCTCCT,65,0.454693248775697,0.4664,0.411390543122129,3
crRNA255:255-277,AAATGCGGTCGTGAATAGGTGTC,277,0.453801504510963,0.4652,0.41089530986771,3
crRNA567:585-607,ACTCTTCCTTGGTCATGCCTTCC,607,0.452606603511403,0.4639,0.410231717474551,3
crRNA228:228-250,TGTCAGTCACTCGATTGGCGATG,250,0.452435486895491,0.4627,0.41013668727146,3
crRNA741:759-781,ATCCCAGGATTCAGGCGGGTGGT,781,0.450195280441082,0.4614,0.408892580887083,3
crRNA207:207-229,TGTAGGACCCAGTGGTTGTTCTG,229,0.449250968089661,0.4602,0.408368153764334,3
crRNA017:17-39,GTACTGCCTCAAAGCAACTGTCG,39,0.44833947504479,0.459,0.407861952956722,3
crRNA501:519-541,AGCCTCCAATGGCAAAGGACTGC,541,0.446290755251651,0.4577,0.406724189350414,3
crRNA196:196-218,GTGGTTGTTCTGGAGTCCGCCCC,218,0.445271286661842,0.4565,0.406158023951346,3
crRNA243:243-265,GAATAGGTGTCAGCTTGTCAGTC,265,0.444619277040492,0.4552,0.405795928158344,3
crRNA746:764-786,CTAGAATCCCAGGATTCAGGCGG,786,0.441744177617724,0.454,0.404199231773266,3
crRNA244:244-266,TGAATAGGTGTCAGCTTGTCAGT,266,0.441149485174497,0.4527,0.40386896727291,3
crRNA575:593-615,TTGCAGACACTCTTCCTTGGTCA,615,0.440881937970339,0.4515,0.403720384009898,3
crRNA312:312-334,AGGTGACAGCATCAGCTACTGCC,334,0.440799611363335,0.4502,0.403674663644627,3
crRNA145:145-167,GCCATGATAGTGGTCCCAGTGGA,167,0.440519616042153,0.449,0.403519167276874,3
crRNA299:299-321,AGCTACTGCCTGGGTATCAGCAG,321,0.439657326880519,0.4478,0.403040292015598,3
crRNA250:250-272,CGGTCGTGAATAGGTGTCAGCTT,272,0.439114789837104,0.4465,0.402738992196491,3
crRNA116:116-138,TCGGCTTTCCCAGTCTGGAGTGA,138,0.439079099765778,0.4453,0.402719171592231,3
crRNA173:173-195,CAGAACCACGCCCCCGTCAAACT,195,0.438821650694809,0.444,0.402576196362329,3
crRNA014:14-36,CTGCCTCAAAGCAACTGTCGTAA,36,0.438181215843871,0.4428,0.402220528658016,3
crRNA788:806-828,TTATTAAATTTTGCATCAGTACA,828,0.43631276572281,0.4415,0.401182878436123,3
crRNA363:363-385,TGTGGACCAGTGGAGGCTCATTC,385,0.435334332827031,0.4403,0.400639502351331,3
crRNA171:171-193,GAACCACGCCCCCGTCAAACTGC,193,0.435124221949834,0.4391,0.400522816550683,3
crRNA577:595-617,AATTGCAGACACTCTTCCTTGGT,617,0.43408246805619,0.4378,0.399944274931235,3
crRNA420:420-442,CCGCCATCAGGTCTTCCCGGTAT,442,0.432873002603025,0.4366,0.399272594118511,3
crRNA560:578-600,CTTGGTCATGCCTTCCCGGTAGG,600,0.432019094026495,0.4353,0.39879837304409,3
crRNA084:84-106,GCCCCCAAGCCGGTGCTGGCCCG,106,0.430625566334974,0.4341,0.398024472632181,3
crRNA448:448-470,TGAGGGTCCCAGCCTGCGATGAT,470,0.429423961690493,0.4328,0.397357157346684,3
crRNA382:382-404,TTAAAGAGGCTGGCTGCTGTGTG,404,0.429417757489794,0.4316,0.397353711822418,3
crRNA200:200-222,CCCAGTGGTTGTTCTGGAGTCCG,222,0.428866042017111,0.4303,0.397047314730948,3
crRNA693:711-733,TCTGGTCTCCCAAAAGTACTTGC,733,0.428779774653506,0.4291,0.396999405852901,3
crRNA381:381-403,TAAAGAGGCTGGCTGCTGTGTGG,403,0.427757237182654,0.4279,0.396431536140157,3
crRNA296:296-318,TACTGCCTGGGTATCAGCAGCTG,318,0.427557838321697,0.4266,0.396320799294691,3
crRNA323:323-345,ACCGAGCTGGTAGGTGACAGCAT,345,0.426673343084109,0.4254,0.39582959181251,3
crRNA574:592-614,TGCAGACACTCTTCCTTGGTCAT,614,0.425813172902644,0.4241,0.395351893334183,3
crRNA290:290-312,CTGGGTATCAGCAGCTGAGCCTG,312,0.425660209362204,0.4229,0.395266944504192,3
crRNA117:117-139,CTCGGCTTTCCCAGTCTGGAGTG,139,0.425504864164898,0.4216,0.395180673012844,3
crRNA119:119-141,TTCTCGGCTTTCCCAGTCTGGAG,141,0.424560082318746,0.4204,0.394655985154576,3
crRNA394:394-416,TAACACATCTCCTTAAAGAGGCT,416,0.423367835833382,0.4192,0.393993866955036,3
crRNA096:96-118,TGAACGCCTCCGGCCCCCAAGCC,118,0.423340328828182,0.4179,0.393978590844784,3
crRNA024:24-46,TCCTCCGGTACTGCCTCAAAGCA,46,0.419268377567131,0.4167,0.39171721866153,3
crRNA114:114-136,GGCTTTCCCAGTCTGGAGTGAAC,136,0.418341079820007,0.4154,0.391202240657987,3
crRNA012:12-34,GCCTCAAAGCAACTGTCGTAAAG,34,0.418182996013539,0.4142,0.39111444827059,3
crRNA151:151-173,TGCACGGCCATGATAGTGGTCCC,173,0.418071689325604,0.4129,0.391052633717378,3
crRNA541:559-581,TAGGTAGCATCAACATAGCCATA,581,0.417947177984358,0.4117,0.390983485914385,3
crRNA011:11-33,CCTCAAAGCAACTGTCGTAAAGC,33,0.41728110562289,0.4104,0.390613580330135,3
crRNA047:47-69,TAGTAAGGTAGCCGCCATCTTTC,69,0.416731441376953,0.4092,0.390308322394515,3
crRNA545:563-585,CCGGTAGGTAGCATCAACATAGC,585,0.415255082276398,0.408,0.389488421273787,3
crRNA733:751-773,ATTCAGGCGGGTGGTAAAGTGGC,773,0.41478792171023,0.4067,0.389228982041409,3
crRNA364:364-386,GTGTGGACCAGTGGAGGCTCATT,386,0.413839050137279,0.4055,0.388702022939252,3
crRNA153:153-175,ACTGCACGGCCATGATAGTGGTC,175,0.412870489272369,0.4042,0.388164129320866,3
crRNA760:778-800,TCTCTTATTGCATACTAGAATCC,800,0.412784809711979,0.403,0.388116546881363,3
crRNA208:208-230,ATGTAGGACCCAGTGGTTGTTCT,230,0.411515303172944,0.4017,0.387411522044428,3
crRNA450:450-472,CTTGAGGGTCCCAGCCTGCGATG,472,0.411130906077371,0.4005,0.387198045791023,3
crRNA294:294-316,CTGCCTGGGTATCAGCAGCTGAG,316,0.40925864508671,0.3993,0.386158279189549,3
crRNA143:143-165,CATGATAGTGGTCCCAGTGGAAA,165,0.408892259081457,0.398,0.385954805457302,3
crRNA446:446-468,AGGGTCCCAGCCTGCGATGATGA,468,0.408493266784505,0.3968,0.385733223708451,3
crRNA518:536-558,GATGTAGGAGCTCCCGGAGCCTC,558,0.408397384390973,0.3955,0.385679975090357,3
crRNA300:300-322,CAGCTACTGCCTGGGTATCAGCA,322,0.407347479783956,0.3943,0.385096906944113,3
crRNA732:750-772,TTCAGGCGGGTGGTAAAGTGGCA,772,0.406874036095323,0.393,0.384833978357995,3
crRNA642:660-682,CCAGGCGGATCACTCCTCCACTG,682,0.406647925906155,0.3918,0.384708407284238,3
crRNA270:270-292,CTGAGCGACAGCAGAAAATGCGG,292,0.404048602462683,0.3905,0.383264864040837,3
crRNA507:525-547,TCCCGGAGCCTCCAATGGCAAAG,547,0.403001663697976,0.3893,0.382683442985354,3
crRNA649:667-689,ATGGCTGCCAGGCGGATCACTCC,689,0.402637353413386,0.3881,0.382481122011739,3
crRNA701:719-741,TTTGGGTATCTGGTCTCCCAAAA,741,0.402291417671161,0.3868,0.38228900540363,3
crRNA720:738-760,GTAAAGTGGCAACGGCGAATTTG,760,0.401768352029072,0.3856,0.381998519094436,3
crRNA467:467-489,GTACACCTGCCCTCCTTCTTGAG,489,0.400753979788462,0.3843,0.381435183970483,3
crRNA645:663-685,CTGCCAGGCGGATCACTCCTCCA,685,0.399977698957198,0.3831,0.381004073732252,3
crRNA115:115-137,CGGCTTTCCCAGTCTGGAGTGAA,137,0.398577385901861,0.3818,0.380226405045135,3
crRNA199:199-221,CCAGTGGTTGTTCTGGAGTCCGC,221,0.39783215955668,0.3806,0.379812541022906,3
crRNA579:597-619,TGAATTGCAGACACTCTTCCTTG,619,0.396260579252758,0.3794,0.378939758478322,3
crRNA519:537-559,AGATGTAGGAGCTCCCGGAGCCT,559,0.395714598971695,0.3781,0.378636546445307,3
crRNA295:295-317,ACTGCCTGGGTATCAGCAGCTGA,317,0.39409697684916,0.3769,0.377738194417889,3
crRNA365:365-387,TGTGTGGACCAGTGGAGGCTCAT,387,0.393739560467352,0.3756,0.377539701996972,3
crRNA271:271-293,CCTGAGCGACAGCAGAAAATGCG,293,0.390691414824443,0.3744,0.375846903796435,3
crRNA297:297-319,CTACTGCCTGGGTATCAGCAGCT,319,0.390527170618256,0.3731,0.375755690209798,3
crRNA022:22-44,CTCCGGTACTGCCTCAAAGCAAC,44,0.390292885220606,0.3719,0.375625579005802,3
crRNA700:718-740,TTGGGTATCTGGTCTCCCAAAAG,740,0.389806911736754,0.3706,0.375355691954674,3
crRNA276:276-298,CTGAGCCTGAGCGACAGCAGAAA,298,0.388369783623232,0.3694,0.374557577897962,3
crRNA172:172-194,AGAACCACGCCCCCGTCAAACTG,194,0.388091660729132,0.3682,0.37440312138905,3
crRNA142:142-164,ATGATAGTGGTCCCAGTGGAAAC,164,0.386959809464426,0.3669,0.373774543883697,3
crRNA466:466-488,TACACCTGCCCTCCTTCTTGAGG,488,0.386367701936956,0.3657,0.373445714925227,3
crRNA721:739-761,GGTAAAGTGGCAACGGCGAATTT,761,0.38115539319807,0.3644,0.370551041281808,3
crRNA395:395-417,GTAACACATCTCCTTAAAGAGGC,417,0.379428866328036,0.3632,0.369592208627085,3
crRNA198:198-220,CAGTGGTTGTTCTGGAGTCCGCC,220,0.379271877622322,0.3619,0.369505024407671,3
crRNA412:412-434,AGGTCTTCCCGGTATCGGTAACA,434,0.378327780624338,0.3607,0.368980716882197,3
crRNA231:231-253,GCTTGTCAGTCACTCGATTGGCG,253,0.377894184512067,0.3595,0.368739917785106,3
crRNA211:211-233,GCGATGTAGGACCCAGTGGTTGT,233,0.375944373089429,0.3582,0.367657083283643,3
crRNA580:598-620,GTGAATTGCAGACACTCTTCCTT,620,0.375925398881789,0.357,0.367646545891959,3
crRNA380:380-402,AAAGAGGCTGGCTGCTGTGTGGA,402,0.375461444509457,0.3557,0.367388887230391,3
crRNA277:277-299,GCTGAGCCTGAGCGACAGCAGAA,299,0.375244398733322,0.3545,0.367268350109689,3
crRNA718:736-758,AAAGTGGCAACGGCGAATTTGGG,758,0.374794974217852,0.3532,0.367018760654266,3
crRNA644:662-684,TGCCAGGCGGATCACTCCTCCAC,684,0.371425091450828,0.352,0.365147284631685,3
crRNA136:136-158,GTGGTCCCAGTGGAAACTTCTCG,158,0.369238533257655,0.3507,0.363932971994301,3
crRNA793:811-833,AAACTTTATTAAATTTTGCATCA,833,0.369067448463275,0.3495,0.363837959463407,3
crRNA083:83-105,CCCCCAAGCCGGTGCTGGCCCGG,105,0.368499700690435,0.3483,0.363522658778724,3
crRNA692:710-732,CTGGTCTCCCAAAAGTACTTGCC,732,0.367851667862256,0.347,0.363162771511532,3
crRNA719:737-759,TAAAGTGGCAACGGCGAATTTGG,759,0.365711716085295,0.3458,0.361974341908208,3
crRNA611:629-651,CCGCTCCATGGCCAAAGCGAGAG,651,0.365705679640775,0.3445,0.361970989547915,3
crRNA258:258-280,AGAAAATGCGGTCGTGAATAGGT,280,0.363387555190492,0.3433,0.36068361113567,3
crRNA229:229-251,TTGTCAGTCACTCGATTGGCGAT,251,0.362626762343346,0.342,0.360261102202862,3
crRNA493:511-533,ATGGCAAAGGACTGCCTTACCAT,533,0.361520482519317,0.3408,0.359646725885325,3
crRNA558:576-598,TGGTCATGCCTTCCCGGTAGGTA,598,0.361386523903951,0.3396,0.359572331506052,3
crRNA403:403-425,CGGTATCGGTAACACATCTCCTT,425,0.35933750146958,0.3383,0.358434399826891,3
crRNA640:658-680,AGGCGGATCACTCCTCCACTGGA,680,0.358186854557086,0.3371,0.357795384093684,3
crRNA488:506-528,AAAGGACTGCCTTACCATCATAC,528,0.356412227449844,0.3358,0.356809838806256,3
crRNA227:227-249,GTCAGTCACTCGATTGGCGATGT,249,0.355168512023572,0.3346,0.356119137152787,3
crRNA699:717-739,TGGGTATCTGGTCTCCCAAAAGT,739,0.352773872487984,0.3333,0.3547892658239,3
crRNA317:317-339,CTGGTAGGTGACAGCATCAGCTA,339,0.352095499234614,0.3321,0.354412528896887,3
crRNA366:366-388,CTGTGTGGACCAGTGGAGGCTCA,388,0.351411647085471,0.3308,0.354032749246201,3
crRNA205:205-227,TAGGACCCAGTGGTTGTTCTGGA,227,0.350438231522333,0.3296,0.353492159554404,3
crRNA307:307-329,ACAGCATCAGCTACTGCCTGGGT,329,0.348952611688518,0.3284,0.352667115453505,3
crRNA063:63-85,CGGCTCCCCGAGCAGCTAGTAAG,85,0.348826895552612,0.3271,0.35259729856364,3
crRNA643:661-683,GCCAGGCGGATCACTCCTCCACT,683,0.348762816157699,0.3259,0.352561711850567,3
crRNA214:214-236,TTGGCGATGTAGGACCCAGTGGT,236,0.348762201284677,0.3246,0.352561370378713,3
crRNA319:319-341,AGCTGGTAGGTGACAGCATCAGC,341,0.348688709478032,0.3234,0.352520556450306,3
crRNA517:535-557,ATGTAGGAGCTCCCGGAGCCTCC,557,0.34773086276499,0.3221,0.35198861297313,3
crRNA413:413-435,CAGGTCTTCCCGGTATCGGTAAC,435,0.346264513027565,0.3209,0.351174270586753,3
crRNA447:447-469,GAGGGTCCCAGCCTGCGATGATG,469,0.34583163994911,0.3197,0.350933873028987,3
crRNA610:628-650,CGCTCCATGGCCAAAGCGAGAGC,650,0.345185722720083,0.3184,0.350575160667084,3
crRNA594:612-634,CGAGAGCATTGGCAGTGAATTGC,634,0.345040763947556,0.3172,0.350494657312575,3
crRNA407:407-429,TTCCCGGTATCGGTAACACATCT,429,0.344980315641501,0.3159,0.350461087137228,3
crRNA495:513-535,CAATGGCAAAGGACTGCCTTACC,535,0.344019291240551,0.3147,0.349927378920108,3
crRNA766:784-806,AGGGCATCTCTTATTGCATACTA,806,0.343966015309947,0.3134,0.349897791948216,3
crRNA069:69-91,CTGGCCCGGCTCCCCGAGCAGCT,91,0.343378950623924,0.3122,0.349571763549144,3
crRNA100:100-122,GGAGTGAACGCCTCCGGCCCCCA,122,0.342209792995847,0.3109,0.348922467826166,3
crRNA106:106-128,CAGTCTGGAGTGAACGCCTCCGG,128,0.342195784680563,0.3097,0.348914688259937,3
crRNA293:293-315,TGCCTGGGTATCAGCAGCTGAGC,315,0.339015098317773,0.3085,0.347148283113277,3
crRNA280:280-302,GCAGCTGAGCCTGAGCGACAGCA,302,0.338247053720949,0.3072,0.346721746896262,3
crRNA292:292-314,GCCTGGGTATCAGCAGCTGAGCC,314,0.337086320557583,0.306,0.346077129728831,3
crRNA520:538-560,TAGATGTAGGAGCTCCCGGAGCC,560,0.337055287425642,0.3047,0.346059895371927,3
crRNA555:573-595,TCATGCCTTCCCGGTAGGTAGCA,595,0.337018527542566,0.3035,0.346039480644019,3
crRNA509:527-549,GCTCCCGGAGCCTCCAATGGCAA,549,0.336320875737855,0.3022,0.345652037306998,3
crRNA657:675-697,ACTCTGCAATGGCTGCCAGGCGG,697,0.336256938048543,0.301,0.345616529290619,3
crRNA267:267-289,AGCGACAGCAGAAAATGCGGTCG,289,0.335268167690719,0.2998,0.34506741226061,3
crRNA551:569-591,GCCTTCCCGGTAGGTAGCATCAA,591,0.332959336588418,0.2985,0.343785194941234,3
crRNA734:752-774,GATTCAGGCGGGTGGTAAAGTGG,774,0.332697294482817,0.2973,0.343639668953702,3
crRNA278:278-300,AGCTGAGCCTGAGCGACAGCAGA,300,0.330227886012376,0.296,0.342268274438851,3
crRNA103:103-125,TCTGGAGTGAACGCCTCCGGCCC,125,0.329642868474159,0.2948,0.341943382930375,3
crRNA065:65-87,CCCGGCTCCCCGAGCAGCTAGTA,87,0.328249557052366,0.2935,0.341169602624606,3
crRNA215:215-237,ATTGGCGATGTAGGACCCAGTGG,237,0.327155323550188,0.2923,0.340561916273476,3
crRNA140:140-162,GATAGTGGTCCCAGTGGAAACTT,162,0.326840196786433,0.291,0.340386909537867,3
crRNA429:429-451,TGATGATTCCCGCCATCAGGTCT,451,0.325585912685645,0.2898,0.339690338534538,3
crRNA487:505-527,AAGGACTGCCTTACCATCATACC,527,0.324700540304779,0.2886,0.339198643927811,3
crRNA279:279-301,CAGCTGAGCCTGAGCGACAGCAG,301,0.324463416074936,0.2873,0.339066956168561,3
crRNA641:659-681,CAGGCGGATCACTCCTCCACTGG,681,0.324462662872125,0.2861,0.339066537874781,3
crRNA377:377-399,GAGGCTGGCTGCTGTGTGGACCA,399,0.324015017466017,0.2848,0.338817936453881,3
crRNA458:458-480,CCCTCCTTCTTGAGGGTCCCAGC,480,0.323950488207388,0.2836,0.33878209990744,3
crRNA502:520-542,GAGCCTCCAATGGCAAAGGACTG,542,0.32311985766562,0.2823,0.338320806369946,3
crRNA206:206-228,GTAGGACCCAGTGGTTGTTCTGG,228,0.322249368484304,0.2811,0.337837377199444,3
crRNA286:286-308,GTATCAGCAGCTGAGCCTGAGCG,308,0.322041580378991,0.2799,0.337721981358178,3
crRNA068:68-90,TGGCCCGGCTCCCCGAGCAGCTA,90,0.322035358218491,0.2786,0.337718525859874,3
crRNA275:275-297,TGAGCCTGAGCGACAGCAGAAAA,297,0.321707560447492,0.2774,0.337536482236671,3
crRNA605:623-645,CATGGCCAAAGCGAGAGCATTGG,645,0.320946973274458,0.2761,0.33711408752569,3
crRNA321:321-343,CGAGCTGGTAGGTGACAGCATCA,343,0.318969340892608,0.2749,0.336015802558531,3
crRNA311:311-333,GGTGACAGCATCAGCTACTGCCT,333,0.317854012631715,0.2736,0.33539640116036,3
crRNA261:261-283,AGCAGAAAATGCGGTCGTGAATA,283,0.315882172924625,0.2724,0.334301333175116,3
crRNA257:257-279,GAAAATGCGGTCGTGAATAGGTG,279,0.314017758509585,0.2711,0.333265924196488,3
crRNA189:189-211,TTCTGGAGTCCGCCCCCAGAACC,211,0.312157434928251,0.2699,0.332232787076474,3
crRNA141:141-163,TGATAGTGGTCCCAGTGGAAACT,163,0.309265396660455,0.2687,0.33062668364536,3
crRNA316:316-338,TGGTAGGTGACAGCATCAGCTAC,338,0.304973706369933,0.2674,0.328243278633872,3
crRNA209:209-231,GATGTAGGACCCAGTGGTTGTTC,231,0.304788739214661,0.2662,0.328140556485955,3
crRNA735:753-775,GGATTCAGGCGGGTGGTAAAGTG,775,0.304741497868084,0.2649,0.328114320841125,3
crRNA330:330-352,TGTGGAAACCGAGCTGGTAGGTG,352,0.303153172049789,0.2637,0.327232238617354,3
crRNA449:449-471,TTGAGGGTCCCAGCCTGCGATGA,471,0.301219175027537,0.2624,0.326158186697713,3
crRNA717:735-757,AAGTGGCAACGGCGAATTTGGGT,757,0.300873872837769,0.2612,0.325966421935146,3
crRNA356:356-378,CAGTGGAGGCTCATTCAGTTCAA,378,0.298577758073122,0.26,0.324691266677765,3
crRNA554:572-594,CATGCCTTCCCGGTAGGTAGCAT,594,0.29441588068398,0.2587,0.322379953708982,2
crRNA369:369-391,CTGCTGTGTGGACCAGTGGAGGC,391,0.292934752876425,0.2575,0.321557404270366,2
crRNA304:304-326,GCATCAGCTACTGCCTGGGTATC,326,0.292426262742685,0.2562,0.321275012520028,2
crRNA556:574-596,GTCATGCCTTCCCGGTAGGTAGC,596,0.291511711020879,0.255,0.320767113065626,2
crRNA203:203-225,GGACCCAGTGGTTGTTCTGGAGT,225,0.288497813201095,0.2537,0.319093334511835,2
crRNA408:408-430,CTTCCCGGTATCGGTAACACATC,430,0.28591839764199,0.2525,0.31766084718071,2
crRNA147:147-169,CGGCCATGATAGTGGTCCCAGTG,169,0.285566932600432,0.2512,0.317465659857137,2
crRNA320:320-342,GAGCTGGTAGGTGACAGCATCAG,342,0.281195614701345,0.25,0.315038033378473,2
crRNA489:507-529,CAAAGGACTGCCTTACCATCATA,529,0.280948664187898,0.2488,0.314900888558718,2
crRNA102:102-124,CTGGAGTGAACGCCTCCGGCCCC,124,0.279742929697026,0.2475,0.314231279748777,2
crRNA327:327-349,GGAAACCGAGCTGGTAGGTGACA,349,0.279444530827018,0.2463,0.314065562906681,2
crRNA305:305-327,AGCATCAGCTACTGCCTGGGTAT,327,0.27620619340765,0.245,0.312267141046824,2
crRNA328:328-350,TGGAAACCGAGCTGGTAGGTGAC,350,0.27525069082337,0.2438,0.311736499389644,2
crRNA210:210-232,CGATGTAGGACCCAGTGGTTGTT,232,0.274728323263117,0.2425,0.311446400762608,2
crRNA609:627-649,GCTCCATGGCCAAAGCGAGAGCA,649,0.273506154254098,0.2413,0.310767664986307,2
crRNA379:379-401,AAGAGGCTGGCTGCTGTGTGGAC,401,0.273107210157996,0.24,0.310546110005964,2
crRNA212:212-234,GGCGATGTAGGACCCAGTGGTTG,234,0.271912845003339,0.2388,0.309882815196121,2
crRNA067:67-89,GGCCCGGCTCCCCGAGCAGCTAG,89,0.271711186217319,0.2376,0.309770823293473,2
crRNA409:409-431,TCTTCCCGGTATCGGTAACACAT,431,0.269891655192928,0.2363,0.308760340460714,2
crRNA402:402-424,GGTATCGGTAACACATCTCCTTA,424,0.269781613528634,0.2351,0.308699228442745,2
crRNA329:329-351,GTGGAAACCGAGCTGGTAGGTGA,351,0.268889742295003,0.2338,0.308203924675711,2
crRNA550:568-590,CCTTCCCGGTAGGTAGCATCAAC,590,0.268651706961232,0.2326,0.308071730931751,2
crRNA318:318-340,GCTGGTAGGTGACAGCATCAGCT,340,0.268413800286903,0.2313,0.307939608639256,2
crRNA601:619-641,GCCAAAGCGAGAGCATTGGCAGT,641,0.265093793670106,0.2301,0.306095831508803,2
crRNA256:256-278,AAAATGCGGTCGTGAATAGGTGT,278,0.264735169735702,0.2289,0.305896668469386,2
crRNA490:508-530,GCAAAGGACTGCCTTACCATCAT,530,0.26435059894789,0.2276,0.305683095755397,2
crRNA794:812-834,CAAACTTTATTAAATTTTGCATC,834,0.25948143802788,0.2264,0.302978990437237,2
crRNA274:274-296,GAGCCTGAGCGACAGCAGAAAAT,296,0.259354926618643,0.2251,0.302908731889585,2
crRNA736:754-776,AGGATTCAGGCGGGTGGTAAAGT,776,0.258890810505637,0.2239,0.302650983404776,2
crRNA378:378-400,AGAGGCTGGCTGCTGTGTGGACC,400,0.258385353543909,0.2226,0.302370276136981,2
crRNA303:303-325,CATCAGCTACTGCCTGGGTATCA,325,0.258354396114925,0.2214,0.302353083821975,2
crRNA105:105-127,AGTCTGGAGTGAACGCCTCCGGC,127,0.257954911024391,0.2201,0.302131228398508,2
crRNA094:94-116,AACGCCTCCGGCCCCCAAGCCGG,116,0.25578128751572,0.2189,0.300924099082793,2
crRNA465:465-487,ACACCTGCCCTCCTTCTTGAGGG,487,0.255533271148087,0.2177,0.300786362337238,2
crRNA457:457-479,CCTCCTTCTTGAGGGTCCCAGCC,479,0.253992612815566,0.2164,0.299930752416169,2
crRNA715:733-755,GTGGCAACGGCGAATTTGGGTAT,755,0.252434327849384,0.2152,0.299065353483276,2
crRNA118:118-140,TCTCGGCTTTCCCAGTCTGGAGT,140,0.252258686216579,0.2139,0.29896781029644,2
crRNA373:373-395,CTGGCTGCTGTGTGGACCAGTGG,395,0.252180840836663,0.2127,0.298924578596095,2
crRNA552:570-592,TGCCTTCCCGGTAGGTAGCATCA,592,0.251880613353905,0.2114,0.298757846227598,2
crRNA658:676-698,GACTCTGCAATGGCTGCCAGGCG,698,0.251658705343088,0.2102,0.298634608848089,2
crRNA625:643-665,CCACTGGAGCCATCCCGCTCCAT,665,0.250284763455368,0.209,0.297871585479902,2
crRNA101:101-123,TGGAGTGAACGCCTCCGGCCCCC,123,0.250177905926312,0.2077,0.297812241782425,2
crRNA536:554-576,AGCATCAACATAGCCATAGATGT,576,0.250101842011899,0.2065,0.297769999425094,2
crRNA492:510-532,TGGCAAAGGACTGCCTTACCATC,532,0.249520699363361,0.2052,0.297447259849973,2
crRNA334:334-356,ATGCTGTGGAAACCGAGCTGGTA,356,0.24883483378018,0.204,0.297066362031747,2
crRNA626:644-666,TCCACTGGAGCCATCCCGCTCCA,666,0.246989395946869,0.2027,0.296041491763262,2
crRNA371:371-393,GGCTGCTGTGTGGACCAGTGGAG,393,0.246509048320886,0.2015,0.295774729051713,2
crRNA071:71-93,TGCTGGCCCGGCTCCCCGAGCAG,93,0.24636523197559,0.2002,0.295694860148109,2
crRNA331:331-353,CTGTGGAAACCGAGCTGGTAGGT,353,0.246133258332854,0.199,0.295566032785181,2
crRNA591:609-631,GAGCATTGGCAGTGAATTGCAGA,631,0.245995662943423,0.1978,0.295489618710883,2
crRNA353:353-375,TGGAGGCTCATTCAGTTCAATGC,375,0.244999904108459,0.1965,0.29493662060598,2
crRNA152:152-174,CTGCACGGCCATGATAGTGGTCC,174,0.244562171964213,0.1953,0.29469352454926,2
crRNA367:367-389,GCTGTGTGGACCAGTGGAGGCTC,389,0.244083608040512,0.194,0.29442775242293,2
crRNA716:734-756,AGTGGCAACGGCGAATTTGGGTA,756,0.24169115452448,0.1928,0.293099095107545,2
crRNA370:370-392,GCTGCTGTGTGGACCAGTGGAGG,392,0.241382078470605,0.1915,0.292927448654547,2
crRNA648:666-688,TGGCTGCCAGGCGGATCACTCCT,688,0.239100226468165,0.1903,0.291660214271371,2
crRNA306:306-328,CAGCATCAGCTACTGCCTGGGTA,328,0.238502083315977,0.1891,0.291328033407887,2
crRNA401:401-423,GTATCGGTAACACATCTCCTTAA,423,0.237346775433788,0.1878,0.290686429189078,2
crRNA653:671-693,TGCAATGGCTGCCAGGCGGATCA,693,0.236929072200888,0.1866,0.290454456257385,2
crRNA508:526-548,CTCCCGGAGCCTCCAATGGCAAA,548,0.233844560934238,0.1853,0.288741462282222,2
crRNA511:529-551,GAGCTCCCGGAGCCTCCAATGGC,551,0.233427385373472,0.1841,0.28850978239507,2
crRNA764:782-804,GGCATCTCTTATTGCATACTAGA,804,0.233400430649746,0.1828,0.288494812996241,2
crRNA104:104-126,GTCTGGAGTGAACGCCTCCGGCC,126,0.232052287785845,0.1816,0.287746117204953,2
crRNA510:528-550,AGCTCCCGGAGCCTCCAATGGCA,550,0.231340251639996,0.1803,0.287350685474447,2
crRNA204:204-226,AGGACCCAGTGGTTGTTCTGGAG,226,0.228800705576112,0.1791,0.285940339805064,2
crRNA075:75-97,CCGGTGCTGGCCCGGCTCCCCGA,97,0.228261998791851,0.1779,0.285641167133596,2
crRNA546:564-586,CCCGGTAGGTAGCATCAACATAG,586,0.227027490728884,0.1766,0.284955578821108,2
crRNA491:509-531,GGCAAAGGACTGCCTTACCATCA,531,0.225474978856192,0.1754,0.284093385995605,2
crRNA445:445-467,GGGTCCCAGCCTGCGATGATGAT,467,0.222474836853521,0.1741,0.282427246782312,2
crRNA776:794-816,GCATCAGTACAGGGCATCTCTTA,816,0.221793939905643,0.1729,0.282049108312847,2
crRNA654:672-694,CTGCAATGGCTGCCAGGCGGATC,694,0.219898694741983,0.1716,0.280996577371589,2
crRNA557:575-597,GGTCATGCCTTCCCGGTAGGTAG,597,0.219483745627935,0.1704,0.280766133949304,2
crRNA414:414-436,TCAGGTCTTCCCGGTATCGGTAA,436,0.216911968960594,0.1692,0.279337888903079,2
crRNA534:552-574,CATCAACATAGCCATAGATGTAG,574,0.216098247122831,0.1679,0.278885985672698,2
crRNA062:62-84,GGCTCCCCGAGCAGCTAGTAAGG,84,0.215450832266871,0.1667,0.27852644159851,2
crRNA624:642-664,CACTGGAGCCATCCCGCTCCATG,664,0.212654535353017,0.1654,0.276973508458668,2
crRNA368:368-390,TGCTGTGTGGACCAGTGGAGGCT,390,0.209973326130795,0.1642,0.275484489665488,2
crRNA072:72-94,GTGCTGGCCCGGCTCCCCGAGCA,94,0.209844282678202,0.1629,0.275412824938821,2
crRNA761:779-801,ATCTCTTATTGCATACTAGAATC,801,0.207081463856842,0.1617,0.273878483973163,2
crRNA201:201-223,ACCCAGTGGTTGTTCTGGAGTCC,223,0.20618581551708,0.1604,0.273381082577206,2
crRNA656:674-696,CTCTGCAATGGCTGCCAGGCGGA,696,0.205601044660791,0.1592,0.273056328064391,2
crRNA376:376-398,AGGCTGGCTGCTGTGTGGACCAG,398,0.204979650578781,0.158,0.272711234716802,2
crRNA639:657-679,GGCGGATCACTCCTCCACTGGAG,679,0.204823221885921,0.1567,0.272624361502458,2
crRNA360:360-382,GGACCAGTGGAGGCTCATTCAGT,382,0.201464273232498,0.1555,0.270758957777595,2
crRNA082:82-104,CCCCAAGCCGGTGCTGGCCCGGC,104,0.200715651111497,0.1542,0.270343207899546,2
crRNA156:156-178,CAAACTGCACGGCCATGATAGTG,178,0.19950381124585,0.153,0.269670208448658,2
crRNA093:93-115,ACGCCTCCGGCCCCCAAGCCGGT,115,0.197461700271094,0.1517,0.268536115072442,2
crRNA059:59-81,TCCCCGAGCAGCTAGTAAGGTAG,81,0.197197749937654,0.1505,0.268389529343995,2
crRNA637:655-677,CGGATCACTCCTCCACTGGAGCC,677,0.197073263649112,0.1493,0.268320395454108,2
crRNA503:521-543,GGAGCCTCCAATGGCAAAGGACT,543,0.196513438680683,0.148,0.268009494726193,2
crRNA060:60-82,CTCCCCGAGCAGCTAGTAAGGTA,82,0.194587966880877,0.1468,0.266940177318254,2
crRNA361:361-383,TGGACCAGTGGAGGCTCATTCAG,383,0.194364195060936,0.1455,0.266815904865917,2
crRNA157:157-179,TCAAACTGCACGGCCATGATAGT,179,0.193756614612255,0.1443,0.266478482967261,2
crRNA638:656-678,GCGGATCACTCCTCCACTGGAGC,678,0.192658436647204,0.143,0.265868606045064,2
crRNA064:64-86,CCGGCTCCCCGAGCAGCTAGTAA,86,0.188643932461158,0.1418,0.263639137293137,2
crRNA646:664-686,GCTGCCAGGCGGATCACTCCTCC,686,0.188466392403023,0.1405,0.263540539809243,2
crRNA021:21-43,TCCGGTACTGCCTCAAAGCAACT,43,0.187774736575355,0.1393,0.263156426358761,2
crRNA596:614-636,AGCGAGAGCATTGGCAGTGAATT,636,0.18663685391704,0.1381,0.262524499298157,2
crRNA506:524-546,CCCGGAGCCTCCAATGGCAAAGG,546,0.18449058314501,0.1368,0.261332560419117,2
crRNA593:611-633,GAGAGCATTGGCAGTGAATTGCA,633,0.1836375650109,0.1356,0.260858833854967,2
crRNA332:332-354,GCTGTGGAAACCGAGCTGGTAGG,354,0.180525235277303,0.1343,0.259130390798197,2
crRNA460:460-482,TGCCCTCCTTCTTGAGGGTCCCA,482,0.178676710102113,0.1331,0.258103805963745,2
crRNA061:61-83,GCTCCCCGAGCAGCTAGTAAGGT,83,0.17544377547409,0.1318,0.256308384562704,2
crRNA461:461-483,CTGCCCTCCTTCTTGAGGGTCCC,483,0.174661421596734,0.1306,0.255873901637371,2
crRNA138:138-160,TAGTGGTCCCAGTGGAAACTTCT,160,0.17430810176945,0.1294,0.255677684252145,2
crRNA647:665-687,GGCTGCCAGGCGGATCACTCCTC,687,0.172883322370494,0.1281,0.254886428096676,2
crRNA089:89-111,CTCCGGCCCCCAAGCCGGTGCTG,111,0.170796583002918,0.1269,0.253727550188517,2
crRNA314:314-336,GTAGGTGACAGCATCAGCTACTG,336,0.170687415598596,0.1256,0.25366692369384,2
crRNA333:333-355,TGCTGTGGAAACCGAGCTGGTAG,355,0.170211793554309,0.1244,0.253402785350392,2
crRNA768:786-808,ACAGGGCATCTCTTATTGCATAC,808,0.169005678332624,0.1231,0.252732965100281,2
crRNA272:272-294,GCCTGAGCGACAGCAGAAAATGC,294,0.168483830640686,0.1219,0.252443155183907,2
crRNA548:566-588,TTCCCGGTAGGTAGCATCAACAT,588,0.167805124557719,0.1206,0.252066233418829,2
crRNA462:462-484,CCTGCCCTCCTTCTTGAGGGTCC,484,0.167777059360455,0.1194,0.252050647314689,2
crRNA516:534-556,TGTAGGAGCTCCCGGAGCCTCCA,556,0.163538263177291,0.1182,0.249696617228234,2
crRNA595:613-635,GCGAGAGCATTGGCAGTGAATTG,635,0.163394322859979,0.1169,0.249616679476343,2
crRNA443:443-465,GTCCCAGCCTGCGATGATGATTC,465,0.159885744232331,0.1157,0.247668178228989,2
crRNA459:459-481,GCCCTCCTTCTTGAGGGTCCCAG,481,0.159539610812873,0.1144,0.247475951840146,2
crRNA315:315-337,GGTAGGTGACAGCATCAGCTACT,337,0.156460302007207,0.1132,0.245765847069642,2
crRNA355:355-377,AGTGGAGGCTCATTCAGTTCAAT,377,0.153349207091829,0.1119,0.244038089773431,2
crRNA213:213-235,TGGCGATGTAGGACCCAGTGGTT,235,0.15313093928885,0.1107,0.243916873995905,2
crRNA354:354-376,GTGGAGGCTCATTCAGTTCAATG,376,0.151496005698095,0.1095,0.243008907984876,2
crRNA146:146-168,GGCCATGATAGTGGTCCCAGTGG,168,0.149433796699492,0.1082,0.241863653101768,2
crRNA090:90-112,CCTCCGGCCCCCAAGCCGGTGCT,112,0.14712013374046,0.107,0.240578752394084,2
crRNA463:463-485,ACCTGCCCTCCTTCTTGAGGGTC,485,0.146491276652233,0.1057,0.24022951444024,2
crRNA085:85-107,GGCCCCCAAGCCGGTGCTGGCCC,107,0.146155778423989,0.1045,0.240043194341535,2
crRNA464:464-486,CACCTGCCCTCCTTCTTGAGGGT,486,0.145886464355636,0.1032,0.239893629844397,2
crRNA058:58-80,CCCCGAGCAGCTAGTAAGGTAGC,80,0.144605658862544,0.102,0.239182330094338,2
crRNA137:137-159,AGTGGTCCCAGTGGAAACTTCTC,159,0.143980692361729,0.1007,0.238835252791638,2
crRNA515:533-555,GTAGGAGCTCCCGGAGCCTCCAA,555,0.143623609076574,0.0995,0.238636945357098,2
crRNA374:374-396,GCTGGCTGCTGTGTGGACCAGTG,396,0.142337031862238,0.09826,0.237922440261731,2
crRNA362:362-384,GTGGACCAGTGGAGGCTCATTCA,384,0.142252387738827,0.09701,0.237875432855726,2
crRNA514:532-554,TAGGAGCTCCCGGAGCCTCCAAT,554,0.141374376051101,0.09577,0.237387826035334,2
crRNA400:400-422,TATCGGTAACACATCTCCTTAAA,422,0.139856018177681,0.09453,0.236544600751175,2
crRNA013:13-35,TGCCTCAAAGCAACTGTCGTAAA,35,0.138148870080434,0.09328,0.235596530164787,2
crRNA081:81-103,CCCAAGCCGGTGCTGGCCCGGCT,103,0.137289374818848,0.09204,0.235119206505543,2
crRNA655:673-695,TCTGCAATGGCTGCCAGGCGGAT,695,0.13652605056138,0.0908,0.234695291745278,2
crRNA023:23-45,CCTCCGGTACTGCCTCAAAGCAA,45,0.13645693577778,0.08955,0.234656908611722,2
crRNA602:620-642,GGCCAAAGCGAGAGCATTGGCAG,642,0.134299656524955,0.08831,0.233458856134888,2
crRNA396:396-418,GGTAACACATCTCCTTAAAGAGG,418,0.133431090357622,0.08706,0.232976494916838,2
crRNA620:638-660,GGAGCCATCCCGCTCCATGGCCA,660,0.133196807314237,0.08582,0.232846385020291,2
crRNA357:357-379,CCAGTGGAGGCTCATTCAGTTCA,379,0.130728025092751,0.08458,0.231475338294958,2
crRNA504:522-544,CGGAGCCTCCAATGGCAAAGGAC,544,0.129370142952068,0.08333,0.230721233762703,2
crRNA087:87-109,CCGGCCCCCAAGCCGGTGCTGGC,109,0.127037004140175,0.08209,0.229425517072931,2
crRNA767:785-807,CAGGGCATCTCTTATTGCATACT,807,0.124220291389569,0.08085,0.227861245927702,2
crRNA288:288-310,GGGTATCAGCAGCTGAGCCTGAG,310,0.122310475055459,0.0796,0.226800622836657,2
crRNA190:190-212,GTTCTGGAGTCCGCCCCCAGAAC,212,0.12125691559855,0.07836,0.226215524956914,2
crRNA088:88-110,TCCGGCCCCCAAGCCGGTGCTGG,110,0.114414887448077,0.07711,0.22241578101486,2
crRNA078:78-100,AAGCCGGTGCTGGCCCGGCTCCC,100,0.111603444936615,0.07587,0.220854436715126,2
crRNA375:375-397,GGCTGGCTGCTGTGTGGACCAGT,397,0.108125363846136,0.07463,0.218922872380271,2
crRNA086:86-108,CGGCCCCCAAGCCGGTGCTGGCC,108,0.107578287980029,0.07338,0.218619051910322,2
crRNA301:301-323,TCAGCTACTGCCTGGGTATCAGC,323,0.106151971867183,0.07214,0.217826942335492,2
crRNA057:57-79,CCCGAGCAGCTAGTAAGGTAGCC,79,0.101384322176297,0.0709,0.215179211628694,2
crRNA077:77-99,AGCCGGTGCTGGCCCGGCTCCCC,99,0.0998951161253348,0.06965,0.214352175909728,2
crRNA623:641-663,ACTGGAGCCATCCCGCTCCATGG,663,0.098471455837018,0.06841,0.213561541256215,2
crRNA358:358-380,ACCAGTGGAGGCTCATTCAGTTC,380,0.0981352345825772,0.06716,0.213374819622417,2
crRNA352:352-374,GGAGGCTCATTCAGTTCAATGCT,374,0.0962935711340214,0.06592,0.212352045471529,2
crRNA359:359-381,GACCAGTGGAGGCTCATTCAGTT,381,0.0937915385758742,0.06468,0.210962533056999,2
crRNA372:372-394,TGGCTGCTGTGTGGACCAGTGGA,394,0.0890599417963636,0.06343,0.208334824458936,2
crRNA092:92-114,CGCCTCCGGCCCCCAAGCCGGTG,114,0.0876127663301085,0.06219,0.207531130570215,2
crRNA074:74-96,CGGTGCTGGCCCGGCTCCCCGAG,96,0.0847713058051934,0.06095,0.205953115663131,2
crRNA080:80-102,CCAAGCCGGTGCTGGCCCGGCTC,102,0.0775937755151954,0.0597,0.201967049450228,2
crRNA694:712-734,ATCTGGTCTCCCAAAAGTACTTG,734,0.0772907155292655,0.05846,0.201798744041321,2
crRNA547:565-587,TCCCGGTAGGTAGCATCAACATA,587,0.0765113058636543,0.05721,0.20136589619414,2
crRNA399:399-421,ATCGGTAACACATCTCCTTAAAG,421,0.0757029910685708,0.05597,0.200916995783568,2
crRNA771:789-811,AGTACAGGGCATCTCTTATTGCA,811,0.0751525270606013,0.05473,0.200611293697344,2
crRNA604:622-644,ATGGCCAAAGCGAGAGCATTGGC,644,0.0736953965141855,0.05348,0.199802071220505,2
crRNA322:322-344,CCGAGCTGGTAGGTGACAGCATC,344,0.0679867625986068,0.05224,0.196631761677621,2
crRNA045:45-67,GTAAGGTAGCCGCCATCTTTCTC,67,0.0664018029384987,0.051,0.195751548861414,2
crRNA091:91-113,GCCTCCGGCCCCCAAGCCGGTGC,113,0.0637336691970971,0.04975,0.194269791581625,2
crRNA513:531-553,AGGAGCTCCCGGAGCCTCCAATG,553,0.0633009910045773,0.04851,0.194029502254436,2
crRNA769:787-809,TACAGGGCATCTCTTATTGCATA,809,0.0616696322299779,0.04726,0.193123521529894,2
crRNA622:640-662,CTGGAGCCATCCCGCTCCATGGC,662,0.060732084365638,0.04602,0.192602851088387,2
crRNA505:523-545,CCGGAGCCTCCAATGGCAAAGGA,545,0.0599738323004218,0.04478,0.19218175318759,2
crRNA652:670-692,GCAATGGCTGCCAGGCGGATCAC,692,0.0597268032273747,0.04353,0.19204456473949,2
crRNA398:398-420,TCGGTAACACATCTCCTTAAAGA,420,0.0593610745354653,0.04229,0.191841456048477,2
crRNA770:788-810,GTACAGGGCATCTCTTATTGCAT,810,0.0568068865947914,0.04104,0.190422978962297,2
crRNA775:793-815,CATCAGTACAGGGCATCTCTTAT,815,0.056393922256624,0.0398,0.190193637792146,2
crRNA076:76-98,GCCGGTGCTGGCCCGGCTCCCCG,98,0.0509579099497579,0.03856,0.187174729600352,2
crRNA698:716-738,GGGTATCTGGTCTCCCAAAAGTA,738,0.0494424438138239,0.03731,0.186333110252585,2
crRNA079:79-101,CAAGCCGGTGCTGGCCCGGCTCC,101,0.0488248943806824,0.03607,0.185990152044011,2
crRNA621:639-661,TGGAGCCATCCCGCTCCATGGCC,661,0.0481243310006205,0.03483,0.185601091753572,2
crRNA603:621-643,TGGCCAAAGCGAGAGCATTGGCA,643,0.0445057359836405,0.03358,0.183591492524786,2
crRNA535:553-575,GCATCAACATAGCCATAGATGTA,575,0.0397162004413851,0.03234,0.180931607434913,2
crRNA763:781-803,GCATCTCTTATTGCATACTAGAA,803,0.0348024098772973,0.03109,0.178202716889917,2
crRNA073:73-95,GGTGCTGGCCCGGCTCCCCGAGC,95,0.0336593324942171,0.02985,0.17756790492099,2
crRNA772:790-812,CAGTACAGGGCATCTCTTATTGC,812,0.0301996570036259,0.02861,0.175646562199543,2
crRNA512:530-552,GGAGCTCCCGGAGCCTCCAATGG,552,0.0270889573534122,0.02736,0.173919024415204,2
crRNA273:273-295,AGCCTGAGCGACAGCAGAAAATG,295,0.0238538965384797,0.02612,0.172122422228926,2
crRNA397:397-419,CGGTAACACATCTCCTTAAAGAG,419,0.0185507324120539,0.02488,0.169177291732537,2
crRNA070:70-92,GCTGGCCCGGCTCCCCGAGCAGC,92,0.0178993177347132,0.02363,0.168815526343744,2
crRNA202:202-224,GACCCAGTGGTTGTTCTGGAGTC,224,0.017083892280381,0.02239,0.168362677004022,2
crRNA695:713-735,TATCTGGTCTCCCAAAAGTACTT,735,0.00508118318415739,0.02114,0.161696931091611,2
crRNA444:444-466,GGTCCCAGCCTGCGATGATGATT,466,-0.00287494133306755,0.0199,0.157278469888047,1
crRNA795:813-835,ACAAACTTTATTAAATTTTGCAT,835,-0.00809047041621518,0.01866,0.154382007815331,1
crRNA697:715-737,GGTATCTGGTCTCCCAAAAGTAC,737,-0.00885013743898793,0.01741,0.153960124112973,1
crRNA762:780-802,CATCTCTTATTGCATACTAGAAT,802,-0.00935281063071799,0.01617,0.153680962821452,1
crRNA773:791-813,TCAGTACAGGGCATCTCTTATTG,813,-0.0134864789527596,0.01493,0.15138531585542,1
crRNA798:816-838,GTGACAAACTTTATTAAATTTTG,838,-0.0136000916862827,0.01368,0.151322220631833,1
crRNA696:714-736,GTATCTGGTCTCCCAAAAGTACT,736,-0.0208379650845665,0.01244,0.147302642665527,1
crRNA046:46-68,AGTAAGGTAGCCGCCATCTTTCT,68,-0.0251664964346975,0.01119,0.144898777844462,1
crRNA797:815-837,TGACAAACTTTATTAAATTTTGC,837,-0.0300541513871045,0.00995,0.142184401801596,1
crRNA774:792-814,ATCAGTACAGGGCATCTCTTATT,814,-0.0324896977043343,0.008706,0.140831812750373,1
crRNA796:814-836,GACAAACTTTATTAAATTTTGCA,836,-0.05217300231673,0.007463,0.129900621615856,1
crRNA804:822-844,TTCTCTGTGACAAACTTTATTAA,844,-0.0561324063266855,0.006219,0.127701752936847,1
crRNA800:818-840,CTGTGACAAACTTTATTAAATTT,840,-0.0619445294518955,0.004975,0.1244739703043,1
crRNA803:821-843,TCTCTGTGACAAACTTTATTAAA,843,-0.0640490008641521,0.003731,0.123305244843942,1
crRNA801:819-841,TCTGTGACAAACTTTATTAAATT,841,-0.0692600913342411,0.002488,0.120411247770304,1
crRNA799:817-839,TGTGACAAACTTTATTAAATTTT,839,-0.0696795490714367,0.001244,0.120178300468596,1
crRNA802:820-842,CTCTGTGACAAACTTTATTAAAT,842,-0.107818023885658,0,0.0989979668821992,1
