AARD_B1_crRNA0223:223-249	1662
AARD_B2_crRNA0188:188-214	1865
AARD_B3_crRNA0327:339-365	2033
AARD_T1_crRNA0163:163-189	1759
AARD_T2_crRNA0653:720-746	2047
AARD_T3_crRNA0296:308-334	1874
ARCN1_B1_crRNA0543:669-695	1592
ARCN1_B2_crRNA0071:71-97	1412
ARCN1_B3_crRNA0603:729-755	2118
ARCN1_T1_crRNA1248:1451-1477	1982
ARCN1_T2_crRNA1188:1368-1394	1711
ARCN1_T3_crRNA0814:940-966	1724
CCT7_B1_crRNA0464:510-536	1741
CCT7_B2_crRNA1585:1775-1801	1701
CCT7_B3_crRNA1541:1708-1734	1671
CCT7_T1_crRNA0982:1075-1101	2113
CCT7_T2_crRNA0203:226-252	2125
CCT7_T3_crRNA0509:555-581	1940
CDKN2A_B1_crRNA228:321-347	1727
CDKN2A_B2_crRNA324:417-443	1171
CDKN2A_B3_crRNA158:228-254	1878
CDKN2A_T1_crRNA255:348-374	1735
CDKN2A_T2_crRNA103:149-175	1224
CDKN2A_T3_crRNA208:301-327	1952
CHEK2_B1_crRNA1276:1663-1689	1544
CHEK2_B2_crRNA0226:226-252	1743
CHEK2_B3_crRNA0331:331-357	1589
CHEK2_T1_crRNA0726:850-876	2093
CHEK2_T2_crRNA0632:756-782	2127
CHEK2_T3_crRNA0942:1280-1306	1931
EIF3B_B1_crRNA0269:287-313	1579
EIF3B_B2_crRNA0464:505-531	1581
EIF3B_B3_crRNA0125:125-151	1729
EIF3B_T1_crRNA1359:1719-1745	1941
EIF3B_T2_crRNA0778:936-962	1765
EIF3B_T3_crRNA0608:718-744	1676
MESDC1_B1_crRNA0705:820-846	1843
MESDC1_B2_crRNA0619:734-760	1690
MESDC1_B3_crRNA1588:1804-1830	2317
MESDC1_T1_crRNA1719:1959-1985	2147
MESDC1_T2_crRNA1775:2015-2041	1453
MESDC1_T3_crRNA1215:1404-1430	1907
NF1_B1_crRNA0277:423-449	1716
NF1_B2_crRNA2347:2955-2981	1772
NF1_B3_crRNA6472:7913-7939	1351
NF1_T1_crRNA2932:3633-3659	2039
NF1_T2_crRNA4425:5509-5535	1612
NF1_T3_crRNA2072:2657-2683	1789
NF2_B1_crRNA0205:205-231	1743
NF2_B2_crRNA0067:67-93	1743
NF2_B3_crRNA1676:1865-1891	1472
NF2_T1_crRNA1422:1611-1637	1746
NF2_T2_crRNA0884:1027-1053	1866
NF2_T3_crRNA0825:968-994	2130
NT_rc_000038	1342
NT_rc_000341	1156
NT_rc_000358	1322
NUP133_B1_crRNA0093:93-119	1823
NUP133_B2_crRNA0203:203-229	1819
NUP133_B3_crRNA1694:2067-2093	1816
NUP133_T1_crRNA1793:2191-2217	2022
NUP133_T2_crRNA0828:914-940	1721
NUP133_T3_crRNA0428:428-454	2344
PRPF19_B1_crRNA0375:398-424	1660
PRPF19_B2_crRNA0854:877-903	1965
PRPF19_B3_crRNA1287:1367-1393	1851
PRPF19_T1_crRNA1017:1097-1123	1908
PRPF19_T2_crRNA0275:298-324	2012
PRPF19_T3_crRNA0736:759-785	1426
PSMB2_B1_crRNA0164:238-264	1507
PSMB2_B2_crRNA1253:1634-1660	1512
PSMB2_B3_crRNA0379:453-479	1751
PSMB2_T1_crRNA0744:865-891	2211
PSMB2_T2_crRNA0630:727-753	2165
PSMB2_T3_crRNA0269:343-369	1825
PSMB6_B1_crRNA121:144-170	1717
PSMB6_B2_crRNA291:375-401	1718
PSMB6_B3_crRNA610:742-768	1536
PSMB6_T1_crRNA471:579-605	1343
PSMB6_T2_crRNA570:678-704	1735
PSMB6_T3_crRNA348:432-458	1727
PTCD1_B1_crRNA1336:1521-1547	1935
PTCD1_B2_crRNA1628:1896-1922	1862
PTCD1_B3_crRNA0374:397-423	2053
PTCD1_T1_crRNA1794:2085-2111	2094
PTCD1_T2_crRNA1414:1659-1685	2232
PTCD1_T3_crRNA0401:424-450	1740
PTEN_B1_crRNA0241:264-290	1488
PTEN_B2_crRNA0854:1120-1146	1850
PTEN_B3_crRNA0293:352-378	1766
PTEN_T1_crRNA0603:757-783	1999
PTEN_T2_crRNA1411:1817-1843	1637
PTEN_T3_crRNA1568:1997-2023	1837
RB1_B1_crRNA0137:247-273	1460
RB1_B2_crRNA0060:92-118	1636
RB1_B3_crRNA1470:2029-2055	1706
RB1_T1_crRNA0649:895-921	1822
RB1_T2_crRNA0999:1440-1466	1728
RB1_T3_crRNA2041:2773-2799	2626
SFPQ_B1_crRNA0348:393-419	1493
SFPQ_B2_crRNA0482:550-576	1289
SFPQ_B3_crRNA0533:601-627	1485
SFPQ_T1_crRNA1163:1313-1339	1886
SFPQ_T2_crRNA1843:2136-2162	1759
SFPQ_T3_crRNA1599:1892-1918	2599
SNRNP200_B1_crRNA1708:1874-1900	1551
SNRNP200_B2_crRNA2069:2329-2355	1530
SNRNP200_B3_crRNA0751:774-800	2245
SNRNP200_T1_crRNA0891:962-988	2097
SNRNP200_T2_crRNA1423:1543-1569	2131
SNRNP200_T3_crRNA2305:2613-2639	2314
SUPT5H_B1_crRNA2474:2707-2733	1305
SUPT5H_B2_crRNA2671:2980-3006	1591
SUPT5H_B3_crRNA2590:2876-2902	1342
SUPT5H_T1_crRNA0902:973-999	2449
SUPT5H_T2_crRNA1128:1199-1225	2123
SUPT5H_T3_crRNA0404:452-478	2055
TSC2_B1_crRNA0493:540-566	1795
TSC2_B2_crRNA1407:1477-1503	1685
TSC2_B3_crRNA1243:1313-1339	1715
TSC2_T1_crRNA0762:832-858	1954
TSC2_T2_crRNA0110:133-159	2336
TSC2_T3_crRNA0902:972-998	2223
