Var1	Var2	value	se	low	high
1	Q_1	Q_1	0.561907401344435	0.0214832756833721	0.978516724316628	1.02148327568337
2	Q_2	Q_1	0.273693839793236	0.0112672314186396	0.426825367236925	0.449359830074205
3	Q_3	Q_1	0.129740098039713	0.0109301857564427	0.153468573105886	0.175328944618772
4	Q_4	Q_1	0.0346586608226158	0.00824211264839184	0.0264165481742239	0.0429007734710076
5	Q_1	Q_2	0.334864522032464	0.0224195505456692	0.977580449454331	1.02241955054567
6	Q_2	Q_2	0.339556454861002	0.0175178004451892	0.647617677522346	0.682653278412725
7	Q_3	Q_2	0.226140476989402	0.0117495555835637	0.31382946752297	0.337328578690097
8	Q_4	Q_2	0.099438546117132	0.011857270726768	0.0875812753903641	0.1112958168439
9	Q_1	Q_3	0.0968351060704002	0.0102231824225981	0.989776817577402	1.0102231824226
10	Q_2	Q_3	0.29080796980797	0.015420321254644	0.887744572674956	0.918585215184244
11	Q_3	Q_3	0.370799210593328	0.00987396380858185	0.602482960313048	0.622230887930212
12	Q_4	Q_3	0.241557713528302	0.010936178810111	0.230621534718191	0.252493892338413
13	Q_1	Q_4	0.0148348398963594	0.00473947034404193	0.995260529655958	1.00473947034404
14	Q_2	Q_4	0.0875510762905364	0.00854157274990882	0.976623587353732	0.993706732853549
15	Q_3	Q_4	0.269178431466427	0.010851636894622	0.886762446918482	0.908465720707726
16	Q_4	Q_4	0.628435652346677	0.0073274942379928	0.621108158108684	0.63576314658467
