1	Tx	0.0965015666492932
2	Tx	0.283716114700043
3	Tx	0.471605316047553
4	Tx	0.148177002603112
1	5'utr	0.0792245472157689
2	5'utr	0.306116771304774
3	5'utr	0.482728554547135
4	5'utr	0.131930126932322
1	cds	0.0657787412460343
2	cds	0.283468221814838
3	cds	0.504032611600739
4	cds	0.146720425338388
1	3'utr	0.162654126883504
2	3'utr	0.277253689916949
3	3'utr	0.403990259095928
4	3'utr	0.15610192410362
