v1	value	MFE,DR,Gquad,Log10_Unpaired,hybMFE_3.12,hybMFE_15.9 ,NTdens_max_A,NTdens_max_C,NTdens_max_G,NTdens_max_T,NTdens_max_AT , NTdens_max_GC,NTdens_min_A ,  NTdens_min_C ,  NTdens_min_G ,  NTdens_min_T , NTdens_min_AT , NTdens_min_GC
v2	value	MFE,DR,Gquad,Log10_Unpaired,hybMFE_3.12,hybMFE_15.9 ,NTdens_max_A,NTdens_max_C,NTdens_max_G,NTdens_max_T,NTdens_max_AT , NTdens_max_GC,NTdens_min_A ,  NTdens_min_C ,  NTdens_min_G ,  NTdens_min_T , NTdens_min_AT , NTdens_min_GC,pA,pC,pG,pT,pG.pC,pA.pT
v3	value	MFE,DR,Gquad,Log10_Unpaired,hybMFE_3.12,hybMFE_15.9 ,NTdens_max_A,NTdens_max_C,NTdens_max_G,NTdens_max_T,NTdens_max_AT , NTdens_max_GC,NTdens_min_A ,  NTdens_min_C ,  NTdens_min_G ,  NTdens_min_T , NTdens_min_AT , NTdens_min_GC,pA,pC,pG,pT,pG.pC,pA.pT,pAA,pAC,pAG,pAT,pCA,pCC,pCG,pCT,pGA,pGC,pGG,pGT,pTA,pTC,pTG,pTT
v4	value	MFE,DR,Gquad,Log10_Unpaired,hybMFE_3.12,hybMFE_15.9 ,NTdens_max_A,NTdens_max_C,NTdens_max_G,NTdens_max_T,NTdens_max_AT , NTdens_max_GC,NTdens_min_A ,  NTdens_min_C ,  NTdens_min_G ,  NTdens_min_T , NTdens_min_AT , NTdens_min_GC,A_.4,C_.4,G_.4,T_.4,A_.3,C_.3,G_.3, T_.3,A_.2,C_.2,G_.2,T_.2,A_.1,C_.1,G_.1,T_.1,A_23,C_23,G_23,T_23,A_22,C_22,G_22,T_22,A_21,C_21,G_21,T_21,A_20,C_20,G_20,T_20,A_19,C_19,G_19,T_19,A_18,C_18,G_18,T_18,A_17,C_17,G_17,T_17,A_16,C_16,G_16,T_16,A_15,C_15,G_15,T_15,A_14,C_14,G_14,T_14,A_13,C_13,G_13,T_13,A_12,C_12,G_12,T_12,A_11,C_11,G_11,T_11,A_10,C_10,G_10,T_10,A_9,C_9, G_9, T_9, A_8, C_8, G_8, T_8, A_7, C_7, G_7, T_7,A_6, C_6, G_6, T_6, A_5, C_5, G_5, T_5, A_4, C_4, G_4,T_4, A_3, C_3, G_3, T_3, A_2, C_2, G_2, T_2, A_1, C_1,G_1, T_1, A_.1.1,C_.1.1,G_.1.1,T_.1.1,A_.2.1,C_.2.1,G_.2.1,T_.2.1,A_.3.1, C_.3.1,G_.3.1,T_.3.1,A_.4.1,C_.4.1,G_.4.1,T_.4.1
v5	value	MFE,DR,Gquad,Log10_Unpaired,hybMFE_3.12,hybMFE_15.9 ,NTdens_max_A,NTdens_max_C,NTdens_max_G,NTdens_max_T,NTdens_max_AT , NTdens_max_GC,NTdens_min_A ,  NTdens_min_C ,  NTdens_min_G ,  NTdens_min_T , NTdens_min_AT , NTdens_min_GC,A_.4,C_.4,G_.4,T_.4,A_.3,C_.3,G_.3, T_.3,A_.2,C_.2,G_.2,T_.2,A_.1,C_.1,G_.1,T_.1,A_23,C_23,G_23,T_23,A_22,C_22,G_22,T_22,A_21,C_21,G_21,T_21,A_20,C_20,G_20,T_20,A_19,C_19,G_19,T_19,A_18,C_18,G_18,T_18,A_17,C_17,G_17,T_17,A_16,C_16,G_16,T_16,A_15,C_15,G_15,T_15,A_14,C_14,G_14,T_14,A_13,C_13,G_13,T_13,A_12,C_12,G_12,T_12,A_11,C_11,G_11,T_11,A_10,C_10,G_10,T_10,A_9,C_9, G_9, T_9, A_8, C_8, G_8, T_8, A_7, C_7, G_7, T_7,A_6, C_6, G_6, T_6, A_5, C_5, G_5, T_5, A_4, C_4, G_4,T_4, A_3, C_3, G_3, T_3, A_2, C_2, G_2, T_2, A_1, C_1,G_1, T_1, A_.1.1,C_.1.1,G_.1.1,T_.1.1,A_.2.1,C_.2.1,G_.2.1,T_.2.1,A_.3.1, C_.3.1,G_.3.1,T_.3.1,A_.4.1,C_.4.1,G_.4.1,T_.4.1,AA_.3,AC_.3,AG_.3,AT_.3,CA_.3,CC_.3,CG_.3,CT_.3,GA_.3,GC_.3,GG_.3,GT_.3,TA_.3,TC_.3,TG_.3,TT_.3,AA_.2,AC_.2,AG_.2,AT_.2,CA_.2,CC_.2,CG_.2,CT_.2,GA_.2,GC_.2,GG_.2,GT_.2,TA_.2,TC_.2,TG_.2,TT_.2,AA_.1,AC_.1,AG_.1,AT_.1,CA_.1,CC_.1,CG_.1,CT_.1,GA_.1,GC_.1,GG_.1,GT_.1,TA_.1,TC_.1,TG_.1,TT_.1,AA_23,AC_23,AG_23,AT_23,CA_23,CC_23,CG_23,CT_23,GA_23,GC_23,GG_23,GT_23,TA_23,TC_23,TG_23,TT_23,AA_22,AC_22,AG_22,AT_22,CA_22,CC_22,CG_22,CT_22,GA_22,GC_22,GG_22,GT_22,TA_22,TC_22,TG_22,TT_22,AA_21,AC_21,AG_21,AT_21,CA_21,CC_21,CG_21,CT_21,GA_21,GC_21,GG_21,GT_21,TA_21,TC_21,TG_21,TT_21,AA_20,AC_20,AG_20,AT_20,CA_20,CC_20,CG_20,CT_20,GA_20,GC_20,GG_20,GT_20,TA_20,TC_20,TG_20,TT_20,AA_19,AC_19,AG_19,AT_19,CA_19,CC_19,CG_19,CT_19,GA_19,GC_19,GG_19,GT_19,TA_19,TC_19,TG_19,TT_19,AA_18,AC_18,AG_18,AT_18,CA_18,CC_18,CG_18,CT_18,GA_18,GC_18,GG_18,GT_18,TA_18,TC_18,TG_18,TT_18,AA_17,AC_17,AG_17,AT_17,CA_17,CC_17,CG_17,CT_17,GA_17,GC_17,GG_17,GT_17,TA_17,TC_17,TG_17,TT_17,AA_16,AC_16,AG_16,AT_16,CA_16,CC_16,CG_16,CT_16,GA_16,GC_16,GG_16,GT_16,TA_16,TC_16,TG_16,TT_16,AA_15,AC_15,AG_15,AT_15,CA_15,CC_15,CG_15,CT_15,GA_15,GC_15,GG_15,GT_15,TA_15,TC_15,TG_15,TT_15,AA_14,AC_14,AG_14,AT_14,CA_14,CC_14,CG_14,CT_14,GA_14,GC_14,GG_14,GT_14,TA_14,TC_14,TG_14,TT_14,AA_13,AC_13,AG_13,AT_13,CA_13,CC_13,CG_13,CT_13,GA_13,GC_13,GG_13,GT_13,TA_13,TC_13,TG_13,TT_13,AA_12,AC_12,AG_12,AT_12,CA_12,CC_12,CG_12,CT_12,GA_12,GC_12,GG_12,GT_12,TA_12,TC_12,TG_12,TT_12,AA_11,AC_11,AG_11,AT_11,CA_11,CC_11,CG_11, CT_11,GA_11,GC_11,GG_11,GT_11,TA_11,TC_11,TG_11,TT_11,AA_10,AC_10,AG_10,AT_10,CA_10,CC_10,CG_10,CT_10,GA_10,GC_10,GG_10,GT_10,TA_10,TC_10,TG_10,TT_10,AA_9, AC_9, AG_9, AT_9, CA_9, CC_9, CG_9,CT_9, GA_9, GC_9, GG_9, GT_9, TA_9, TC_9, TG_9, TT_9, AA_8, AC_8,AG_8, AT_8, CA_8, CC_8, CG_8, CT_8, GA_8, GC_8, GG_8, GT_8, TA_8,TC_8, TG_8, TT_8, AA_7, AC_7, AG_7, AT_7, CA_7, CC_7, CG_7, CT_7,GA_7, GC_7, GG_7, GT_7, TA_7, TC_7, TG_7, TT_7, AA_6, AC_6, AG_6,AT_6, CA_6, CC_6, CG_6, CT_6, GA_6, GC_6, GG_6, GT_6, TA_6, TC_6,TG_6, TT_6, AA_5, AC_5, AG_5, AT_5, CA_5, CC_5, CG_5, CT_5, GA_5,GC_5, GG_5, GT_5, TA_5, TC_5, TG_5, TT_5, AA_4, AC_4, AG_4, AT_4,CA_4, CC_4, CG_4, CT_4, GA_4, GC_4, GG_4, GT_4, TA_4, TC_4, TG_4,TT_4, AA_3, AC_3, AG_3, AT_3, CA_3, CC_3, CG_3, CT_3, GA_3, GC_3,GG_3, GT_3, TA_3, TC_3, TG_3, TT_3, AA_2, AC_2, AG_2, AT_2, CA_2,CC_2, CG_2, CT_2, GA_2, GC_2, GG_2, GT_2, TA_2, TC_2, TG_2, TT_2,AA_1, AC_1, AG_1, AT_1, CA_1, CC_1, CG_1, CT_1, GA_1, GC_1, GG_1,GT_1, TA_1, TC_1, TG_1, TT_1, AA_.1.1,AC_.1.1,AG_.1.1,AT_.1.1,CA_.1.1,CC_.1.1,CG_.1.1,CT_.1.1,GA_.1.1,GC_.1.1,GG_.1.1,GT_.1.1,TA_.1.1,TC_.1.1,TG_.1.1,TT_.1.1,AA_.2.1,AC_.2.1,AG_.2.1,AT_.2.1,CA_.2.1,CC_.2.1,CG_.2.1,CT_.2.1,GA_.2.1,GC_.2.1,GG_.2.1,GT_.2.1,TA_.2.1,TC_.2.1,TG_.2.1,TT_.2.1,AA_.3.1,AC_.3.1,AG_.3.1,AT_.3.1,CA_.3.1,CC_.3.1,CG_.3.1,CT_.3.1,GA_.3.1,GC_.3.1,GG_.3.1,GT_.3.1,TA_.3.1,TC_.3.1,TG_.3.1,TT_.3.1,AA_.4,AC_.4,AG_.4,AT_.4,CA_.4,CC_.4,CG_.4,CT_.4,GA_.4,GC_.4,GG_.4,GT_.4,TA_.4,TC_.4,TG_.4,TT_.4
v6	value	MFE,DR,Gquad,Log10_Unpaired,hybMFE_3.12,hybMFE_15.9 ,A_.4,C_.4,G_.4,T_.4,A_.3,C_.3,G_.3, T_.3,A_.2,C_.2,G_.2,T_.2,A_.1,C_.1,G_.1,T_.1,A_23,C_23,G_23,T_23,A_22,C_22,G_22,T_22,A_21,C_21,G_21,T_21,A_20,C_20,G_20,T_20,A_19,C_19,G_19,T_19,A_18,C_18,G_18,T_18,A_17,C_17,G_17,T_17,A_16,C_16,G_16,T_16,A_15,C_15,G_15,T_15,A_14,C_14,G_14,T_14,A_13,C_13,G_13,T_13,A_12,C_12,G_12,T_12,A_11,C_11,G_11,T_11,A_10,C_10,G_10,T_10,A_9,C_9, G_9, T_9, A_8, C_8, G_8, T_8, A_7, C_7, G_7, T_7,A_6, C_6, G_6, T_6, A_5, C_5, G_5, T_5, A_4, C_4, G_4,T_4, A_3, C_3, G_3, T_3, A_2, C_2, G_2, T_2, A_1, C_1,G_1, T_1, A_.1.1,C_.1.1,G_.1.1,T_.1.1,A_.2.1,C_.2.1,G_.2.1,T_.2.1,A_.3.1, C_.3.1,G_.3.1,T_.3.1,A_.4.1,C_.4.1,G_.4.1,T_.4.1,AA_.3,AC_.3,AG_.3,AT_.3,CA_.3,CC_.3,CG_.3,CT_.3,GA_.3,GC_.3,GG_.3,GT_.3,TA_.3,TC_.3,TG_.3,TT_.3,AA_.2,AC_.2,AG_.2,AT_.2,CA_.2,CC_.2,CG_.2,CT_.2,GA_.2,GC_.2,GG_.2,GT_.2,TA_.2,TC_.2,TG_.2,TT_.2,AA_.1,AC_.1,AG_.1,AT_.1,CA_.1,CC_.1,CG_.1,CT_.1,GA_.1,GC_.1,GG_.1,GT_.1,TA_.1,TC_.1,TG_.1,TT_.1,AA_23,AC_23,AG_23,AT_23,CA_23,CC_23,CG_23,CT_23,GA_23,GC_23,GG_23,GT_23,TA_23,TC_23,TG_23,TT_23,AA_22,AC_22,AG_22,AT_22,CA_22,CC_22,CG_22,CT_22,GA_22,GC_22,GG_22,GT_22,TA_22,TC_22,TG_22,TT_22,AA_21,AC_21,AG_21,AT_21,CA_21,CC_21,CG_21,CT_21,GA_21,GC_21,GG_21,GT_21,TA_21,TC_21,TG_21,TT_21,AA_20,AC_20,AG_20,AT_20,CA_20,CC_20,CG_20,CT_20,GA_20,GC_20,GG_20,GT_20,TA_20,TC_20,TG_20,TT_20,AA_19,AC_19,AG_19,AT_19,CA_19,CC_19,CG_19,CT_19,GA_19,GC_19,GG_19,GT_19,TA_19,TC_19,TG_19,TT_19,AA_18,AC_18,AG_18,AT_18,CA_18,CC_18,CG_18,CT_18,GA_18,GC_18,GG_18,GT_18,TA_18,TC_18,TG_18,TT_18,AA_17,AC_17,AG_17,AT_17,CA_17,CC_17,CG_17,CT_17,GA_17,GC_17,GG_17,GT_17,TA_17,TC_17,TG_17,TT_17,AA_16,AC_16,AG_16,AT_16,CA_16,CC_16,CG_16,CT_16,GA_16,GC_16,GG_16,GT_16,TA_16,TC_16,TG_16,TT_16,AA_15,AC_15,AG_15,AT_15,CA_15,CC_15,CG_15,CT_15,GA_15,GC_15,GG_15,GT_15,TA_15,TC_15,TG_15,TT_15,AA_14,AC_14,AG_14,AT_14,CA_14,CC_14,CG_14,CT_14,GA_14,GC_14,GG_14,GT_14,TA_14,TC_14,TG_14,TT_14,AA_13,AC_13,AG_13,AT_13,CA_13,CC_13,CG_13,CT_13,GA_13,GC_13,GG_13,GT_13,TA_13,TC_13,TG_13,TT_13,AA_12,AC_12,AG_12,AT_12,CA_12,CC_12,CG_12,CT_12,GA_12,GC_12,GG_12,GT_12,TA_12,TC_12,TG_12,TT_12,AA_11,AC_11,AG_11,AT_11,CA_11,CC_11,CG_11, CT_11,GA_11,GC_11,GG_11,GT_11,TA_11,TC_11,TG_11,TT_11,AA_10,AC_10,AG_10,AT_10,CA_10,CC_10,CG_10,CT_10,GA_10,GC_10,GG_10,GT_10,TA_10,TC_10,TG_10,TT_10,AA_9, AC_9, AG_9, AT_9, CA_9, CC_9, CG_9,CT_9, GA_9, GC_9, GG_9, GT_9, TA_9, TC_9, TG_9, TT_9, AA_8, AC_8,AG_8, AT_8, CA_8, CC_8, CG_8, CT_8, GA_8, GC_8, GG_8, GT_8, TA_8,TC_8, TG_8, TT_8, AA_7, AC_7, AG_7, AT_7, CA_7, CC_7, CG_7, CT_7,GA_7, GC_7, GG_7, GT_7, TA_7, TC_7, TG_7, TT_7, AA_6, AC_6, AG_6,AT_6, CA_6, CC_6, CG_6, CT_6, GA_6, GC_6, GG_6, GT_6, TA_6, TC_6,TG_6, TT_6, AA_5, AC_5, AG_5, AT_5, CA_5, CC_5, CG_5, CT_5, GA_5,GC_5, GG_5, GT_5, TA_5, TC_5, TG_5, TT_5, AA_4, AC_4, AG_4, AT_4,CA_4, CC_4, CG_4, CT_4, GA_4, GC_4, GG_4, GT_4, TA_4, TC_4, TG_4,TT_4, AA_3, AC_3, AG_3, AT_3, CA_3, CC_3, CG_3, CT_3, GA_3, GC_3,GG_3, GT_3, TA_3, TC_3, TG_3, TT_3, AA_2, AC_2, AG_2, AT_2, CA_2,CC_2, CG_2, CT_2, GA_2, GC_2, GG_2, GT_2, TA_2, TC_2, TG_2, TT_2,AA_1, AC_1, AG_1, AT_1, CA_1, CC_1, CG_1, CT_1, GA_1, GC_1, GG_1,GT_1, TA_1, TC_1, TG_1, TT_1, AA_.1.1,AC_.1.1,AG_.1.1,AT_.1.1,CA_.1.1,CC_.1.1,CG_.1.1,CT_.1.1,GA_.1.1,GC_.1.1,GG_.1.1,GT_.1.1,TA_.1.1,TC_.1.1,TG_.1.1,TT_.1.1,AA_.2.1,AC_.2.1,AG_.2.1,AT_.2.1,CA_.2.1,CC_.2.1,CG_.2.1,CT_.2.1,GA_.2.1,GC_.2.1,GG_.2.1,GT_.2.1,TA_.2.1,TC_.2.1,TG_.2.1,TT_.2.1,AA_.3.1,AC_.3.1,AG_.3.1,AT_.3.1,CA_.3.1,CC_.3.1,CG_.3.1,CT_.3.1,GA_.3.1,GC_.3.1,GG_.3.1,GT_.3.1,TA_.3.1,TC_.3.1,TG_.3.1,TT_.3.1,AA_.4,AC_.4,AG_.4,AT_.4,CA_.4,CC_.4,CG_.4,CT_.4,GA_.4,GC_.4,GG_.4,GT_.4,TA_.4,TC_.4,TG_.4,TT_.4	
v7	value	A_.4,C_.4,G_.4,T_.4,A_.3,C_.3,G_.3, T_.3,A_.2,C_.2,G_.2,T_.2,A_.1,C_.1,G_.1,T_.1,A_23,C_23,G_23,T_23,A_22,C_22,G_22,T_22,A_21,C_21,G_21,T_21,A_20,C_20,G_20,T_20,A_19,C_19,G_19,T_19,A_18,C_18,G_18,T_18,A_17,C_17,G_17,T_17,A_16,C_16,G_16,T_16,A_15,C_15,G_15,T_15,A_14,C_14,G_14,T_14,A_13,C_13,G_13,T_13,A_12,C_12,G_12,T_12,A_11,C_11,G_11,T_11,A_10,C_10,G_10,T_10,A_9,C_9, G_9, T_9, A_8, C_8, G_8, T_8, A_7, C_7, G_7, T_7,A_6, C_6, G_6, T_6, A_5, C_5, G_5, T_5, A_4, C_4, G_4,T_4, A_3, C_3, G_3, T_3, A_2, C_2, G_2, T_2, A_1, C_1,G_1, T_1, A_.1.1,C_.1.1,G_.1.1,T_.1.1,A_.2.1,C_.2.1,G_.2.1,T_.2.1,A_.3.1, C_.3.1,G_.3.1,T_.3.1,A_.4.1,C_.4.1,G_.4.1,T_.4.1,AA_.3,AC_.3,AG_.3,AT_.3,CA_.3,CC_.3,CG_.3,CT_.3,GA_.3,GC_.3,GG_.3,GT_.3,TA_.3,TC_.3,TG_.3,TT_.3,AA_.2,AC_.2,AG_.2,AT_.2,CA_.2,CC_.2,CG_.2,CT_.2,GA_.2,GC_.2,GG_.2,GT_.2,TA_.2,TC_.2,TG_.2,TT_.2,AA_.1,AC_.1,AG_.1,AT_.1,CA_.1,CC_.1,CG_.1,CT_.1,GA_.1,GC_.1,GG_.1,GT_.1,TA_.1,TC_.1,TG_.1,TT_.1,AA_23,AC_23,AG_23,AT_23,CA_23,CC_23,CG_23,CT_23,GA_23,GC_23,GG_23,GT_23,TA_23,TC_23,TG_23,TT_23,AA_22,AC_22,AG_22,AT_22,CA_22,CC_22,CG_22,CT_22,GA_22,GC_22,GG_22,GT_22,TA_22,TC_22,TG_22,TT_22,AA_21,AC_21,AG_21,AT_21,CA_21,CC_21,CG_21,CT_21,GA_21,GC_21,GG_21,GT_21,TA_21,TC_21,TG_21,TT_21,AA_20,AC_20,AG_20,AT_20,CA_20,CC_20,CG_20,CT_20,GA_20,GC_20,GG_20,GT_20,TA_20,TC_20,TG_20,TT_20,AA_19,AC_19,AG_19,AT_19,CA_19,CC_19,CG_19,CT_19,GA_19,GC_19,GG_19,GT_19,TA_19,TC_19,TG_19,TT_19,AA_18,AC_18,AG_18,AT_18,CA_18,CC_18,CG_18,CT_18,GA_18,GC_18,GG_18,GT_18,TA_18,TC_18,TG_18,TT_18,AA_17,AC_17,AG_17,AT_17,CA_17,CC_17,CG_17,CT_17,GA_17,GC_17,GG_17,GT_17,TA_17,TC_17,TG_17,TT_17,AA_16,AC_16,AG_16,AT_16,CA_16,CC_16,CG_16,CT_16,GA_16,GC_16,GG_16,GT_16,TA_16,TC_16,TG_16,TT_16,AA_15,AC_15,AG_15,AT_15,CA_15,CC_15,CG_15,CT_15,GA_15,GC_15,GG_15,GT_15,TA_15,TC_15,TG_15,TT_15,AA_14,AC_14,AG_14,AT_14,CA_14,CC_14,CG_14,CT_14,GA_14,GC_14,GG_14,GT_14,TA_14,TC_14,TG_14,TT_14,AA_13,AC_13,AG_13,AT_13,CA_13,CC_13,CG_13,CT_13,GA_13,GC_13,GG_13,GT_13,TA_13,TC_13,TG_13,TT_13,AA_12,AC_12,AG_12,AT_12,CA_12,CC_12,CG_12,CT_12,GA_12,GC_12,GG_12,GT_12,TA_12,TC_12,TG_12,TT_12,AA_11,AC_11,AG_11,AT_11,CA_11,CC_11,CG_11, CT_11,GA_11,GC_11,GG_11,GT_11,TA_11,TC_11,TG_11,TT_11,AA_10,AC_10,AG_10,AT_10,CA_10,CC_10,CG_10,CT_10,GA_10,GC_10,GG_10,GT_10,TA_10,TC_10,TG_10,TT_10,AA_9, AC_9, AG_9, AT_9, CA_9, CC_9, CG_9,CT_9, GA_9, GC_9, GG_9, GT_9, TA_9, TC_9, TG_9, TT_9, AA_8, AC_8,AG_8, AT_8, CA_8, CC_8, CG_8, CT_8, GA_8, GC_8, GG_8, GT_8, TA_8,TC_8, TG_8, TT_8, AA_7, AC_7, AG_7, AT_7, CA_7, CC_7, CG_7, CT_7,GA_7, GC_7, GG_7, GT_7, TA_7, TC_7, TG_7, TT_7, AA_6, AC_6, AG_6,AT_6, CA_6, CC_6, CG_6, CT_6, GA_6, GC_6, GG_6, GT_6, TA_6, TC_6,TG_6, TT_6, AA_5, AC_5, AG_5, AT_5, CA_5, CC_5, CG_5, CT_5, GA_5,GC_5, GG_5, GT_5, TA_5, TC_5, TG_5, TT_5, AA_4, AC_4, AG_4, AT_4,CA_4, CC_4, CG_4, CT_4, GA_4, GC_4, GG_4, GT_4, TA_4, TC_4, TG_4,TT_4, AA_3, AC_3, AG_3, AT_3, CA_3, CC_3, CG_3, CT_3, GA_3, GC_3,GG_3, GT_3, TA_3, TC_3, TG_3, TT_3, AA_2, AC_2, AG_2, AT_2, CA_2,CC_2, CG_2, CT_2, GA_2, GC_2, GG_2, GT_2, TA_2, TC_2, TG_2, TT_2,AA_1, AC_1, AG_1, AT_1, CA_1, CC_1, CG_1, CT_1, GA_1, GC_1, GG_1,GT_1, TA_1, TC_1, TG_1, TT_1, AA_.1.1,AC_.1.1,AG_.1.1,AT_.1.1,CA_.1.1,CC_.1.1,CG_.1.1,CT_.1.1,GA_.1.1,GC_.1.1,GG_.1.1,GT_.1.1,TA_.1.1,TC_.1.1,TG_.1.1,TT_.1.1,AA_.2.1,AC_.2.1,AG_.2.1,AT_.2.1,CA_.2.1,CC_.2.1,CG_.2.1,CT_.2.1,GA_.2.1,GC_.2.1,GG_.2.1,GT_.2.1,TA_.2.1,TC_.2.1,TG_.2.1,TT_.2.1,AA_.3.1,AC_.3.1,AG_.3.1,AT_.3.1,CA_.3.1,CC_.3.1,CG_.3.1,CT_.3.1,GA_.3.1,GC_.3.1,GG_.3.1,GT_.3.1,TA_.3.1,TC_.3.1,TG_.3.1,TT_.3.1,AA_.4,AC_.4,AG_.4,AT_.4,CA_.4,CC_.4,CG_.4,CT_.4,GA_.4,GC_.4,GG_.4,GT_.4,TA_.4,TC_.4,TG_.4,TT_.4	
v8	value	MFE,DR,Gquad,Log10_Unpaired,hybMFE_3.12,hybMFE_15.9 ,NTdens_max_A,NTdens_max_C,NTdens_max_G,NTdens_max_T,NTdens_max_AT , NTdens_max_GC,NTdens_min_A ,  NTdens_min_C ,  NTdens_min_G ,  NTdens_min_T , NTdens_min_AT , NTdens_min_GC,pA,pC,pG,pT,pG.pC,pA.pT,pAA,pAC,pAG,pAT,pCA,pCC,pCG,pCT,pGA,pGC,pGG,pGT,pTA,pTC,pTG,pTT,A_.4,C_.4,G_.4,T_.4,A_.3,C_.3,G_.3, T_.3,A_.2,C_.2,G_.2,T_.2,A_.1,C_.1,G_.1,T_.1,A_23,C_23,G_23,T_23,A_22,C_22,G_22,T_22,A_21,C_21,G_21,T_21,A_20,C_20,G_20,T_20,A_19,C_19,G_19,T_19,A_18,C_18,G_18,T_18,A_17,C_17,G_17,T_17,A_16,C_16,G_16,T_16,A_15,C_15,G_15,T_15,A_14,C_14,G_14,T_14,A_13,C_13,G_13,T_13,A_12,C_12,G_12,T_12,A_11,C_11,G_11,T_11,A_10,C_10,G_10,T_10,A_9,C_9, G_9, T_9, A_8, C_8, G_8, T_8, A_7, C_7, G_7, T_7,A_6, C_6, G_6, T_6, A_5, C_5, G_5, T_5, A_4, C_4, G_4,T_4, A_3, C_3, G_3, T_3, A_2, C_2, G_2, T_2, A_1, C_1,G_1, T_1, A_.1.1,C_.1.1,G_.1.1,T_.1.1,A_.2.1,C_.2.1,G_.2.1,T_.2.1,A_.3.1, C_.3.1,G_.3.1,T_.3.1,A_.4.1,C_.4.1,G_.4.1,T_.4.1,AA_.3,AC_.3,AG_.3,AT_.3,CA_.3,CC_.3,CG_.3,CT_.3,GA_.3,GC_.3,GG_.3,GT_.3,TA_.3,TC_.3,TG_.3,TT_.3,AA_.2,AC_.2,AG_.2,AT_.2,CA_.2,CC_.2,CG_.2,CT_.2,GA_.2,GC_.2,GG_.2,GT_.2,TA_.2,TC_.2,TG_.2,TT_.2,AA_.1,AC_.1,AG_.1,AT_.1,CA_.1,CC_.1,CG_.1,CT_.1,GA_.1,GC_.1,GG_.1,GT_.1,TA_.1,TC_.1,TG_.1,TT_.1,AA_23,AC_23,AG_23,AT_23,CA_23,CC_23,CG_23,CT_23,GA_23,GC_23,GG_23,GT_23,TA_23,TC_23,TG_23,TT_23,AA_22,AC_22,AG_22,AT_22,CA_22,CC_22,CG_22,CT_22,GA_22,GC_22,GG_22,GT_22,TA_22,TC_22,TG_22,TT_22,AA_21,AC_21,AG_21,AT_21,CA_21,CC_21,CG_21,CT_21,GA_21,GC_21,GG_21,GT_21,TA_21,TC_21,TG_21,TT_21,AA_20,AC_20,AG_20,AT_20,CA_20,CC_20,CG_20,CT_20,GA_20,GC_20,GG_20,GT_20,TA_20,TC_20,TG_20,TT_20,AA_19,AC_19,AG_19,AT_19,CA_19,CC_19,CG_19,CT_19,GA_19,GC_19,GG_19,GT_19,TA_19,TC_19,TG_19,TT_19,AA_18,AC_18,AG_18,AT_18,CA_18,CC_18,CG_18,CT_18,GA_18,GC_18,GG_18,GT_18,TA_18,TC_18,TG_18,TT_18,AA_17,AC_17,AG_17,AT_17,CA_17,CC_17,CG_17,CT_17,GA_17,GC_17,GG_17,GT_17,TA_17,TC_17,TG_17,TT_17,AA_16,AC_16,AG_16,AT_16,CA_16,CC_16,CG_16,CT_16,GA_16,GC_16,GG_16,GT_16,TA_16,TC_16,TG_16,TT_16,AA_15,AC_15,AG_15,AT_15,CA_15,CC_15,CG_15,CT_15,GA_15,GC_15,GG_15,GT_15,TA_15,TC_15,TG_15,TT_15,AA_14,AC_14,AG_14,AT_14,CA_14,CC_14,CG_14,CT_14,GA_14,GC_14,GG_14,GT_14,TA_14,TC_14,TG_14,TT_14,AA_13,AC_13,AG_13,AT_13,CA_13,CC_13,CG_13,CT_13,GA_13,GC_13,GG_13,GT_13,TA_13,TC_13,TG_13,TT_13,AA_12,AC_12,AG_12,AT_12,CA_12,CC_12,CG_12,CT_12,GA_12,GC_12,GG_12,GT_12,TA_12,TC_12,TG_12,TT_12,AA_11,AC_11,AG_11,AT_11,CA_11,CC_11,CG_11, CT_11,GA_11,GC_11,GG_11,GT_11,TA_11,TC_11,TG_11,TT_11,AA_10,AC_10,AG_10,AT_10,CA_10,CC_10,CG_10,CT_10,GA_10,GC_10,GG_10,GT_10,TA_10,TC_10,TG_10,TT_10,AA_9, AC_9, AG_9, AT_9, CA_9, CC_9, CG_9,CT_9, GA_9, GC_9, GG_9, GT_9, TA_9, TC_9, TG_9, TT_9, AA_8, AC_8,AG_8, AT_8, CA_8, CC_8, CG_8, CT_8, GA_8, GC_8, GG_8, GT_8, TA_8,TC_8, TG_8, TT_8, AA_7, AC_7, AG_7, AT_7, CA_7, CC_7, CG_7, CT_7,GA_7, GC_7, GG_7, GT_7, TA_7, TC_7, TG_7, TT_7, AA_6, AC_6, AG_6,AT_6, CA_6, CC_6, CG_6, CT_6, GA_6, GC_6, GG_6, GT_6, TA_6, TC_6,TG_6, TT_6, AA_5, AC_5, AG_5, AT_5, CA_5, CC_5, CG_5, CT_5, GA_5,GC_5, GG_5, GT_5, TA_5, TC_5, TG_5, TT_5, AA_4, AC_4, AG_4, AT_4,CA_4, CC_4, CG_4, CT_4, GA_4, GC_4, GG_4, GT_4, TA_4, TC_4, TG_4,TT_4, AA_3, AC_3, AG_3, AT_3, CA_3, CC_3, CG_3, CT_3, GA_3, GC_3,GG_3, GT_3, TA_3, TC_3, TG_3, TT_3, AA_2, AC_2, AG_2, AT_2, CA_2,CC_2, CG_2, CT_2, GA_2, GC_2, GG_2, GT_2, TA_2, TC_2, TG_2, TT_2,AA_1, AC_1, AG_1, AT_1, CA_1, CC_1, CG_1, CT_1, GA_1, GC_1, GG_1,GT_1, TA_1, TC_1, TG_1, TT_1, AA_.1.1,AC_.1.1,AG_.1.1,AT_.1.1,CA_.1.1,CC_.1.1,CG_.1.1,CT_.1.1,GA_.1.1,GC_.1.1,GG_.1.1,GT_.1.1,TA_.1.1,TC_.1.1,TG_.1.1,TT_.1.1,AA_.2.1,AC_.2.1,AG_.2.1,AT_.2.1,CA_.2.1,CC_.2.1,CG_.2.1,CT_.2.1,GA_.2.1,GC_.2.1,GG_.2.1,GT_.2.1,TA_.2.1,TC_.2.1,TG_.2.1,TT_.2.1,AA_.3.1,AC_.3.1,AG_.3.1,AT_.3.1,CA_.3.1,CC_.3.1,CG_.3.1,CT_.3.1,GA_.3.1,GC_.3.1,GG_.3.1,GT_.3.1,TA_.3.1,TC_.3.1,TG_.3.1,TT_.3.1,AA_.4,AC_.4,AG_.4,AT_.4,CA_.4,CC_.4,CG_.4,CT_.4,GA_.4,GC_.4,GG_.4,GT_.4,TA_.4,TC_.4,TG_.4,TT_.4
v9	value	MFE,DR,Gquad,Log10_Unpaired,hybMFE_3.12,hybMFE_15.9 ,NTdens_max_A,NTdens_max_C,NTdens_max_G,NTdens_max_T,NTdens_max_AT , NTdens_max_GC,NTdens_min_A ,  NTdens_min_C ,  NTdens_min_G ,  NTdens_min_T , NTdens_min_AT , NTdens_min_GC,pA,pC,pG,pT,pG.pC,pA.pT,pAA,pAC,pAG,pAT,pCA,pCC,pCG,pCT,pGA,pGC,pGG,pGT,pTA,pTC,pTG,pTT,A_.4,C_.4,G_.4,T_.4,A_.3,C_.3,G_.3, T_.3,A_.2,C_.2,G_.2,T_.2,A_.1,C_.1,G_.1,T_.1,A_23,C_23,G_23,T_23,A_22,C_22,G_22,T_22,A_21,C_21,G_21,T_21,A_20,C_20,G_20,T_20,A_19,C_19,G_19,T_19,A_18,C_18,G_18,T_18,A_17,C_17,G_17,T_17,A_16,C_16,G_16,T_16,A_15,C_15,G_15,T_15,A_14,C_14,G_14,T_14,A_13,C_13,G_13,T_13,A_12,C_12,G_12,T_12,A_11,C_11,G_11,T_11,A_10,C_10,G_10,T_10,A_9,C_9, G_9, T_9, A_8, C_8, G_8, T_8, A_7, C_7, G_7, T_7,A_6, C_6, G_6, T_6, A_5, C_5, G_5, T_5, A_4, C_4, G_4,T_4, A_3, C_3, G_3, T_3, A_2, C_2, G_2, T_2, A_1, C_1,G_1, T_1, A_.1.1,C_.1.1,G_.1.1,T_.1.1,A_.2.1,C_.2.1,G_.2.1,T_.2.1,A_.3.1, C_.3.1,G_.3.1,T_.3.1,A_.4.1,C_.4.1,G_.4.1,T_.4.1
v10	value	MFE,DR,Gquad,Log10_Unpaired,hybMFE_3.12,hybMFE_15.9 ,NTdens_max_A,NTdens_max_C,NTdens_max_G,NTdens_max_T,NTdens_max_AT , NTdens_max_GC,NTdens_min_A ,  NTdens_min_C ,  NTdens_min_G ,  NTdens_min_T , NTdens_min_AT , NTdens_min_GC,pA,pC,pG,pT,pG.pC,pA.pT,pAA,pAC,pAG,pAT,pCA,pCC,pCG,pCT,pGA,pGC,pGG,pGT,pTA,pTC,pTG,pTT,AA_.3,AC_.3,AG_.3,AT_.3,CA_.3,CC_.3,CG_.3,CT_.3,GA_.3,GC_.3,GG_.3,GT_.3,TA_.3,TC_.3,TG_.3,TT_.3,AA_.2,AC_.2,AG_.2,AT_.2,CA_.2,CC_.2,CG_.2,CT_.2,GA_.2,GC_.2,GG_.2,GT_.2,TA_.2,TC_.2,TG_.2,TT_.2,AA_.1,AC_.1,AG_.1,AT_.1,CA_.1,CC_.1,CG_.1,CT_.1,GA_.1,GC_.1,GG_.1,GT_.1,TA_.1,TC_.1,TG_.1,TT_.1,AA_23,AC_23,AG_23,AT_23,CA_23,CC_23,CG_23,CT_23,GA_23,GC_23,GG_23,GT_23,TA_23,TC_23,TG_23,TT_23,AA_22,AC_22,AG_22,AT_22,CA_22,CC_22,CG_22,CT_22,GA_22,GC_22,GG_22,GT_22,TA_22,TC_22,TG_22,TT_22,AA_21,AC_21,AG_21,AT_21,CA_21,CC_21,CG_21,CT_21,GA_21,GC_21,GG_21,GT_21,TA_21,TC_21,TG_21,TT_21,AA_20,AC_20,AG_20,AT_20,CA_20,CC_20,CG_20,CT_20,GA_20,GC_20,GG_20,GT_20,TA_20,TC_20,TG_20,TT_20,AA_19,AC_19,AG_19,AT_19,CA_19,CC_19,CG_19,CT_19,GA_19,GC_19,GG_19,GT_19,TA_19,TC_19,TG_19,TT_19,AA_18,AC_18,AG_18,AT_18,CA_18,CC_18,CG_18,CT_18,GA_18,GC_18,GG_18,GT_18,TA_18,TC_18,TG_18,TT_18,AA_17,AC_17,AG_17,AT_17,CA_17,CC_17,CG_17,CT_17,GA_17,GC_17,GG_17,GT_17,TA_17,TC_17,TG_17,TT_17,AA_16,AC_16,AG_16,AT_16,CA_16,CC_16,CG_16,CT_16,GA_16,GC_16,GG_16,GT_16,TA_16,TC_16,TG_16,TT_16,AA_15,AC_15,AG_15,AT_15,CA_15,CC_15,CG_15,CT_15,GA_15,GC_15,GG_15,GT_15,TA_15,TC_15,TG_15,TT_15,AA_14,AC_14,AG_14,AT_14,CA_14,CC_14,CG_14,CT_14,GA_14,GC_14,GG_14,GT_14,TA_14,TC_14,TG_14,TT_14,AA_13,AC_13,AG_13,AT_13,CA_13,CC_13,CG_13,CT_13,GA_13,GC_13,GG_13,GT_13,TA_13,TC_13,TG_13,TT_13,AA_12,AC_12,AG_12,AT_12,CA_12,CC_12,CG_12,CT_12,GA_12,GC_12,GG_12,GT_12,TA_12,TC_12,TG_12,TT_12,AA_11,AC_11,AG_11,AT_11,CA_11,CC_11,CG_11, CT_11,GA_11,GC_11,GG_11,GT_11,TA_11,TC_11,TG_11,TT_11,AA_10,AC_10,AG_10,AT_10,CA_10,CC_10,CG_10,CT_10,GA_10,GC_10,GG_10,GT_10,TA_10,TC_10,TG_10,TT_10,AA_9, AC_9, AG_9, AT_9, CA_9, CC_9, CG_9,CT_9, GA_9, GC_9, GG_9, GT_9, TA_9, TC_9, TG_9, TT_9, AA_8, AC_8,AG_8, AT_8, CA_8, CC_8, CG_8, CT_8, GA_8, GC_8, GG_8, GT_8, TA_8,TC_8, TG_8, TT_8, AA_7, AC_7, AG_7, AT_7, CA_7, CC_7, CG_7, CT_7,GA_7, GC_7, GG_7, GT_7, TA_7, TC_7, TG_7, TT_7, AA_6, AC_6, AG_6,AT_6, CA_6, CC_6, CG_6, CT_6, GA_6, GC_6, GG_6, GT_6, TA_6, TC_6,TG_6, TT_6, AA_5, AC_5, AG_5, AT_5, CA_5, CC_5, CG_5, CT_5, GA_5,GC_5, GG_5, GT_5, TA_5, TC_5, TG_5, TT_5, AA_4, AC_4, AG_4, AT_4,CA_4, CC_4, CG_4, CT_4, GA_4, GC_4, GG_4, GT_4, TA_4, TC_4, TG_4,TT_4, AA_3, AC_3, AG_3, AT_3, CA_3, CC_3, CG_3, CT_3, GA_3, GC_3,GG_3, GT_3, TA_3, TC_3, TG_3, TT_3, AA_2, AC_2, AG_2, AT_2, CA_2,CC_2, CG_2, CT_2, GA_2, GC_2, GG_2, GT_2, TA_2, TC_2, TG_2, TT_2,AA_1, AC_1, AG_1, AT_1, CA_1, CC_1, CG_1, CT_1, GA_1, GC_1, GG_1,GT_1, TA_1, TC_1, TG_1, TT_1, AA_.1.1,AC_.1.1,AG_.1.1,AT_.1.1,CA_.1.1,CC_.1.1,CG_.1.1,CT_.1.1,GA_.1.1,GC_.1.1,GG_.1.1,GT_.1.1,TA_.1.1,TC_.1.1,TG_.1.1,TT_.1.1,AA_.2.1,AC_.2.1,AG_.2.1,AT_.2.1,CA_.2.1,CC_.2.1,CG_.2.1,CT_.2.1,GA_.2.1,GC_.2.1,GG_.2.1,GT_.2.1,TA_.2.1,TC_.2.1,TG_.2.1,TT_.2.1,AA_.3.1,AC_.3.1,AG_.3.1,AT_.3.1,CA_.3.1,CC_.3.1,CG_.3.1,CT_.3.1,GA_.3.1,GC_.3.1,GG_.3.1,GT_.3.1,TA_.3.1,TC_.3.1,TG_.3.1,TT_.3.1,AA_.4,AC_.4,AG_.4,AT_.4,CA_.4,CC_.4,CG_.4,CT_.4,GA_.4,GC_.4,GG_.4,GT_.4,TA_.4,TC_.4,TG_.4,TT_.4
RFgfp	value	MFE,GFP_local_max_A, GFP_local_max_C, GFP_local_max_G, GFP_local_max_T, GFP_local_max_uU
final	value	MFE,DR,Gquad,Log10_Unpaired,hybMFE_3.12,hybMFE_15.9 ,NTdens_max_A,NTdens_max_C,NTdens_max_G,NTdens_max_T,NTdens_max_AT , NTdens_max_GC,NTdens_min_A ,  NTdens_min_C ,  NTdens_min_G ,  NTdens_min_T , NTdens_min_AT ,pA,pC,pG,pAA,pAC,pAG,pAT,pCA,pCC,pCG,pCT,pGA,pGC,pGG,pGT,pTA,pTC,pTG