value	Annotation	N
0.674680889188705	5'utr	1
0.64978444868403	5'utr	2
0.628050130174022	5'utr	3
0.607159044195925	5'utr	4
0.587564428235641	5'utr	5
0.569666817745829	5'utr	6
0.551800828475963	5'utr	7
0.534936177837741	5'utr	8
0.518018825166275	5'utr	9
0.501270119001191	5'utr	10
0.485501670654454	5'utr	11
0.470312944673406	5'utr	12
0.456557713996606	5'utr	13
0.442844644946402	5'utr	14
0.429226439556038	5'utr	15
0.416282820191203	5'utr	16
0.403623791805888	5'utr	17
0.391692051479346	5'utr	18
0.379876255625942	5'utr	19
0.367723166759774	5'utr	20
0.356350067985623	5'utr	21
0.345493449137268	5'utr	22
0.33579627502029	5'utr	23
0.325403434064486	5'utr	24
0.315094916361873	5'utr	25
0.996890580038578	cds	1
0.995499246360925	cds	2
0.993949806583538	cds	3
0.992105235419983	cds	4
0.989870669210418	cds	5
0.987541239341014	cds	6
0.985001001338632	cds	7
0.982176172356729	cds	8
0.97904567158201	cds	9
0.976178680973512	cds	10
0.97278467003257	cds	11
0.969443361124872	cds	12
0.965701516764517	cds	13
0.961791025897779	cds	14
0.957838373404446	cds	15
0.953558968304997	cds	16
0.948910648972837	cds	17
0.943998819474455	cds	18
0.939382121362242	cds	19
0.934428130237265	cds	20
0.929316033012554	cds	21
0.924288259041034	cds	22
0.918944272870047	cds	23
0.913979741338421	cds	24
0.907908467108661	cds	25
0.726328881768259	3'utr	1
0.720868951124134	3'utr	2
0.714639570794641	3'utr	3
0.708979372424188	3'utr	4
0.702159729322357	3'utr	5
0.694654959788349	3'utr	6
0.687487483267104	3'utr	7
0.680520274472189	3'utr	8
0.674016843569825	3'utr	9
0.667408008600972	3'utr	10
0.660156208826536	3'utr	11
0.653884666870448	3'utr	12
0.646875296448937	3'utr	13
0.640350784733275	3'utr	14
0.633741949764422	3'utr	15
0.627017170322431	3'utr	16
0.619775910954645	3'utr	17
0.613630853878343	3'utr	18
0.607127422975978	3'utr	19
0.60066615370021	3'utr	20
0.593857051005028	3'utr	21
0.587775236368619	3'utr	22
0.582304765317846	3'utr	23
0.576634026540744	3'utr	24
0.571121393863375	3'utr	25
0.999884055526862	all	1
0.999747030240427	all	2
0.999662706987236	all	3
0.999557302920747	all	4
0.999483520074204	all	5
0.999367575601067	all	6
0.99914622706144	all	7
0.998935418928462	all	8
0.998682449168889	all	9
0.998408398596018	all	10
0.998176509649742	all	11
0.997891918670222	all	12
0.997638948910649	all	13
0.997291115491236	all	14
0.996943282071822	all	15
0.996627069872356	all	16
0.996184372793102	all	17
0.995551948394169	all	18
0.994951145215182	all	19
0.99440304406944	all	20
0.993760079263858	all	21
0.992895765918649	all	22
0.992136856639929	all	23
0.99136740695456	all	24
0.990439851169458	all	25
