AARD_B1_crRNA0223:223-249	4428
AARD_B2_crRNA0188:188-214	4555
AARD_B3_crRNA0327:339-365	5549
AARD_T1_crRNA0163:163-189	4928
AARD_T2_crRNA0653:720-746	3604
AARD_T3_crRNA0296:308-334	4500
ARCN1_B1_crRNA0543:669-695	4001
ARCN1_B2_crRNA0071:71-97	3546
ARCN1_B3_crRNA0603:729-755	5378
ARCN1_T1_crRNA1248:1451-1477	4582
ARCN1_T2_crRNA1188:1368-1394	1797
ARCN1_T3_crRNA0814:940-966	2578
CCT7_B1_crRNA0464:510-536	4830
CCT7_B2_crRNA1585:1775-1801	4262
CCT7_B3_crRNA1541:1708-1734	3657
CCT7_T1_crRNA0982:1075-1101	1576
CCT7_T2_crRNA0203:226-252	2672
CCT7_T3_crRNA0509:555-581	171
CDKN2A_B1_crRNA228:321-347	4402
CDKN2A_B2_crRNA324:417-443	3165
CDKN2A_B3_crRNA158:228-254	5517
CDKN2A_T1_crRNA255:348-374	4337
CDKN2A_T2_crRNA103:149-175	3575
CDKN2A_T3_crRNA208:301-327	5253
CHEK2_B1_crRNA1276:1663-1689	4039
CHEK2_B2_crRNA0226:226-252	4109
CHEK2_B3_crRNA0331:331-357	3703
CHEK2_T1_crRNA0726:850-876	5076
CHEK2_T2_crRNA0632:756-782	5380
CHEK2_T3_crRNA0942:1280-1306	4605
EIF3B_B1_crRNA0269:287-313	3678
EIF3B_B2_crRNA0464:505-531	3825
EIF3B_B3_crRNA0125:125-151	4620
EIF3B_T1_crRNA1359:1719-1745	1186
EIF3B_T2_crRNA0778:936-962	381
EIF3B_T3_crRNA0608:718-744	3867
MESDC1_B1_crRNA0705:820-846	4290
MESDC1_B2_crRNA0619:734-760	4826
MESDC1_B3_crRNA1588:1804-1830	5513
MESDC1_T1_crRNA1719:1959-1985	4475
MESDC1_T2_crRNA1775:2015-2041	3796
MESDC1_T3_crRNA1215:1404-1430	4637
NF1_B1_crRNA0277:423-449	4343
NF1_B2_crRNA2347:2955-2981	4209
NF1_B3_crRNA6472:7913-7939	3696
NF1_T1_crRNA2932:3633-3659	4705
NF1_T2_crRNA4425:5509-5535	2782
NF1_T3_crRNA2072:2657-2683	4215
NF2_B1_crRNA0205:205-231	4023
NF2_B2_crRNA0067:67-93	4903
NF2_B3_crRNA1676:1865-1891	3783
NF2_T1_crRNA1422:1611-1637	4525
NF2_T2_crRNA0884:1027-1053	4622
NF2_T3_crRNA0825:968-994	5863
NT_rc_000038	3858
NT_rc_000341	2226
NT_rc_000358	2829
NUP133_B1_crRNA0093:93-119	4532
NUP133_B2_crRNA0203:203-229	4848
NUP133_B3_crRNA1694:2067-2093	4517
NUP133_T1_crRNA1793:2191-2217	3091
NUP133_T2_crRNA0828:914-940	1613
NUP133_T3_crRNA0428:428-454	5830
PRPF19_B1_crRNA0375:398-424	3944
PRPF19_B2_crRNA0854:877-903	5100
PRPF19_B3_crRNA1287:1367-1393	4347
PRPF19_T1_crRNA1017:1097-1123	4928
PRPF19_T2_crRNA0275:298-324	3814
PRPF19_T3_crRNA0736:759-785	3573
PSMB2_B1_crRNA0164:238-264	3550
PSMB2_B2_crRNA1253:1634-1660	3437
PSMB2_B3_crRNA0379:453-479	4501
PSMB2_T1_crRNA0744:865-891	1201
PSMB2_T2_crRNA0630:727-753	2535
PSMB2_T3_crRNA0269:343-369	4565
PSMB6_B1_crRNA121:144-170	925
PSMB6_B2_crRNA291:375-401	3990
PSMB6_B3_crRNA610:742-768	2697
PSMB6_T1_crRNA471:579-605	1892
PSMB6_T2_crRNA570:678-704	1105
PSMB6_T3_crRNA348:432-458	980
PTCD1_B1_crRNA1336:1521-1547	5249
PTCD1_B2_crRNA1628:1896-1922	4876
PTCD1_B3_crRNA0374:397-423	4707
PTCD1_T1_crRNA1794:2085-2111	4998
PTCD1_T2_crRNA1414:1659-1685	5672
PTCD1_T3_crRNA0401:424-450	4550
PTEN_B1_crRNA0241:264-290	3717
PTEN_B2_crRNA0854:1120-1146	4636
PTEN_B3_crRNA0293:352-378	3881
PTEN_T1_crRNA0603:757-783	4917
PTEN_T2_crRNA1411:1817-1843	2955
PTEN_T3_crRNA1568:1997-2023	4868
RB1_B1_crRNA0137:247-273	3789
RB1_B2_crRNA0060:92-118	3562
RB1_B3_crRNA1470:2029-2055	4497
RB1_T1_crRNA0649:895-921	3666
RB1_T2_crRNA0999:1440-1466	5115
RB1_T3_crRNA2041:2773-2799	6304
SFPQ_B1_crRNA0348:393-419	3876
SFPQ_B2_crRNA0482:550-576	3317
SFPQ_B3_crRNA0533:601-627	3487
SFPQ_T1_crRNA1163:1313-1339	3188
SFPQ_T2_crRNA1843:2136-2162	4116
SFPQ_T3_crRNA1599:1892-1918	1682
SNRNP200_B1_crRNA1708:1874-1900	4301
SNRNP200_B2_crRNA2069:2329-2355	3771
SNRNP200_B3_crRNA0751:774-800	2683
SNRNP200_T1_crRNA0891:962-988	3137
SNRNP200_T2_crRNA1423:1543-1569	1090
SNRNP200_T3_crRNA2305:2613-2639	285
SUPT5H_B1_crRNA2474:2707-2733	3204
SUPT5H_B2_crRNA2671:2980-3006	4016
SUPT5H_B3_crRNA2590:2876-2902	3430
SUPT5H_T1_crRNA0902:973-999	5582
SUPT5H_T2_crRNA1128:1199-1225	1875
SUPT5H_T3_crRNA0404:452-478	6288
TSC2_B1_crRNA0493:540-566	3766
TSC2_B2_crRNA1407:1477-1503	3822
TSC2_B3_crRNA1243:1313-1339	3915
TSC2_T1_crRNA0762:832-858	4723
TSC2_T2_crRNA0110:133-159	6481
TSC2_T3_crRNA0902:972-998	5874
