fetching *.csv files started on Tue Nov 26 21:58:24 2019
reading *.csv files started on Tue Nov 26 21:58:57 2019
loading pre-computed files started on Tue Nov 26 23:38:28 2019

Get top/bottom guide score distribution Tue Nov 26 23:51:33 2019

95% conficende interval given top 25% guides per UTR5
2.5%=0.406
 97.5%=0.873

95% conficende interval given top 25% guides per CDS
2.5%=0.484
 97.5%=0.869

95% conficende interval given top 25% guides per UTR3
2.5%=0.469
 97.5%=0.896

95% conficende interval given top 25% guides per All
2.5%=0.49
 97.5%=0.879
null device 
          1 
split guide info by annotation started on Tue Nov 26 23:51:52 2019
Get annotation fraction started on Tue Nov 26 23:51:53 2019
null device 
          1 
Get prediction quartiles started on Wed Nov 27 00:01:58 2019
null device 
          1 
null device 
          1 
Get random guide scores started on Wed Nov 27 00:06:21 2019
Get top guide scores started on Wed Nov 27 00:10:40 2019
null device 
          1 
Prepare output started on Wed Nov 27 00:12:56 2019
Write output started on Wed Nov 27 00:18:04 2019
finished at Wed Nov 27 00:18:06 2019

top predicted crRNAs have been written to "gencode.v19.Cas13d_crRNAs.txt"

