	#	Time	Action	Message	Duration / Fetch
0	1	16:49:32	CREATE PROCEDURE EMP()
 BEGIN
 declare total int default 0;
 select count(name) into total from employee;
 select total;
 END	Error Code: 1046. No database selected
 Select the default DB to be used by double-clicking its name in the SCHEMAS list in the sidebar.	0.000 sec
3	2	16:49:51	use new	0 row(s) affected	0.000 sec
3	3	16:49:55	CREATE PROCEDURE EMP()
 BEGIN
 declare total int default 0;
 select count(name) into total from employee;
 select total;
 END	0 row(s) affected	0.250 sec
0	4	16:50:17	CALL EMP	Error Code: 1054. Unknown column 'name' in 'field list'	0.062 sec
0	5	16:50:41	CALL EMP()	Error Code: 1054. Unknown column 'name' in 'field list'	0.000 sec
3	6	16:50:59	select * from employee
 LIMIT 0, 1000	5 row(s) returned	0.000 sec / 0.000 sec
0	7	16:51:11	CREATE PROCEDURE EMP()
 BEGIN
 declare total int default 0;
 select count(e_name) into total from employee;
 select total;
 END	Error Code: 1304. PROCEDURE EMP already exists	0.016 sec
0	8	16:51:14	CALL EMP()	Error Code: 1054. Unknown column 'name' in 'field list'	0.000 sec
0	9	16:51:29	CREATE PROCEDURE EMP()
 BEGIN
 declare total int default 0;
 select count(e_name) into total from employee;
 select total;
 END	Error Code: 1304. PROCEDURE EMP already exists	0.000 sec
0	10	16:51:38	CALL EMP()	Error Code: 1054. Unknown column 'name' in 'field list'	0.000 sec
0	11	16:51:52	call emp()	Error Code: 1054. Unknown column 'name' in 'field list'	0.000 sec
3	12	16:52:18	drop procedure emp	0 row(s) affected	0.078 sec
3	13	16:52:34	show procedure status	30 row(s) returned	0.031 sec / 0.000 sec
3	14	16:53:30	CREATE PROCEDURE EMP()
 BEGIN
 declare total int default 0;
 select count(e_name) into total from employee;
 select total;
 END	0 row(s) affected	0.031 sec
3	15	16:54:03	call EMP()	1 row(s) returned	0.125 sec / 0.000 sec
3	16	18:47:48	select * from employee
 LIMIT 0, 1000	5 row(s) returned	0.000 sec / 0.000 sec
0	17	18:49:42	CREATE PROCEDURE EMP(
 IN jdsc varchar(20)
 )
 BEGIN
 declare total int default 0;
 select count(e_name) into total
  from employee
  where e_name=jdsc;
 select total;
 END	Error Code: 1304. PROCEDURE EMP already exists	0.000 sec
3	18	18:50:19	drop procedure emp	0 row(s) affected	0.078 sec
3	19	18:50:23	CREATE PROCEDURE EMP(
 IN jdsc varchar(20)
 )
 BEGIN
 declare total int default 0;
 select count(e_name) into total
  from employee
  where e_name=jdsc;
 select total;
 END	0 row(s) affected	0.187 sec
3	20	18:50:27	call EMP('mounika')	1 row(s) returned	0.047 sec / 0.000 sec
3	21	18:54:04	call EMP('kumar')	1 row(s) returned	0.000 sec / 0.000 sec
3	22	18:54:12	call EMP('kuru')	1 row(s) returned	0.000 sec / 0.000 sec
3	23	19:13:27	select @total
 LIMIT 0, 1000	1 row(s) returned	0.000 sec / 0.000 sec
0	24	19:13:37	call EMP('kuru',@total)	Error Code: 1318. Incorrect number of arguments for PROCEDURE new.EMP; expected 1, got 2	0.000 sec
0	25	19:13:44	call EMP('mounika',@total)	Error Code: 1318. Incorrect number of arguments for PROCEDURE new.EMP; expected 1, got 2	0.000 sec
3	26	19:15:08	drop procedure emp	0 row(s) affected	0.094 sec
3	27	19:15:16	CREATE PROCEDURE EMP(
 IN jdsc varchar(20),
 OUT total int
 )
 BEGIN
 -- declare total int default 0;
 select count(e_name) into total
  from employee
  where e_name=jdsc;
 -- select total;
 END	0 row(s) affected	0.062 sec
3	28	19:15:23	select @total
 LIMIT 0, 1000	1 row(s) returned	0.000 sec / 0.000 sec
3	29	19:15:34	call EMP('kuru',@total)	1 row(s) affected	0.000 sec
3	30	19:15:39	call EMP('kuru',@total)	1 row(s) affected	0.000 sec
3	31	19:15:46	select @total
 LIMIT 0, 1000	1 row(s) returned	0.000 sec / 0.000 sec
3	32	19:15:55	SET @total=10	0 row(s) affected	0.047 sec
3	33	19:16:01	select @total
 LIMIT 0, 1000	1 row(s) returned	0.000 sec / 0.000 sec
3	34	19:17:07	select @total
 LIMIT 0, 1000	1 row(s) returned	0.016 sec / 0.000 sec
0	35	19:18:05	CREATE PROCEDURE EMP(
 IN jdsc varchar(20),
 OUT total int
 )
 BEGIN
 /* declare total int default 0;*/
 select count(e_name) into total
  from employee
  where e_name=jdsc;
 /* select total;*/
 END	Error Code: 1304. PROCEDURE EMP already exists	0.000 sec
3	36	19:18:08	select @total
 LIMIT 0, 1000	1 row(s) returned	0.000 sec / 0.000 sec
3	37	19:18:12	select @total
 LIMIT 0, 1000	1 row(s) returned	0.000 sec / 0.000 sec
3	38	19:28:52	CREATE PROCEDURE IncrCounter(
   INOUT counter int,
   IN incr int
 )
 BEGIN
   SET counter = counter + incr;
 END	0 row(s) affected	0.063 sec
3	39	19:30:21	SET @counter=5;
 CALL IncrCounter(@counter,2);
 select @counter;	0 row(s) affected	0.000 sec
3	40	19:30:21	SET @counter=5;
 CALL IncrCounter(@counter,2);
 select @counter;	1 row(s) returned	- / 0.000 sec
3	41	19:31:10	SET @counter=5;
 CALL IncrCounter(@counter,2);
 select @counter;
 CALL IncrCounter(@counter,3);
 select @counter;	0 row(s) affected	0.000 sec
3	42	19:31:10	SET @counter=5;
 CALL IncrCounter(@counter,2);
 select @counter;
 CALL IncrCounter(@counter,3);
 select @counter;	1 row(s) returned	- / 0.000 sec
3	43	19:31:10	SET @counter=5;
 CALL IncrCounter(@counter,2);
 select @counter;
 CALL IncrCounter(@counter,3);
 select @counter;	1 row(s) returned	- / 0.000 sec