{
  "rest": {
    "steps": [
      [
        [0, 0.4], [0, 0.4],
        [0, 0.4], [0, 0.4]
      ],
      [
        [0, 0.6], [0, 0.6],
        [0, 0.6], [0, 0.6]
      ],
      [
        [0, 0.425], [0, 0.425],
        [0, 0.425], [0, 0.425]
      ]
    ],
    "stepTime": 500,
    "interpolate": true
  },
  "walk": {
    "steps": [
      [
        [0, 0.5], [0, 0],
        [0, 0], [0, 0.5]
      ],
      [
        [0.5, 0.5], [0, 0],
        [0, 0], [0.5, 0.5]
      ],
      [
        [0.5, 0], [0, 0.5],
        [0, 0.5], [0.5, 0]
      ],
      [
        [0, 0], [0, 0.5],
        [0, 0.5], [0, 0]
      ],
      [
        [0, 0], [0.5, 0.5],
        [0.5, 0.5], [0, 0]
      ],
      [
        [0, 0], [0.5, 0],
        [0.5, 0], [0, 0]
      ]
    ],
    "stepTime": 100,
    "interpolate": false
  },
  "dance": {
    "steps": [
      [
        [0, 0.7], [0, 0.5],
        [0, 0.5], [0, 0.3]
      ],
      [
        [0, 0.7], [0, 0.5],
        [0, 0.5], [0, 0.3]
      ],
      [
        [0, 0.5], [0, 0.7],
        [0, 0.3], [0, 0.5]
      ],
      [
        [0, 0.5], [0, 0.7],
        [0, 0.3], [0, 0.5]
      ]
    ],
    "stepTime": 100,
    "interpolate": false
  }
}
