[
    "https://cdn.discordapp.com/emojis/777592308736589844.png?v=1",
    "https://cdn.discordapp.com/emojis/777590166201827330.png?v=1",
    "https://cdn.discordapp.com/emojis/777589855550439464.png?v=1",
    "https://cdn.discordapp.com/emojis/842896572382838805.png?v=1",
    "https://cdn.discordapp.com/emojis/233832831615369216.png?v=1",
    "https://cdn.discordapp.com/emojis/777592308605386782.png?v=1",
    "https://cdn.discordapp.com/emojis/233832831652986880.png?v=1",
    "https://cdn.discordapp.com/emojis/237080616917532672.png?v=1",
    "https://cdn.discordapp.com/emojis/560699081664626718.png?v=1",
    "https://cdn.discordapp.com/emojis/587127986478907392.png?v=1",
    "https://cdn.discordapp.com/emojis/777590482900353064.png?v=1",
    "https://cdn.discordapp.com/emojis/778343649665613855.png?v=1",
    "https://cdn.discordapp.com/emojis/777592308203126785.png?v=1",
    "https://cdn.discordapp.com/emojis/454801906502467584.png?v=1",
    "https://cdn.discordapp.com/emojis/233832831652986888.png?v=1",
    "https://cdn.discordapp.com/emojis/777590763148017674.png?v=1",
    "https://cdn.discordapp.com/emojis/454801906435620864.png?v=1",
    "https://cdn.discordapp.com/emojis/594756961359101962.png?v=1",
    "https://cdn.discordapp.com/emojis/454801906284363776.png?v=1",
    "https://cdn.discordapp.com/emojis/285491302651396096.png?v=1",
    "https://cdn.discordapp.com/emojis/777589696389185587.png?v=1",
    "https://cdn.discordapp.com/emojis/251183678091165706.png?v=1",
    "https://cdn.discordapp.com/emojis/779591975854014464.png?v=1",
    "https://cdn.discordapp.com/emojis/560202252971671552.png?v=1",
    "https://cdn.discordapp.com/emojis/285491302555189249.png?v=1",
    "https://cdn.discordapp.com/emojis/777591299771596850.png?v=1",
    "https://cdn.discordapp.com/emojis/560195533038288926.png?v=1",
    "https://cdn.discordapp.com/emojis/560202252418023465.png?v=1",
    "https://cdn.discordapp.com/emojis/560202252556697630.png?v=1",
    "https://cdn.discordapp.com/emojis/360576115728711690.png?v=1",
    "https://cdn.discordapp.com/emojis/560194475272437796.png?v=1",
    "https://cdn.discordapp.com/emojis/560195355820425216.png?v=1",
    "https://cdn.discordapp.com/emojis/560195310295449620.png?v=1",
    "https://cdn.discordapp.com/emojis/541339835156135936.png?v=1",
    "https://cdn.discordapp.com/emojis/777961923244458035.png?v=1",
    "https://cdn.discordapp.com/emojis/777961923366486066.png?v=1",
    "https://cdn.discordapp.com/emojis/701290060598738965.png?v=1",
    "https://cdn.discordapp.com/emojis/560201756408021037.png?v=1",
    "https://cdn.discordapp.com/emojis/560194296557600799.png?v=1",
    "https://cdn.discordapp.com/emojis/560195604014301184.png?v=1",
    "https://cdn.discordapp.com/emojis/651239277010616330.png?v=1",
    "https://cdn.discordapp.com/emojis/360594516299874324.png?v=1",
    "https://cdn.discordapp.com/emojis/777589975596269588.png?v=1",
    "https://cdn.discordapp.com/emojis/560194238642651147.png?v=1",
    "https://cdn.discordapp.com/emojis/560194518490546218.png?v=1",
    "https://cdn.discordapp.com/emojis/560194159693266946.png?v=1",
    "https://cdn.discordapp.com/emojis/590265041711005710.gif?v=1",
    "https://cdn.discordapp.com/emojis/590265041706680333.gif?v=1",
    "https://cdn.discordapp.com/emojis/842259411980124170.gif?v=1",
    "https://cdn.discordapp.com/emojis/825933232657793074.gif?v=1",
    "https://cdn.discordapp.com/emojis/825933232431824918.gif?v=1",
    "https://cdn.discordapp.com/emojis/764533160838430732.gif?v=1",
    "https://cdn.discordapp.com/emojis/590263768576032983.gif?v=1",
    "https://cdn.discordapp.com/emojis/590268283437973512.gif?v=1",
    "https://cdn.discordapp.com/emojis/590264382269816832.gif?v=1",
    "https://cdn.discordapp.com/emojis/710725795336683651.gif?v=1",
    "https://cdn.discordapp.com/emojis/777591408457809950.gif?v=1",
    "https://cdn.discordapp.com/emojis/826702176004866048.gif?v=1"
  ]