<svg width="19" height="19" viewBox="0 0 19 19" fill="none" xmlns="http://www.w3.org/2000/svg">
<path d="M2.85735 15.2919C2.41914 15.2919 2.04754 15.2367 1.74255 15.1262C1.43756 15.019 1.18866 14.8695 0.995845 14.6778C0.803034 14.486 0.662807 14.2602 0.575165 14.0002C0.49103 13.737 0.448962 13.4527 0.448962 13.1472C0.448962 12.9913 0.452468 12.7979 0.459479 12.5672C0.46649 12.3332 0.469996 12.0635 0.469996 11.7581C0.469996 11.4526 0.468243 11.1179 0.464737 10.754C0.461232 10.3868 0.450714 10.0196 0.433186 9.65238C0.419164 9.28518 0.396377 8.93261 0.364826 8.59466C0.336781 8.25671 0.296466 7.96263 0.243881 7.71242L1.81617 7.26886C1.86174 7.48333 1.89855 7.73679 1.9266 8.02925C1.95815 8.31845 1.98269 8.62228 2.00022 8.94074C2.01774 9.25919 2.03001 9.57927 2.03703 9.90097C2.04754 10.2227 2.05455 10.5216 2.05806 10.7978C2.06157 11.0415 2.05631 11.2983 2.04228 11.568C2.03177 11.8344 2.023 12.0911 2.01599 12.3381C2.00898 12.5818 2.01073 12.8028 2.02125 13.001C2.03527 13.1992 2.06858 13.3503 2.12116 13.4543C2.15271 13.5291 2.19127 13.5859 2.23685 13.6249C2.28593 13.6639 2.34202 13.6932 2.40512 13.7126C2.46822 13.7321 2.53658 13.7435 2.6102 13.7468C2.68733 13.75 2.77146 13.7516 2.86261 13.7516H3.00459V15.2919H2.85735Z" fill="#535353"/>
<path d="M7.35553 15.2773C7.1452 15.2773 6.92785 15.2562 6.70348 15.2139C6.47912 15.1749 6.25826 15.1213 6.04091 15.0531C5.82707 14.9848 5.62023 14.9068 5.42041 14.8191C5.22409 14.7281 5.04881 14.6355 4.89456 14.5413C4.77888 14.6843 4.65442 14.8045 4.52121 14.902C4.3915 14.9962 4.25127 15.0726 4.10053 15.1311C3.95329 15.1896 3.79203 15.2302 3.61675 15.2529C3.44497 15.2789 3.25917 15.2919 3.05935 15.2919H2.79642V13.7516H3.05935C3.29072 13.7516 3.48529 13.7078 3.64304 13.62C3.8008 13.5323 3.93576 13.4202 4.04795 13.2837C4.16013 13.144 4.25829 12.9913 4.34242 12.8255C4.43006 12.6566 4.51946 12.4925 4.6106 12.3332C4.71577 12.135 4.83321 11.9368 4.96292 11.7386C5.09614 11.5403 5.24863 11.3616 5.42041 11.2024C5.59219 11.0432 5.785 10.9148 5.99884 10.8173C6.2162 10.7166 6.45984 10.6662 6.72977 10.6662C7.09787 10.6662 7.41338 10.7458 7.6763 10.9051C7.94273 11.061 8.16184 11.2674 8.33361 11.5241C8.50539 11.7776 8.63159 12.0668 8.71222 12.3917C8.79636 12.7134 8.83843 13.0384 8.83843 13.3666C8.83843 13.6428 8.79461 13.8979 8.70697 14.1318C8.61932 14.3658 8.50539 14.5673 8.36516 14.7362C8.22494 14.9052 8.06543 15.0368 7.88664 15.1311C7.71136 15.2285 7.53432 15.2773 7.35553 15.2773ZM6.68245 12.1529C6.58078 12.1529 6.48613 12.1903 6.39849 12.265C6.31085 12.3365 6.22847 12.4258 6.15134 12.5331C6.07422 12.6403 6.0041 12.7573 5.941 12.884C5.88141 13.0108 5.82707 13.1277 5.77799 13.235C5.89368 13.3032 6.02514 13.3666 6.17238 13.4251C6.31961 13.4836 6.47211 13.5356 6.62986 13.581C6.78762 13.6233 6.94713 13.659 7.10839 13.6883C7.26965 13.7175 7.42389 13.7386 7.57113 13.7516C7.58866 13.5534 7.57814 13.3585 7.53958 13.1667C7.50102 12.975 7.43967 12.8044 7.35553 12.6549C7.2749 12.5055 7.17675 12.3852 7.06106 12.2942C6.94537 12.2 6.81917 12.1529 6.68245 12.1529Z" fill="#535353"/>
<path d="M9.17877 17.227C9.67307 17.136 10.1235 17.0207 10.5302 16.8809C10.9369 16.7444 11.2927 16.5901 11.5977 16.4179C11.9062 16.2489 12.1603 16.0685 12.3602 15.8768C12.5635 15.6851 12.7072 15.4901 12.7914 15.2919C12.6406 15.2919 12.4811 15.2887 12.3128 15.2822C12.1446 15.2789 12.0061 15.274 11.8974 15.2675C11.5503 15.2415 11.2348 15.1798 10.9509 15.0823C10.6669 14.9881 10.4215 14.8581 10.2147 14.6924C10.0114 14.5234 9.85361 14.3187 9.74143 14.0782C9.62925 13.8378 9.57316 13.5615 9.57316 13.2496C9.57316 13.0514 9.59595 12.8483 9.64152 12.6403C9.68709 12.4323 9.75195 12.2292 9.83608 12.031C9.92372 11.8328 10.0306 11.646 10.1568 11.4705C10.2866 11.295 10.432 11.1407 10.5933 11.0074C10.7546 10.8742 10.9316 10.7702 11.1244 10.6955C11.3207 10.6175 11.5311 10.5785 11.7554 10.5785C12.0219 10.5785 12.2673 10.624 12.4916 10.715C12.716 10.8027 12.9211 10.9229 13.1069 11.0757C13.2962 11.2284 13.4627 11.4087 13.6064 11.6167C13.7537 11.8214 13.8799 12.0424 13.985 12.2796C14.0937 12.5136 14.1813 12.7573 14.248 13.0108C14.3181 13.261 14.3671 13.5079 14.3952 13.7516H14.6213V15.2919H14.2848C14.148 15.7696 13.9289 16.2018 13.6275 16.5885C13.3295 16.9784 12.9719 17.318 12.5547 17.6072C12.1375 17.8964 11.673 18.1352 11.1612 18.3237C10.6529 18.5122 10.1218 18.6454 9.5679 18.7234L9.17877 17.227ZM11.7554 12.1236C11.6818 12.1106 11.5977 12.135 11.503 12.1968C11.4084 12.2552 11.3207 12.3365 11.2401 12.4405C11.1595 12.5412 11.0911 12.6533 11.035 12.7768C10.9789 12.9003 10.9526 13.0189 10.9561 13.1326C10.9596 13.2431 10.9982 13.3341 11.0718 13.4056C11.1454 13.4771 11.2401 13.5372 11.3558 13.5859C11.4715 13.6314 11.6012 13.6655 11.7449 13.6883C11.8922 13.711 12.0376 13.7273 12.1814 13.737C12.3251 13.7468 12.4601 13.7516 12.5863 13.7516H12.9123C12.8597 13.5502 12.7966 13.3568 12.723 13.1716C12.6529 12.9864 12.5705 12.8207 12.4758 12.6744C12.3812 12.5282 12.2743 12.4063 12.1551 12.3089C12.0359 12.2114 11.9027 12.1496 11.7554 12.1236Z" fill="#535353"/>
<path d="M14.4067 13.7516H15.6687C15.8195 13.7516 15.986 13.7451 16.1683 13.7321C16.3506 13.7159 16.5206 13.685 16.6784 13.6395C16.8396 13.594 16.9728 13.5274 17.078 13.4397C17.1867 13.3487 17.241 13.2301 17.241 13.0839C17.241 13.0059 17.2147 12.8905 17.1621 12.7378C17.1131 12.5818 17.0465 12.4096 16.9623 12.2211C16.8817 12.0294 16.7888 11.8296 16.6836 11.6216C16.582 11.4136 16.4803 11.2154 16.3786 11.0269L17.8826 10.3348C17.9807 10.5395 18.0771 10.7572 18.1718 10.9879C18.2699 11.2186 18.3576 11.4526 18.4347 11.6898C18.5118 11.927 18.5732 12.1643 18.6187 12.4015C18.6678 12.6354 18.6924 12.8597 18.6924 13.0741C18.6924 13.4771 18.6117 13.8199 18.4505 14.1026C18.2927 14.382 18.0771 14.6111 17.8037 14.7899C17.5302 14.9653 17.2095 15.0921 16.8414 15.1701C16.4733 15.2513 16.0789 15.2919 15.6582 15.2919H14.4067V13.7516ZM16.8571 8.72627L15.8686 9.64263L14.8484 8.7019L15.858 7.76116L16.8571 8.68727L17.8457 7.77091L18.8659 8.71165L17.8563 9.65238L16.8571 8.72627Z" fill="#535353"/>
<path d="M7.01824 8.90521C6.42654 8.90521 5.88816 8.83235 5.4031 8.68663C4.91804 8.54091 4.50179 8.32233 4.15434 8.03089C3.81032 7.74276 3.54199 7.38178 3.34935 6.94793C3.16014 6.51739 3.06554 6.01566 3.06554 5.44271C3.06554 4.89295 3.15498 4.34485 3.33387 3.7984C3.51619 3.25195 3.78452 2.7171 4.13886 2.19383L5.2999 2.9986C5.2311 3.08802 5.15025 3.22215 5.05737 3.40098C4.96449 3.57982 4.87504 3.7835 4.78904 4.01201C4.70304 4.24053 4.63079 4.48394 4.57231 4.74227C4.51383 4.99727 4.48459 5.244 4.48459 5.48245C4.48459 5.75733 4.54823 6.00572 4.67552 6.22761C4.80624 6.4495 4.97825 6.63993 5.19153 6.7989C5.40826 6.95787 5.65595 7.08206 5.9346 7.17148C6.21669 7.26089 6.5091 7.30892 6.81183 7.31554C7.17649 7.32216 7.52738 7.2758 7.86451 7.17644C8.20164 7.0804 8.49577 6.94296 8.7469 6.76412C9.00147 6.5886 9.201 6.3783 9.34549 6.13322C9.48997 5.89146 9.55533 5.62817 9.54157 5.34336C9.53469 5.20095 9.50717 5.04033 9.45901 4.86149C9.41085 4.68265 9.35237 4.5005 9.28356 4.31504C9.2182 4.12627 9.14424 3.94081 9.06167 3.75866C8.98255 3.5732 8.90687 3.4043 8.83463 3.25195C8.76582 3.09961 8.70562 2.96879 8.65402 2.8595C8.60242 2.75021 8.56974 2.6757 8.55598 2.63596L9.95955 1.88583C9.97331 1.89908 10.0077 1.96366 10.0628 2.07957C10.1178 2.19549 10.1814 2.34617 10.2537 2.53164C10.3294 2.71378 10.4085 2.92243 10.491 3.15757C10.5771 3.3927 10.6545 3.63612 10.7233 3.88782C10.7921 4.13952 10.8488 4.38956 10.8935 4.63794C10.9417 4.88633 10.9658 5.11484 10.9658 5.32349C10.9658 5.61824 10.9314 5.91133 10.8626 6.20277C10.7938 6.49421 10.6871 6.7724 10.5426 7.03735C10.4016 7.3056 10.2227 7.55233 10.006 7.77754C9.7927 8.00605 9.53985 8.2031 9.24744 8.36869C8.95503 8.5376 8.62306 8.66841 8.25153 8.76114C7.87999 8.85719 7.4689 8.90521 7.01824 8.90521ZM7.05436 2.92905L5.9088 1.82622L7.05436 0.723389L8.19992 1.82622L7.05436 2.92905Z" fill="#535353"/>
</svg>
