{
  "id": "fvtt-ja",
  "title": "日本語：FVTT（MRyas私家版）",
  "description": "FVTT環境を日本語化するモジュール（MRyas私家版）",
  "authors": [
    {
      "name": "MRyas.jp",
      "discord": "mryasjp",
      "flags": {}
    }
  ],
  "version": "2.2.20",
  "coreTranslation": true,
  "compatibility": {
    "minimum": "12",
    "verified": "12.331"
  },
  "languages": [
    {
      "lang": "ja",
      "name": "日本語",
      "path": "ja.json",
      "flags": {}
    }
  ],
  "esmodules": [
    "script/fvtt-ja.js"
  ],
  "url": "https://gitlab.com/MRyas.jp/fvtt-ja",
  "download": "https://gitlab.com/MRyas.jp/fvtt-ja/-/archive/v2.2.20/fvtt-ja.zip",
  "manifest": "https://gitlab.com/MRyas.jp/fvtt-ja/raw/v2.2.20/module.json"
}