#federated learning client baremetal address

nodeserf.cloudmmwunibo.it:3001

GET: returns a json file with the parameters:

parameters = {
    "port": "3001",
    "loss": "0.0",
    "average_loss_5": "0.0",
    "average_loss_10": "0.0",
    "epochs": "1",
    "batch_size": "1", 
    "ibus": "1", 
    "client_id": "0", 
    "topic_name": "prova",
    "server_address": "http://localhost:3000/",
    "broker_address": "as-sensiblecity1.cloudmmwunibo.it"
    }