<?xml version="1.0" standalone="no"?>
<!DOCTYPE svg PUBLIC "-//W3C//DTD SVG 20010904//EN"
 "http://www.w3.org/TR/2001/REC-SVG-20010904/DTD/svg10.dtd">
<svg version="1.0" xmlns="http://www.w3.org/2000/svg"
 width="200.000000pt" height="200.000000pt" viewBox="0 0 200.000000 200.000000"
 preserveAspectRatio="xMidYMid meet">
<metadata>
Created by potrace 1.11, written by Peter Selinger 2001-2013
</metadata>
<g transform="translate(0.000000,200.000000) scale(0.100000,-0.100000)"
fill="#000000" stroke="none">
<path d="M115 1956 c-38 -17 -64 -46 -79 -88 -8 -25 -11 -265 -11 -889 l0
-854 22 -35 c12 -19 37 -44 55 -55 32 -19 54 -20 899 -20 l866 0 35 25 c78 53
72 -19 73 950 0 846 -1 866 -20 899 -11 19 -33 43 -48 55 -28 21 -31 21 -895
23 -704 2 -873 0 -897 -11z"/>
</g>
</svg>
