EESchema Schematic File Version 4
EELAYER 30 0
EELAYER END
$Descr A4 11693 8268
encoding utf-8
Sheet 1 1
Title ""
Date ""
Rev ""
Comp ""
Comment1 ""
Comment2 ""
Comment3 ""
Comment4 ""
$EndDescr
$Comp
L Example-rescue:RES-US1206FAB-fab R1
U 1 1 5E610A2D
P 3150 1850
F 0 "R1" H 3150 2044 45  0000 C CNN
F 1 "100" H 3150 1960 45  0000 C CNN
F 2 "fab-R1206FAB" H 3180 2000 20  0001 C CNN
F 3 "" H 3150 1850 50  0001 C CNN
	1    3150 1850
	0    -1   -1   0   
$EndComp
$Comp
L Example-rescue:LEDFAB1206-fab M1
U 1 1 5E614D17
P 3550 1950
F 0 "M1" H 3628 2042 45  0000 L CNN
F 1 "LEDFAB1206" H 3628 1958 45  0000 L CNN
F 2 "fab-LED1206FAB" H 3580 2100 20  0001 C CNN
F 3 "" H 3550 1950 50  0001 C CNN
	1    3550 1950
	1    0    0    -1  
$EndComp
$Comp
L Example-rescue:LEDFAB1206-fab M2
U 1 1 5E616BBD
P 3200 5600
F 0 "M2" H 3278 5692 45  0000 L CNN
F 1 "LEDFAB1206" H 3278 5608 45  0000 L CNN
F 2 "fab-LED1206FAB" H 3230 5750 20  0001 C CNN
F 3 "" H 3200 5600 50  0001 C CNN
	1    3200 5600
	1    0    0    -1  
$EndComp
$Comp
L Example-rescue:RES-US1206FAB-fab R2
U 1 1 5E61C2E0
P 5300 1700
F 0 "R2" H 5300 1894 45  0000 C CNN
F 1 "10k" H 5300 1810 45  0000 C CNN
F 2 "fab-R1206FAB" H 5330 1850 20  0001 C CNN
F 3 "" H 5300 1700 50  0001 C CNN
	1    5300 1700
	1    0    0    -1  
$EndComp
$Comp
L Example-rescue:RES-US1206FAB-fab R3
U 1 1 5E61CCE6
P 3200 6000
F 0 "R3" V 3200 6194 45  0000 C CNN
F 1 "100" H 3200 6110 45  0000 C CNN
F 2 "fab-R1206FAB" H 3230 6150 20  0001 C CNN
F 3 "" H 3200 6000 50  0001 C CNN
	1    3200 6000
	0    -1   -1   0   
$EndComp
$Comp
L Example-rescue:CAP-UNPOLARIZEDFAB-fab C2
U 1 1 5E61D19A
P 1500 2150
F 0 "C2" V 1408 2238 45  0000 L CNN
F 1 "10uF" V 1492 2238 45  0000 L CNN
F 2 "fab-C1206FAB" H 1530 2300 20  0001 C CNN
F 3 "" H 1500 2150 50  0001 C CNN
	1    1500 2150
	0    1    1    0   
$EndComp
$Comp
L Example-rescue:FTDI-SMD-HEADER-fab M3
U 1 1 5E62080F
P 1300 1150
F 0 "M3" H 1300 1150 45  0001 C CNN
F 1 "FTDI-SMD-HEADER" H 1300 1150 45  0001 C CNN
F 2 "fab-1X06SMD" H 1330 1300 20  0001 C CNN
F 3 "" H 1300 1150 50  0001 C CNN
	1    1300 1150
	-1   0    0    1   
$EndComp
$Comp
L Example-rescue:6MM_SWITCH6MM_SWITCH-fab S1
U 1 1 5E621142
P 5850 1550
F 0 "S1" V 5521 1550 45  0000 C CNN
F 1 "6MM_SWITCH6MM_SWITCH" V 5605 1550 45  0000 C CNN
F 2 "fab-6MM_SWITCH" H 5880 1700 20  0001 C CNN
F 3 "" H 5850 1550 50  0001 C CNN
	1    5850 1550
	0    1    1    0   
$EndComp
$Comp
L Connector:Conn_01x09_Female J2
U 1 1 5E622692
P 4000 5850
F 0 "J2" V 4050 5900 50  0000 L CNN
F 1 "Conn_01x09_Female" V 4050 6000 50  0000 L CNN
F 2 "Connector_PinHeader_2.54mm:PinHeader_1x09_P2.54mm_Vertical" H 4000 5850 50  0001 C CNN
F 3 "~" H 4000 5850 50  0001 C CNN
	1    4000 5850
	0    1    1    0   
$EndComp
$Comp
L Connector:Conn_01x11_Female J1
U 1 1 5E623D94
P 1600 4200
F 0 "J1" H 1628 4226 50  0000 L CNN
F 1 "Conn_01x11_Female" H 1628 4135 50  0000 L CNN
F 2 "Connector_PinHeader_2.54mm:PinHeader_1x11_P2.54mm_Vertical" H 1600 4200 50  0001 C CNN
F 3 "~" H 1600 4200 50  0001 C CNN
	1    1600 4200
	-1   0    0    1   
$EndComp
$Comp
L Connector:Conn_01x13_Female J3
U 1 1 5E625AB2
P 5750 3750
F 0 "J3" H 5778 3776 50  0000 L CNN
F 1 "Conn_01x13_Female" H 5778 3685 50  0000 L CNN
F 2 "Connector_PinHeader_2.54mm:PinHeader_1x13_P2.54mm_Vertical" H 5750 3750 50  0001 C CNN
F 3 "~" H 5750 3750 50  0001 C CNN
	1    5750 3750
	1    0    0    -1  
$EndComp
Wire Notes Line
	700  2600 700  800 
Text Notes 1600 950  0    50   ~ 0
FTDI - POWER
Text GLabel 3750 1650 2    50   Input ~ 0
3V3
Text GLabel 3750 2250 2    50   Input ~ 0
GND
$Comp
L Regulator_Linear:LT1129-3.3_SOT223 U1
U 1 1 5E6458BB
P 1850 1650
F 0 "U1" H 1850 1892 50  0000 C CNN
F 1 "LT1129-3.3_SOT223" H 1850 1801 50  0000 C CNN
F 2 "Package_TO_SOT_SMD:SOT-223-3_TabPin2" H 1850 1875 50  0001 C CIN
F 3 "https://www.analog.com/media/en/technical-documentation/data-sheets/112935ff.pdf" H 1850 1600 50  0001 C CNN
	1    1850 1650
	1    0    0    -1  
$EndComp
Text GLabel 1700 1150 2    50   Input ~ 0
RX
Text GLabel 1700 1300 2    50   Input ~ 0
TX
Text GLabel 2400 3500 0    50   Input ~ 0
3V3
Wire Wire Line
	2400 3500 3000 3500
Wire Wire Line
	1300 1250 1700 1250
Wire Wire Line
	1700 1250 1700 1150
Wire Wire Line
	1300 1350 1700 1350
Wire Wire Line
	1700 1350 1700 1300
Text GLabel 2450 4800 0    50   Input ~ 0
GND
Wire Wire Line
	2450 4800 2900 4800
Text GLabel 6350 1650 2    50   Input ~ 0
GND
Text GLabel 4900 1700 0    50   Input ~ 0
3V3
Text GLabel 4850 1500 0    50   Input ~ 0
RESET
Wire Wire Line
	4900 1700 5100 1700
Wire Wire Line
	5650 1500 5650 1550
Wire Wire Line
	5500 1700 5500 1500
Connection ~ 5500 1500
Wire Wire Line
	5500 1500 5650 1500
Text GLabel 3500 6200 2    50   Input ~ 0
GND
Wire Wire Line
	1300 1450 1400 1450
Wire Wire Line
	1400 1450 1400 1650
$Comp
L Example-rescue:CAP-UNPOLARIZEDFAB-fab 0.1uF1
U 1 1 5E61B5AC
P 2400 1950
F 0 "0.1uF1" H 2300 2100 45  0000 L CNN
F 1 "C1" H 2392 2038 45  0000 L CNN
F 2 "fab-C1206FAB" H 2430 2100 20  0001 C CNN
F 3 "" H 2400 1950 50  0001 C CNN
	1    2400 1950
	0    1    1    0   
$EndComp
Wire Notes Line
	4200 800  4200 2600
Wire Notes Line
	700  800  4200 800 
Wire Notes Line
	700  2600 4200 2600
Wire Wire Line
	2150 1650 2400 1650
Connection ~ 3150 1650
Wire Wire Line
	3150 1650 3750 1650
Wire Wire Line
	1300 2250 1300 1650
Wire Wire Line
	1300 2250 1500 2250
Connection ~ 1500 2250
Wire Wire Line
	1500 2250 1850 2250
Connection ~ 1300 1650
Wire Wire Line
	1100 1650 1300 1650
Wire Wire Line
	1500 1950 1500 1650
Wire Wire Line
	1400 1650 1500 1650
Connection ~ 1500 1650
Wire Wire Line
	1500 1650 1550 1650
Wire Wire Line
	1850 1950 1850 2250
Connection ~ 1850 2250
Wire Wire Line
	1850 2250 2400 2250
Wire Wire Line
	2400 1750 2400 1650
Connection ~ 2400 1650
Wire Wire Line
	2400 1650 2700 1650
Wire Wire Line
	2400 2050 2400 2250
Connection ~ 2400 2250
Wire Wire Line
	2400 2250 2700 2250
Wire Wire Line
	3150 2050 3150 2100
Wire Wire Line
	3150 2100 3350 2100
Wire Wire Line
	3350 2100 3350 1750
Wire Wire Line
	3350 1750 3550 1750
Wire Wire Line
	3550 2050 3550 2250
Connection ~ 3550 2250
Wire Wire Line
	3550 2250 3750 2250
$Comp
L Example-rescue:SLIDE-SWITCH-fab S2
U 1 1 5E6A9F01
P 7750 1600
F 0 "S2" H 7750 1879 45  0000 C CNN
F 1 "SLIDE-SWITCH" H 7750 1795 45  0000 C CNN
F 2 "fab-AYZ0102AGRLC" H 7780 1750 20  0001 C CNN
F 3 "" H 7750 1600 50  0001 C CNN
	1    7750 1600
	1    0    0    -1  
$EndComp
Text GLabel 8100 1700 2    50   Input ~ 0
GND
Wire Wire Line
	7950 1700 8100 1700
Text GLabel 7350 1600 0    50   Input ~ 0
PROG
Wire Wire Line
	7350 1600 7550 1600
Wire Notes Line
	7000 950  8800 950 
Wire Notes Line
	8800 950  8800 2150
Wire Notes Line
	8800 2150 7000 2150
Wire Notes Line
	7000 2150 7000 950 
Text Notes 7600 1100 0    50   ~ 0
SLIDER SWITCH
Wire Notes Line
	4350 800  6900 800 
Wire Notes Line
	6900 800  6900 2150
Wire Notes Line
	6900 2150 4350 2150
Wire Notes Line
	4350 2150 4350 800 
Text Notes 5300 1000 0    50   ~ 0
RESET BUTTON
Wire Wire Line
	6050 1550 6050 1650
Wire Wire Line
	6050 1650 6350 1650
Connection ~ 6050 1650
Wire Wire Line
	1800 3800 3000 3800
Wire Wire Line
	1800 3900 3000 3900
Wire Wire Line
	1800 4100 3000 4100
Wire Wire Line
	1800 4200 1950 4200
Wire Wire Line
	1800 4000 3000 4000
Wire Wire Line
	1800 4300 3000 4300
Wire Wire Line
	1800 4400 3000 4400
Wire Wire Line
	1800 4500 3000 4500
Wire Wire Line
	1800 4600 3000 4600
Wire Wire Line
	4400 5150 4400 5650
Wire Wire Line
	4300 5150 4300 5650
Wire Wire Line
	4200 5150 4200 5650
Wire Wire Line
	4100 5150 4100 5650
Wire Wire Line
	4000 5150 4000 5650
Wire Wire Line
	3900 5150 3900 5650
Wire Wire Line
	3800 5150 3800 5650
Wire Wire Line
	3700 5150 3700 5650
Wire Wire Line
	3200 6200 3500 6200
Wire Wire Line
	3200 5800 3200 5700
Wire Wire Line
	3600 5650 3600 5400
Wire Wire Line
	3200 5400 3600 5400
Connection ~ 3600 5400
Wire Wire Line
	3600 5400 3600 5150
Wire Wire Line
	3500 5150 3500 5250
Wire Wire Line
	3500 5250 2900 5250
Wire Wire Line
	2900 5250 2900 4800
Connection ~ 2900 4800
Wire Wire Line
	2900 4800 3000 4800
Wire Wire Line
	4850 3950 5050 3950
Wire Wire Line
	5050 3950 5050 3850
Wire Wire Line
	4850 4050 5100 4050
Wire Wire Line
	5100 4050 5100 3950
Wire Wire Line
	4850 4150 5150 4150
Wire Wire Line
	5150 4150 5150 4050
Wire Wire Line
	4850 3350 5550 3350
Wire Wire Line
	4850 3450 5550 3450
Wire Wire Line
	4850 3550 5100 3550
Wire Wire Line
	4850 3650 5050 3650
Wire Wire Line
	4850 3750 5550 3750
Wire Wire Line
	5050 3850 5550 3850
Wire Wire Line
	5100 3950 5550 3950
Wire Wire Line
	5150 4050 5550 4050
Wire Wire Line
	4850 4250 5200 4250
Wire Wire Line
	5200 4250 5200 4150
Wire Wire Line
	5200 4150 5550 4150
Wire Wire Line
	4850 4350 5250 4350
Wire Wire Line
	5250 4350 5250 4250
Wire Wire Line
	5250 4250 5550 4250
Wire Wire Line
	4850 4450 5300 4450
Wire Wire Line
	5300 4450 5300 4350
Wire Wire Line
	5300 4350 5550 4350
Text GLabel 5300 4550 2    50   Input ~ 0
PROG
Text GLabel 5350 4750 2    50   Input ~ 0
GND
Wire Wire Line
	4850 4550 5300 4550
Wire Wire Line
	4850 1500 5500 1500
Wire Wire Line
	1800 3700 3000 3700
Text GLabel 5400 3250 0    50   Input ~ 0
GND
Text GLabel 5400 3100 0    50   Input ~ 0
3V3
Wire Wire Line
	5400 3250 5550 3250
Wire Wire Line
	5400 3100 5500 3100
Wire Wire Line
	5500 3100 5500 3150
Wire Wire Line
	5500 3150 5550 3150
Text GLabel 5000 3000 0    50   Input ~ 0
TX
Text GLabel 5000 2850 0    50   Input ~ 0
RX
Wire Wire Line
	5000 3000 5050 3000
Wire Wire Line
	5050 3000 5050 3650
Connection ~ 5050 3650
Wire Wire Line
	5050 3650 5550 3650
Wire Wire Line
	5000 2850 5100 2850
Wire Wire Line
	5100 2850 5100 3550
Connection ~ 5100 3550
Wire Wire Line
	5100 3550 5550 3550
Wire Wire Line
	1800 4700 1950 4700
Text GLabel 2450 3600 0    50   Input ~ 0
RESET
Wire Wire Line
	2450 3600 3000 3600
$Comp
L Example-rescue:CAP-UNPOLARIZEDFAB-fab 10uF1
U 1 1 5E9F6F7D
P 2700 1950
F 0 "10uF1" H 2600 2100 45  0000 L CNN
F 1 "C3" H 2692 2038 45  0000 L CNN
F 2 "fab-C1206FAB" H 2730 2100 20  0001 C CNN
F 3 "" H 2700 1950 50  0001 C CNN
	1    2700 1950
	0    1    1    0   
$EndComp
Wire Wire Line
	2700 1750 2700 1650
Connection ~ 2700 1650
Wire Wire Line
	2700 1650 3150 1650
Wire Wire Line
	2700 2050 2700 2250
Connection ~ 2700 2250
Wire Wire Line
	2700 2250 3550 2250
Text GLabel 1950 3400 0    50   Input ~ 0
BUTTON
Wire Wire Line
	1950 3400 1950 4200
Connection ~ 1950 4200
Wire Wire Line
	1950 4200 3000 4200
Text GLabel 1950 4950 0    50   Input ~ 0
LED
Wire Wire Line
	1950 4950 1950 4700
Connection ~ 1950 4700
Wire Wire Line
	1950 4700 3000 4700
Wire Wire Line
	4850 4750 5050 4750
$Comp
L Example-rescue:ESP32-WROOM-ESP32-footprints-Shem-Lib U2
U 1 1 5E60EF92
P 3950 4100
F 0 "U2" H 3925 5487 60  0000 C CNN
F 1 "ESP32-WROOM" H 3925 5381 60  0000 C CNN
F 2 "ESP32-footprints-Lib:ESP32-WROOM_FAB" H 4300 5450 60  0001 C CNN
F 3 "" H 3500 4550 60  0001 C CNN
	1    3950 4100
	1    0    0    -1  
$EndComp
Wire Wire Line
	5050 4650 5050 4750
Wire Wire Line
	4800 4650 4850 4650
Connection ~ 4850 4650
Wire Wire Line
	4850 4650 5050 4650
Connection ~ 5050 4750
Wire Wire Line
	5050 4750 5350 4750
Text GLabel 8300 2600 2    50   Input ~ 0
LED
Wire Wire Line
	7900 2600 8300 2600
Wire Wire Line
	7900 3000 7900 2900
Wire Wire Line
	7900 3400 8200 3400
Text GLabel 8200 3400 2    50   Input ~ 0
GND
$Comp
L Example-rescue:RES-US1206FAB-fab R5
U 1 1 5E7350D0
P 7900 3200
F 0 "R5" V 7900 3394 45  0000 C CNN
F 1 "100" H 7900 3310 45  0000 C CNN
F 2 "fab-R1206FAB" H 7930 3350 20  0001 C CNN
F 3 "" H 7900 3200 50  0001 C CNN
	1    7900 3200
	0    -1   -1   0   
$EndComp
$Comp
L Example-rescue:LEDFAB1206-fab M4
U 1 1 5E7350CA
P 7900 2800
F 0 "M4" H 7978 2892 45  0000 L CNN
F 1 "LEDFAB1206" H 7978 2808 45  0000 L CNN
F 2 "fab-LED1206FAB" H 7930 2950 20  0001 C CNN
F 3 "" H 7900 2800 50  0001 C CNN
	1    7900 2800
	1    0    0    -1  
$EndComp
Wire Wire Line
	8400 4550 8700 4550
Wire Wire Line
	8400 4450 8400 4550
Wire Wire Line
	7200 4400 7850 4400
Wire Wire Line
	7850 4400 8000 4400
Connection ~ 7850 4400
Wire Wire Line
	7850 4600 7850 4400
Wire Wire Line
	8000 4400 8000 4450
Wire Wire Line
	7250 4600 7450 4600
Text GLabel 7200 4400 0    50   Input ~ 0
BUTTON
Text GLabel 7250 4600 0    50   Input ~ 0
3V3
Text GLabel 8700 4550 2    50   Input ~ 0
GND
Connection ~ 8400 4550
$Comp
L Example-rescue:6MM_SWITCH6MM_SWITCH-fab S3
U 1 1 5E7475DC
P 8200 4450
F 0 "S3" V 7871 4450 45  0000 C CNN
F 1 "6MM_SWITCH6MM_SWITCH" V 7955 4450 45  0000 C CNN
F 2 "fab-6MM_SWITCH" H 8230 4600 20  0001 C CNN
F 3 "" H 8200 4450 50  0001 C CNN
	1    8200 4450
	0    1    1    0   
$EndComp
$Comp
L Example-rescue:RES-US1206FAB-fab R4
U 1 1 5E7475D6
P 7650 4600
F 0 "R4" H 7650 4794 45  0000 C CNN
F 1 "10k" H 7650 4710 45  0000 C CNN
F 2 "fab-R1206FAB" H 7680 4750 20  0001 C CNN
F 3 "" H 7650 4600 50  0001 C CNN
	1    7650 4600
	1    0    0    -1  
$EndComp
Wire Notes Line
	7350 2250 8800 2250
Wire Notes Line
	8800 2250 8800 3650
Wire Notes Line
	8800 3650 7350 3650
Wire Notes Line
	7350 3650 7350 2250
Text Notes 7950 2450 0    50   ~ 0
LED
Wire Notes Line
	9100 5050 6800 5050
Wire Notes Line
	6800 5050 6800 3750
Wire Notes Line
	6800 3750 9100 3750
Wire Notes Line
	9100 3750 9100 5050
Text Notes 7800 3900 0    50   ~ 0
BUTTON
$EndSCHEMATC
