;HEADER
;Start_gcode
G21                     ; Set to metric [change to G20 if you want Imperial]
G90                     ; Force coordinates to be absolute relative to the origin
G28                     ; Home X/Y/Z axis
M117 Printing...
;ENDHEADER
;Layer #

G28
G0 Z30 F3000
G0 X94.32 Y405.73 Z29.00 F2500
G1 X94.32 Y405.73 Z10.00 F2500
G1 X98.79 Y394.52 Z10.00 F2500
G1 X102.72 Y383.07 Z10.00 F2500
G1 X106.07 Y371.40 Z10.00 F2500
G1 X108.83 Y359.57 Z10.00 F2500
G1 X110.95 Y347.60 Z10.00 F2500
G1 X112.41 Y335.54 Z10.00 F2500
G1 X113.17 Y323.43 Z10.00 F2500
G1 X113.21 Y311.31 Z10.00 F2500
G1 X112.59 Y300.33 Z10.00 F2500
G1 X111.37 Y289.40 Z10.00 F2500
G1 X109.59 Y278.54 Z10.00 F2500
G1 X107.25 Y267.79 Z10.00 F2500
G1 X104.40 Y257.16 Z10.00 F2500
G1 X101.05 Y246.69 Z10.00 F2500
G1 X97.23 Y236.40 Z10.00 F2500
G1 X92.97 Y226.33 Z10.00 F2500
G0 X92.97 Y226.33 Z29.00 F2500
G0 X113.28 Y315.87 Z29.00 F2500
G1 X113.28 Y315.87 Z10.00 F2500
G1 X161.76 Y315.87 Z10.00 F2500
G0 X161.76 Y315.87 Z29.00 F2500
G0 X464.10 Y361.95 Z29.00 F2500
G1 X464.10 Y361.95 Z10.00 F2500
G1 X453.48 Y253.10 Z10.00 F2500
G0 X453.48 Y253.10 Z29.00 F2500
G0 X451.66 Y234.43 Z29.00 F2500
G1 X451.66 Y234.43 Z10.00 F2500
G1 X449.96 Y233.49 Z10.00 F2500
G1 X448.57 Y231.98 Z10.00 F2500
G1 X447.65 Y230.13 Z10.00 F2500
G1 X447.34 Y228.13 Z10.00 F2500
G1 X447.55 Y226.73 Z10.00 F2500
G1 X448.09 Y225.38 Z10.00 F2500
G1 X448.92 Y224.08 Z10.00 F2500
G1 X450.00 Y222.86 Z10.00 F2500
G1 X452.72 Y220.66 Z10.00 F2500
G1 X455.90 Y218.90 Z10.00 F2500
G1 X459.22 Y217.68 Z10.00 F2500
G1 X462.32 Y217.09 Z10.00 F2500
G1 X463.68 Y217.07 Z10.00 F2500
G1 X464.86 Y217.25 Z10.00 F2500
G1 X465.82 Y217.64 Z10.00 F2500
G1 X466.50 Y218.26 Z10.00 F2500
G1 X466.90 Y219.12 Z10.00 F2500
G1 X466.99 Y220.19 Z10.00 F2500
G1 X466.82 Y221.42 Z10.00 F2500
G1 X466.40 Y222.78 Z10.00 F2500
G1 X464.93 Y225.73 Z10.00 F2500
G1 X462.79 Y228.70 Z10.00 F2500
G1 X460.19 Y231.37 Z10.00 F2500
G1 X457.33 Y233.43 Z10.00 F2500
G1 X455.86 Y234.13 Z10.00 F2500
G1 X454.42 Y234.56 Z10.00 F2500
G1 X453.01 Y234.67 Z10.00 F2500
G1 X451.66 Y234.43 Z10.00 F2500
G0 X451.66 Y234.43 Z29.00 F2500
G0 X172.56 Y358.52 Z29.00 F2500
G1 X172.56 Y358.52 Z10.00 F2500
G1 X169.41 Y348.30 Z10.00 F2500
G1 X166.90 Y338.10 Z10.00 F2500
G1 X161.76 Y315.87 Z10.00 F2500
G1 X155.66 Y292.93 Z10.00 F2500
G1 X152.88 Y281.10 Z10.00 F2500
G1 X151.77 Y275.32 Z10.00 F2500
G1 X150.94 Y269.71 Z10.00 F2500
G1 X150.44 Y264.33 Z10.00 F2500
G1 X150.35 Y259.24 Z10.00 F2500
G1 X150.73 Y254.52 Z10.00 F2500
G1 X151.63 Y250.21 Z10.00 F2500
G1 X153.12 Y246.39 Z10.00 F2500
G1 X154.10 Y244.69 Z10.00 F2500
G1 X155.26 Y243.12 Z10.00 F2500
G1 X156.60 Y241.71 Z10.00 F2500
G1 X158.12 Y240.46 Z10.00 F2500
G1 X159.84 Y239.38 Z10.00 F2500
G1 X161.76 Y238.47 Z10.00 F2500
G1 X165.74 Y237.31 Z10.00 F2500
G1 X170.16 Y236.85 Z10.00 F2500
G1 X172.45 Y236.92 Z10.00 F2500
G1 X174.76 Y237.21 Z10.00 F2500
G1 X177.05 Y237.72 Z10.00 F2500
G1 X179.30 Y238.47 Z10.00 F2500
G1 X181.53 Y239.50 Z10.00 F2500
G1 X183.68 Y240.78 Z10.00 F2500
G1 X185.74 Y242.29 Z10.00 F2500
G1 X187.72 Y244.02 Z10.00 F2500
G1 X191.41 Y248.04 Z10.00 F2500
G1 X194.74 Y252.70 Z10.00 F2500
G1 X197.72 Y257.86 Z10.00 F2500
G1 X200.32 Y263.36 Z10.00 F2500
G1 X202.56 Y269.07 Z10.00 F2500
G1 X204.42 Y274.84 Z10.00 F2500
G1 X205.89 Y280.53 Z10.00 F2500
G1 X206.97 Y285.99 Z10.00 F2500
G1 X207.66 Y291.08 Z10.00 F2500
G1 X207.94 Y295.65 Z10.00 F2500
G1 X207.82 Y299.57 Z10.00 F2500
G1 X207.28 Y302.68 Z10.00 F2500
G1 X206.85 Y303.89 Z10.00 F2500
G1 X206.32 Y304.84 Z10.00 F2500
G1 X205.68 Y305.52 Z10.00 F2500
G1 X204.93 Y305.91 Z10.00 F2500
G1 X204.08 Y306.00 Z10.00 F2500
G1 X203.12 Y305.79 Z10.00 F2500
G1 X200.97 Y304.56 Z10.00 F2500
G1 X198.54 Y302.33 Z10.00 F2500
G1 X195.92 Y299.23 Z10.00 F2500
G1 X193.20 Y295.39 Z10.00 F2500
G1 X190.44 Y290.91 Z10.00 F2500
G1 X187.75 Y285.93 Z10.00 F2500
G1 X185.18 Y280.57 Z10.00 F2500
G1 X182.84 Y274.95 Z10.00 F2500
G1 X180.79 Y269.18 Z10.00 F2500
G1 X179.12 Y263.40 Z10.00 F2500
G1 X177.91 Y257.72 Z10.00 F2500
G1 X177.24 Y252.26 Z10.00 F2500
G1 X177.20 Y247.16 Z10.00 F2500
G1 X177.43 Y244.77 Z10.00 F2500
G1 X177.86 Y242.52 Z10.00 F2500
G1 X178.48 Y240.41 Z10.00 F2500
G1 X179.30 Y238.47 Z10.00 F2500
G1 X180.62 Y236.30 Z10.00 F2500
G1 X182.25 Y234.40 Z10.00 F2500
G1 X184.17 Y232.76 Z10.00 F2500
G1 X186.34 Y231.38 Z10.00 F2500
G1 X188.76 Y230.26 Z10.00 F2500
G1 X191.38 Y229.38 Z10.00 F2500
G1 X194.19 Y228.75 Z10.00 F2500
G1 X197.16 Y228.35 Z10.00 F2500
G1 X200.27 Y228.19 Z10.00 F2500
G1 X203.49 Y228.25 Z10.00 F2500
G1 X206.80 Y228.53 Z10.00 F2500
G1 X210.18 Y229.03 Z10.00 F2500
G1 X217.02 Y230.65 Z10.00 F2500
G1 X223.81 Y233.07 Z10.00 F2500
G1 X228.71 Y235.35 Z10.00 F2500
G1 X233.48 Y238.02 Z10.00 F2500
G1 X238.11 Y241.03 Z10.00 F2500
G1 X242.58 Y244.38 Z10.00 F2500
G1 X246.91 Y248.01 Z10.00 F2500
G1 X251.08 Y251.92 Z10.00 F2500
G1 X255.09 Y256.05 Z10.00 F2500
G1 X258.94 Y260.40 Z10.00 F2500
G1 X262.61 Y264.92 Z10.00 F2500
G1 X266.11 Y269.58 Z10.00 F2500
G1 X269.42 Y274.37 Z10.00 F2500
G1 X272.55 Y279.24 Z10.00 F2500
G1 X278.24 Y289.12 Z10.00 F2500
G1 X283.12 Y298.99 Z10.00 F2500
G1 X287.16 Y308.61 Z10.00 F2500
G1 X290.32 Y317.75 Z10.00 F2500
G1 X292.55 Y326.17 Z10.00 F2500
G1 X293.83 Y333.62 Z10.00 F2500
G1 X294.10 Y336.91 Z10.00 F2500
G1 X294.11 Y339.88 Z10.00 F2500
G1 X293.86 Y342.48 Z10.00 F2500
G1 X293.35 Y344.70 Z10.00 F2500
G1 X292.57 Y346.50 Z10.00 F2500
G1 X291.51 Y347.84 Z10.00 F2500
G1 X290.18 Y348.72 Z10.00 F2500
G1 X288.56 Y349.08 Z10.00 F2500
G1 X287.24 Y349.02 Z10.00 F2500
G1 X285.80 Y348.70 Z10.00 F2500
G1 X282.56 Y347.33 Z10.00 F2500
G1 X278.94 Y345.04 Z10.00 F2500
G1 X275.03 Y341.92 Z10.00 F2500
G1 X270.94 Y338.05 Z10.00 F2500
G1 X266.76 Y333.50 Z10.00 F2500
G1 X262.59 Y328.36 Z10.00 F2500
G1 X258.52 Y322.69 Z10.00 F2500
G1 X254.65 Y316.59 Z10.00 F2500
G1 X251.08 Y310.12 Z10.00 F2500
G1 X247.90 Y303.37 Z10.00 F2500
G1 X245.22 Y296.42 Z10.00 F2500
G1 X243.13 Y289.34 Z10.00 F2500
G1 X241.72 Y282.21 Z10.00 F2500
G1 X241.31 Y278.65 Z10.00 F2500
G1 X241.10 Y275.12 Z10.00 F2500
G1 X241.12 Y271.61 Z10.00 F2500
G1 X241.36 Y268.13 Z10.00 F2500
G1 X242.07 Y263.54 Z10.00 F2500
G1 X243.19 Y259.06 Z10.00 F2500
G1 X244.70 Y254.73 Z10.00 F2500
G1 X246.56 Y250.56 Z10.00 F2500
G1 X248.74 Y246.58 Z10.00 F2500
G1 X251.22 Y242.83 Z10.00 F2500
G1 X253.97 Y239.32 Z10.00 F2500
G1 X256.96 Y236.10 Z10.00 F2500
G1 X260.15 Y233.18 Z10.00 F2500
G1 X263.53 Y230.59 Z10.00 F2500
G1 X267.06 Y228.36 Z10.00 F2500
G1 X270.71 Y226.52 Z10.00 F2500
G1 X274.45 Y225.09 Z10.00 F2500
G1 X278.25 Y224.10 Z10.00 F2500
G1 X282.10 Y223.58 Z10.00 F2500
G1 X285.94 Y223.56 Z10.00 F2500
G1 X290.26 Y224.16 Z10.00 F2500
G1 X294.54 Y225.38 Z10.00 F2500
G1 X298.77 Y227.18 Z10.00 F2500
G1 X302.94 Y229.53 Z10.00 F2500
G1 X307.05 Y232.37 Z10.00 F2500
G1 X311.08 Y235.68 Z10.00 F2500
G1 X315.02 Y239.40 Z10.00 F2500
G1 X318.86 Y243.50 Z10.00 F2500
G1 X322.60 Y247.93 Z10.00 F2500
G1 X326.23 Y252.65 Z10.00 F2500
G1 X329.73 Y257.63 Z10.00 F2500
G1 X333.09 Y262.81 Z10.00 F2500
G1 X339.38 Y273.64 Z10.00 F2500
G1 X345.02 Y284.80 Z10.00 F2500
G1 X349.93 Y295.97 Z10.00 F2500
G1 X354.03 Y306.81 Z10.00 F2500
G1 X357.25 Y316.99 Z10.00 F2500
G1 X359.52 Y326.17 Z10.00 F2500
G1 X360.27 Y330.28 Z10.00 F2500
G1 X360.75 Y334.02 Z10.00 F2500
G1 X360.95 Y337.35 Z10.00 F2500
G1 X360.87 Y340.21 Z10.00 F2500
G1 X360.49 Y342.58 Z10.00 F2500
G1 X359.80 Y344.41 Z10.00 F2500
G1 X358.80 Y345.66 Z10.00 F2500
G1 X357.47 Y346.28 Z10.00 F2500
G1 X356.17 Y346.31 Z10.00 F2500
G1 X354.67 Y345.93 Z10.00 F2500
G1 X352.99 Y345.16 Z10.00 F2500
G1 X351.14 Y344.02 Z10.00 F2500
G1 X347.04 Y340.72 Z10.00 F2500
G1 X342.51 Y336.20 Z10.00 F2500
G1 X337.68 Y330.60 Z10.00 F2500
G1 X332.71 Y324.10 Z10.00 F2500
G1 X327.74 Y316.85 Z10.00 F2500
G1 X322.90 Y309.01 Z10.00 F2500
G1 X318.35 Y300.75 Z10.00 F2500
G1 X314.22 Y292.23 Z10.00 F2500
G1 X310.67 Y283.61 Z10.00 F2500
G1 X307.83 Y275.06 Z10.00 F2500
G1 X306.72 Y270.85 Z10.00 F2500
G1 X305.84 Y266.72 Z10.00 F2500
G1 X305.21 Y262.68 Z10.00 F2500
G1 X304.85 Y258.77 Z10.00 F2500
G1 X304.78 Y254.98 Z10.00 F2500
G1 X305.01 Y251.36 Z10.00 F2500
G1 X305.56 Y247.91 Z10.00 F2500
G1 X306.45 Y244.65 Z10.00 F2500
G1 X308.01 Y241.00 Z10.00 F2500
G1 X310.06 Y237.66 Z10.00 F2500
G1 X312.61 Y234.64 Z10.00 F2500
G1 X315.63 Y231.94 Z10.00 F2500
G1 X319.09 Y229.54 Z10.00 F2500
G1 X322.99 Y227.46 Z10.00 F2500
G1 X327.31 Y225.69 Z10.00 F2500
G1 X332.02 Y224.23 Z10.00 F2500
G1 X337.10 Y223.08 Z10.00 F2500
G1 X342.55 Y222.23 Z10.00 F2500
G1 X348.34 Y221.69 Z10.00 F2500
G1 X354.45 Y221.45 Z10.00 F2500
G1 X360.87 Y221.52 Z10.00 F2500
G1 X367.57 Y221.89 Z10.00 F2500
G1 X374.54 Y222.56 Z10.00 F2500
G1 X381.76 Y223.53 Z10.00 F2500
G1 X390.06 Y225.00 Z10.00 F2500
G1 X398.14 Y227.07 Z10.00 F2500
G1 X401.94 Y228.40 Z10.00 F2500
G1 X405.49 Y229.96 Z10.00 F2500
G1 X408.74 Y231.77 Z10.00 F2500
G1 X411.62 Y233.87 Z10.00 F2500
G1 X414.58 Y236.86 Z10.00 F2500
G1 X416.91 Y240.25 Z10.00 F2500
G1 X418.67 Y243.97 Z10.00 F2500
G1 X419.88 Y247.95 Z10.00 F2500
G1 X420.57 Y252.11 Z10.00 F2500
G1 X420.79 Y256.38 Z10.00 F2500
G1 X420.56 Y260.69 Z10.00 F2500
G1 X419.94 Y264.97 Z10.00 F2500
G1 X418.94 Y269.15 Z10.00 F2500
G1 X417.61 Y273.15 Z10.00 F2500
G1 X415.98 Y276.90 Z10.00 F2500
G1 X414.09 Y280.32 Z10.00 F2500
G1 X411.98 Y283.36 Z10.00 F2500
G1 X409.68 Y285.93 Z10.00 F2500
G1 X407.22 Y287.96 Z10.00 F2500
G1 X404.65 Y289.39 Z10.00 F2500
G1 X402.59 Y290.04 Z10.00 F2500
G1 X400.49 Y290.30 Z10.00 F2500
G1 X398.37 Y290.21 Z10.00 F2500
G1 X396.24 Y289.78 Z10.00 F2500
G1 X394.12 Y289.04 Z10.00 F2500
G1 X392.01 Y288.02 Z10.00 F2500
G1 X389.93 Y286.75 Z10.00 F2500
G1 X387.90 Y285.25 Z10.00 F2500
G1 X384.02 Y281.67 Z10.00 F2500
G1 X380.48 Y277.50 Z10.00 F2500
G1 X377.38 Y272.93 Z10.00 F2500
G1 X374.83 Y268.19 Z10.00 F2500
G1 X372.82 Y263.19 Z10.00 F2500
G1 X371.49 Y258.22 Z10.00 F2500
G1 X370.79 Y253.28 Z10.00 F2500
G1 X370.66 Y248.37 Z10.00 F2500
G1 X371.06 Y243.50 Z10.00 F2500
G1 X371.94 Y238.65 Z10.00 F2500
G1 X373.23 Y233.83 Z10.00 F2500
G1 X374.89 Y229.03 Z10.00 F2500
G0 X374.89 Y229.03 Z29.00 F2500
;FOOTER
; end_gcode
G28 X Y
G0 Z100 				; HOME
G90                             ; absolute positioning
;ENDFOOTER
