EESchema Schematic File Version 4
EELAYER 30 0
EELAYER END
$Descr A4 11693 8268
encoding utf-8
Sheet 1 1
Title ""
Date ""
Rev ""
Comp ""
Comment1 ""
Comment2 ""
Comment3 ""
Comment4 ""
$EndDescr
$Comp
L fab:LEDFAB1206 LED2
U 1 1 5E61CA3E
P 4700 5700
F 0 "LED2" H 4778 5792 45  0000 L CNN
F 1 "GREEN" H 4778 5708 45  0000 L CNN
F 2 "fab:fab-LED1206FAB" H 4730 5850 20  0001 C CNN
F 3 "" H 4700 5700 50  0001 C CNN
	1    4700 5700
	1    0    0    -1  
$EndComp
$Comp
L fab:LEDFAB1206 LED1
U 1 1 5E61DF5A
P 3950 1450
F 0 "LED1" H 4028 1542 45  0000 L CNN
F 1 "RED" H 4028 1458 45  0000 L CNN
F 2 "fab:fab-LED1206FAB" H 3980 1600 20  0001 C CNN
F 3 "" H 3950 1450 50  0001 C CNN
	1    3950 1450
	1    0    0    -1  
$EndComp
$Comp
L fab:CAP-UNPOLARIZEDFAB C1
U 1 1 5E61F4D1
P 2700 1350
F 0 "C1" H 2650 1564 45  0000 C CNN
F 1 "0.1 uF" H 2650 1480 45  0000 C CNN
F 2 "fab:fab-C1206FAB" H 2730 1500 20  0001 C CNN
F 3 "" H 2700 1350 50  0001 C CNN
	1    2700 1350
	0    1    1    0   
$EndComp
$Comp
L fab:CAP-UNPOLARIZEDFAB C2
U 1 1 5E61FCC7
P 1500 1600
F 0 "C2" H 1450 1814 45  0000 C CNN
F 1 "10 uF" H 1450 1730 45  0000 C CNN
F 2 "fab:fab-C1206FAB" H 1530 1750 20  0001 C CNN
F 3 "" H 1500 1600 50  0001 C CNN
	1    1500 1600
	0    1    1    0   
$EndComp
$Comp
L fab:CAP-UNPOLARIZEDFAB C3
U 1 1 5E6205A4
P 3050 1350
F 0 "C3" H 3000 1564 45  0000 C CNN
F 1 "10 uF" H 3000 1480 45  0000 C CNN
F 2 "fab:fab-C1206FAB" H 3080 1500 20  0001 C CNN
F 3 "" H 3050 1350 50  0001 C CNN
	1    3050 1350
	0    1    1    0   
$EndComp
$Comp
L fab:SLIDE-SWITCH S1
U 1 1 5E623CA1
P 8550 1250
F 0 "S1" H 8550 1529 45  0000 C CNN
F 1 "SLIDE-SWITCH" H 8550 1445 45  0000 C CNN
F 2 "fab:fab-AYZ0102AGRLC" H 8580 1400 20  0001 C CNN
F 3 "" H 8550 1250 50  0001 C CNN
	1    8550 1250
	-1   0    0    1   
$EndComp
$Comp
L fab:6MM_SWITCH6MM_SWITCH RESET1
U 1 1 5E6285E1
P 6350 900
F 0 "RESET1" H 6503 942 45  0000 L CNN
F 1 "S1" H 6503 858 45  0000 L CNN
F 2 "fab:fab-6MM_SWITCH" H 6380 1050 20  0001 C CNN
F 3 "" H 6350 900 50  0001 C CNN
	1    6350 900 
	0    1    1    0   
$EndComp
$Comp
L Connector:Conn_01x09_Female J3
U 1 1 5E629FE2
P 5500 5500
F 0 "J3" H 5528 5526 50  0000 L CNN
F 1 "Conn_01x09_Female" H 5528 5435 50  0000 L CNN
F 2 "Connector_PinHeader_2.54mm:PinHeader_1x09_P2.54mm_Vertical" H 5500 5500 50  0001 C CNN
F 3 "~" H 5500 5500 50  0001 C CNN
	1    5500 5500
	0    1    1    0   
$EndComp
$Comp
L fab:FTDI-SMD-HEADER M1
U 1 1 5E63067C
P 1200 950
F 0 "M1" H 1200 950 45  0001 C CNN
F 1 "FTDI-SMD-HEADER" H 1200 950 45  0001 C CNN
F 2 "fab:fab-1X06SMD" H 1230 1100 20  0001 C CNN
F 3 "" H 1200 950 50  0001 C CNN
	1    1200 950 
	-1   0    0    1   
$EndComp
Text Notes 3150 850  0    50   ~ 0
FTDI POWER
Text GLabel 4200 1150 2    50   Input ~ 0
3V3
Text GLabel 4200 1700 2    50   Input ~ 0
GND
Text GLabel 1900 650  2    50   Input ~ 0
RXD
Text GLabel 1900 800  2    50   Input ~ 0
TXD
Text GLabel 6600 4600 2    50   Input ~ 0
GND
Wire Wire Line
	1900 650  1350 650 
Wire Wire Line
	1350 650  1350 1050
Wire Wire Line
	1350 1050 1200 1050
Wire Wire Line
	1900 800  1450 800 
Wire Wire Line
	1450 800  1450 1150
Wire Wire Line
	1450 1150 1200 1150
Wire Wire Line
	1850 1150 1600 1150
Wire Wire Line
	1600 1150 1600 1250
Wire Wire Line
	1600 1250 1500 1250
Connection ~ 1500 1250
Wire Wire Line
	1500 1250 1200 1250
Wire Wire Line
	1500 1250 1500 1400
Wire Wire Line
	1200 1450 1350 1450
Wire Wire Line
	1350 1450 1350 1700
Wire Wire Line
	1350 1700 1500 1700
Connection ~ 1500 1700
Wire Wire Line
	2700 1150 3050 1150
Wire Wire Line
	2700 1700 2700 1450
Wire Wire Line
	4200 1700 3950 1700
Connection ~ 2700 1700
Wire Wire Line
	3050 1150 3450 1150
Connection ~ 3050 1150
Wire Wire Line
	3050 1450 3050 1700
Connection ~ 3050 1700
Wire Wire Line
	3050 1700 2700 1700
Wire Wire Line
	3450 1150 3450 1250
Connection ~ 3450 1150
Wire Wire Line
	3450 1150 4200 1150
Wire Wire Line
	3450 1650 3750 1650
Wire Wire Line
	3750 1650 3750 1250
Wire Wire Line
	3750 1250 3950 1250
Wire Wire Line
	3950 1550 3950 1700
Connection ~ 3950 1700
Wire Wire Line
	3950 1700 3050 1700
Wire Bus Line
	550  550  550  2000
Wire Bus Line
	550  2000 4500 2000
Wire Bus Line
	4500 2000 4500 550 
Wire Bus Line
	4500 550  550  550 
Text GLabel 5800 900  0    50   Input ~ 0
RESET
Text GLabel 5050 1350 0    50   Input ~ 0
3V3
Wire Wire Line
	5050 1350 5500 1350
Wire Wire Line
	5800 900  5900 900 
Wire Wire Line
	5900 1350 5900 900 
Connection ~ 5900 900 
Wire Wire Line
	5900 900  6150 900 
Wire Wire Line
	6150 1000 6150 900 
Connection ~ 6150 900 
Text GLabel 6800 1100 2    50   Input ~ 0
GND
Wire Wire Line
	6550 900  6550 1000
Wire Wire Line
	6550 1100 6800 1100
Wire Wire Line
	6550 1000 6550 1100
Connection ~ 6550 1000
Wire Bus Line
	4700 550  7150 550 
Wire Bus Line
	7150 550  7150 2000
Wire Bus Line
	7150 2000 4700 2000
Wire Bus Line
	4700 2000 4700 550 
Text Notes 5650 1900 0    50   ~ 0
RESET BUTTON
Text GLabel 8100 1350 0    50   Input ~ 0
GND
Text GLabel 9000 1250 2    50   Input ~ 0
PROG
Wire Wire Line
	8750 1250 9000 1250
Wire Bus Line
	7500 550  9500 550 
Wire Bus Line
	9500 550  9500 2000
Wire Bus Line
	9500 2000 7500 2000
Wire Bus Line
	7500 2000 7500 550 
Text Notes 8250 1900 0    50   ~ 0
SLIDER SWITCH
Text GLabel 4150 3350 0    50   Input ~ 0
3V3
Wire Wire Line
	4150 3350 4500 3350
Wire Wire Line
	4200 3450 4500 3450
Wire Wire Line
	4500 3550 3850 3550
Wire Wire Line
	3850 3650 4500 3650
Wire Wire Line
	4500 3750 3900 3750
Wire Wire Line
	3850 3850 3900 3850
Wire Wire Line
	4500 3950 3850 3950
Wire Wire Line
	3850 4050 4500 4050
Wire Wire Line
	4500 4150 3850 4150
Wire Wire Line
	3850 4250 4500 4250
Wire Wire Line
	4500 4350 3850 4350
Wire Wire Line
	3850 4450 4500 4450
Wire Wire Line
	4500 4550 3850 4550
Text GLabel 5000 6650 2    50   Input ~ 0
GND
Wire Wire Line
	5100 5250 4700 5250
Wire Wire Line
	4700 5250 4700 5500
Wire Wire Line
	5100 5250 5100 5300
Wire Wire Line
	4700 5800 4700 6050
Wire Wire Line
	4700 6450 4700 6650
Wire Wire Line
	4700 6650 5000 6650
Wire Wire Line
	6350 3200 7500 3200
Wire Wire Line
	7500 3300 6350 3300
Wire Wire Line
	6350 3400 6900 3400
Wire Wire Line
	7500 3500 6800 3500
Wire Wire Line
	6350 3600 7500 3600
Wire Wire Line
	7500 3700 6500 3700
Wire Wire Line
	6500 3700 6500 3800
Wire Wire Line
	6500 3800 6350 3800
Wire Wire Line
	6350 3900 6550 3900
Wire Wire Line
	6550 3900 6550 3800
Wire Wire Line
	6550 3800 7500 3800
Wire Wire Line
	7500 3900 6600 3900
Wire Wire Line
	6600 3900 6600 4000
Wire Wire Line
	6600 4000 6350 4000
Wire Wire Line
	6350 4100 6700 4100
Wire Wire Line
	6700 4100 6700 4000
Wire Wire Line
	6700 4000 7500 4000
Wire Wire Line
	7500 4100 6800 4100
Wire Wire Line
	6800 4100 6800 4200
Wire Wire Line
	6800 4200 6350 4200
Wire Wire Line
	7500 4200 6900 4200
Wire Wire Line
	6900 4200 6900 4300
Wire Wire Line
	6900 4300 6350 4300
Wire Wire Line
	6350 4600 6500 4600
Wire Wire Line
	6350 4500 6500 4500
Wire Wire Line
	6500 4500 6500 4600
Connection ~ 6500 4600
Wire Wire Line
	6500 4600 6600 4600
Text GLabel 7000 4400 2    50   Input ~ 0
PROG
Wire Wire Line
	7000 4400 6350 4400
Text GLabel 7000 2700 2    50   Input ~ 0
TXD
Text GLabel 7000 2850 2    50   Input ~ 0
RXD
Wire Wire Line
	7000 2850 6900 2850
Wire Wire Line
	6900 2850 6900 3400
Connection ~ 6900 3400
Wire Wire Line
	6900 3400 7500 3400
Wire Wire Line
	7000 2700 6800 2700
Wire Wire Line
	6800 2700 6800 3500
Connection ~ 6800 3500
Wire Wire Line
	6800 3500 6350 3500
Text GLabel 7300 3000 0    50   Input ~ 0
3V3
Text GLabel 7300 3100 0    50   Input ~ 0
GND
Wire Wire Line
	7500 3000 7300 3000
Wire Wire Line
	7300 3100 7500 3100
$Comp
L fab:LED M2
U 1 1 5E683612
P 1450 2550
F 0 "M2" V 1654 2600 45  0000 C CNN
F 1 "LED" V 1570 2600 45  0000 C CNN
F 2 "fab:fab-LED1206" H 1480 2700 20  0001 C CNN
F 3 "" H 1450 2550 50  0001 C CNN
	1    1450 2550
	0    -1   -1   0   
$EndComp
Text GLabel 1850 2550 2    50   Input ~ 0
GND
Wire Wire Line
	1550 2550 1850 2550
Wire Wire Line
	1250 2550 1250 2950
Text GLabel 3500 3700 0    50   Input ~ 0
LED_PIN
Text GLabel 1850 2950 2    50   Input ~ 0
LED_PIN
Wire Wire Line
	1650 2950 1850 2950
Wire Bus Line
	2500 2250 1000 2250
Wire Bus Line
	1000 2250 1000 3100
Wire Bus Line
	1000 3100 2500 3100
Wire Bus Line
	2500 3100 2500 2250
Text Notes 1900 2400 0    50   ~ 0
ADD LED
Text GLabel 4200 3450 0    50   Input ~ 0
RESET
$Comp
L Connector:Conn_01x11_Female J2
U 1 1 5E62C9DA
P 3650 4050
F 0 "J2" H 3678 4076 50  0000 L CNN
F 1 "Conn_01x11_Female" H 3678 3985 50  0000 L CNN
F 2 "Connector_PinHeader_2.54mm:PinHeader_1x11_P2.54mm_Vertical" H 3650 4050 50  0001 C CNN
F 3 "~" H 3650 4050 50  0001 C CNN
	1    3650 4050
	-1   0    0    1   
$EndComp
Wire Wire Line
	3500 3700 3900 3700
Wire Wire Line
	3900 3700 3900 3750
Connection ~ 3900 3750
Wire Wire Line
	3900 3750 3850 3750
Wire Wire Line
	8100 1350 8350 1350
$Comp
L fab:6MM_SWITCH6MM_SWITCH S2
U 1 1 5E6A3DFC
P 1600 3600
F 0 "S2" V 1271 3600 45  0000 C CNN
F 1 "6MM_SWITCH6MM_SWITCH" V 1355 3600 45  0000 C CNN
F 2 "fab-6MM_SWITCH" H 1630 3750 20  0001 C CNN
F 3 "" H 1600 3600 50  0001 C CNN
	1    1600 3600
	0    1    1    0   
$EndComp
Text GLabel 1250 3600 0    50   Input ~ 0
BTN
Text GLabel 2000 3600 2    50   Input ~ 0
GND
Text GLabel 1250 4000 0    50   Input ~ 0
3V3
Wire Wire Line
	1800 3600 2000 3600
Wire Wire Line
	1800 3700 1800 3600
Connection ~ 1800 3600
Wire Wire Line
	1400 3700 1400 3600
Connection ~ 1400 3600
Wire Wire Line
	1250 4000 1300 4000
Wire Bus Line
	1000 3200 2500 3200
Wire Bus Line
	2500 3200 2500 4200
Wire Bus Line
	2500 4200 1000 4200
Wire Bus Line
	1000 4200 1000 3200
Wire Wire Line
	3500 3800 3900 3800
Wire Wire Line
	3900 3800 3900 3850
Connection ~ 3900 3850
Wire Wire Line
	3900 3850 4500 3850
Text GLabel 3500 3800 0    50   Input ~ 0
BTN
Wire Wire Line
	1250 3600 1300 3600
$Comp
L fab:RES-US1206FAB R5
U 1 1 5E7038B4
P 1300 3800
F 0 "R5" V 1258 3868 45  0000 L CNN
F 1 "10K Ohms" V 1342 3868 45  0000 L CNN
F 2 "fab-R1206FAB" H 1330 3950 20  0001 C CNN
F 3 "" H 1300 3800 50  0001 C CNN
	1    1300 3800
	0    1    1    0   
$EndComp
Connection ~ 1300 3600
Wire Wire Line
	1300 3600 1400 3600
$Comp
L fab:RES-US1206FAB R4
U 1 1 5E70632D
P 1450 2950
F 0 "R4" H 1450 3144 45  0000 C CNN
F 1 "100 Ohm" H 1450 3060 45  0000 C CNN
F 2 "fab-R1206FAB" H 1480 3100 20  0001 C CNN
F 3 "" H 1450 2950 50  0001 C CNN
	1    1450 2950
	1    0    0    -1  
$EndComp
$Comp
L fab:RES-US1206FAB R3
U 1 1 5E711F86
P 3450 1450
F 0 "R3" V 3408 1518 45  0000 L CNN
F 1 "100 Ohm" V 3492 1518 45  0000 L CNN
F 2 "fab-R1206FAB" H 3480 1600 20  0001 C CNN
F 3 "" H 3450 1450 50  0001 C CNN
	1    3450 1450
	0    1    1    0   
$EndComp
$Comp
L fab:RES-US1206FAB R1
U 1 1 5E717124
P 5700 1350
F 0 "R1" H 5700 1544 45  0000 C CNN
F 1 "10K Ohm" H 5700 1460 45  0000 C CNN
F 2 "fab-R1206FAB" H 5730 1500 20  0001 C CNN
F 3 "" H 5700 1350 50  0001 C CNN
	1    5700 1350
	1    0    0    -1  
$EndComp
$Comp
L fab:RES-US1206FAB R2
U 1 1 5E71D187
P 4700 6250
F 0 "R2" V 4658 6318 45  0000 L CNN
F 1 "100 Ohm" V 4742 6318 45  0000 L CNN
F 2 "fab-R1206FAB" H 4730 6400 20  0001 C CNN
F 3 "" H 4700 6250 50  0001 C CNN
	1    4700 6250
	0    1    1    0   
$EndComp
$Comp
L Regulator_Linear:LT1129-3.3_SOT223 U2
U 1 1 5E742571
P 2150 1400
F 0 "U2" V 2196 1505 50  0000 L CNN
F 1 "LT1129-3.3_SOT223" V 2105 1505 50  0000 L CNN
F 2 "Package_TO_SOT_SMD:SOT-223-3_TabPin2" H 2150 1625 50  0001 C CIN
F 3 "https://www.analog.com/media/en/technical-documentation/data-sheets/112935ff.pdf" H 2150 1350 50  0001 C CNN
	1    2150 1400
	0    -1   -1   0   
$EndComp
Wire Wire Line
	1500 1700 2150 1700
Connection ~ 2150 1700
Wire Wire Line
	2150 1700 2700 1700
Wire Wire Line
	1850 1150 1850 1100
Wire Wire Line
	1850 1100 2150 1100
Wire Wire Line
	2450 1400 2450 1150
Wire Wire Line
	2450 1150 2700 1150
Connection ~ 2700 1150
$Comp
L Connector:Conn_01x13_Female J1
U 1 1 5E79106C
P 7700 3600
F 0 "J1" H 7728 3626 50  0000 L CNN
F 1 "Conn_01x13_Female" H 7728 3535 50  0000 L CNN
F 2 "Connector_PinHeader_2.54mm:PinHeader_1x13_P2.54mm_Vertical" H 7700 3600 50  0001 C CNN
F 3 "~" H 7700 3600 50  0001 C CNN
	1    7700 3600
	1    0    0    -1  
$EndComp
Text GLabel 4250 3100 0    50   Input ~ 0
GND
Wire Wire Line
	4350 4650 4500 4650
$Comp
L ESP32-footprints-Shem-Lib:ESP-32S U1
U 1 1 5E7C8A8C
P 5450 3950
F 0 "U1" H 5425 5337 60  0000 C CNN
F 1 "ESP-32S" H 5425 5231 60  0000 C CNN
F 2 "ESP32-footprints-Lib:ESP-32S" H 5800 5300 60  0001 C CNN
F 3 "" H 5000 4400 60  0001 C CNN
	1    5450 3950
	1    0    0    -1  
$EndComp
Wire Wire Line
	4250 3100 4500 3250
$EndSCHEMATC
