(export (version D)
  (design
    (source "/Users/pablo/Documents/MDEF/2 TERM/FAB ACADEMY/KICAD/ESP32/ESP32.sch")
    (date "2020 March 10, Tuesday 01:26:46")
    (tool "Eeschema (5.1.5-0)")
    (sheet (number 1) (name /) (tstamps /)
      (title_block
        (title)
        (company)
        (rev)
        (date)
        (source ESP32.sch)
        (comment (number 1) (value ""))
        (comment (number 2) (value ""))
        (comment (number 3) (value ""))
        (comment (number 4) (value "")))))
  (components
    (comp (ref LED2)
      (value GREEN)
      (footprint fab:fab-LED1206FAB)
      (libsource (lib fab) (part LEDFAB1206) (description ""))
      (sheetpath (names /) (tstamps /))
      (tstamp 5E61CA3E))
    (comp (ref LED1)
      (value RED)
      (footprint fab:fab-LED1206FAB)
      (libsource (lib fab) (part LEDFAB1206) (description ""))
      (sheetpath (names /) (tstamps /))
      (tstamp 5E61DF5A))
    (comp (ref C1)
      (value "0.1 uF")
      (footprint fab:fab-C1206FAB)
      (libsource (lib fab) (part CAP-UNPOLARIZEDFAB) (description ""))
      (sheetpath (names /) (tstamps /))
      (tstamp 5E61F4D1))
    (comp (ref C3)
      (value "10 uF")
      (footprint fab:fab-C1206FAB)
      (libsource (lib fab) (part CAP-UNPOLARIZEDFAB) (description ""))
      (sheetpath (names /) (tstamps /))
      (tstamp 5E61FCC7))
    (comp (ref C2)
      (value "10 uF")
      (footprint fab:fab-C1206FAB)
      (libsource (lib fab) (part CAP-UNPOLARIZEDFAB) (description ""))
      (sheetpath (names /) (tstamps /))
      (tstamp 5E6205A4))
    (comp (ref S1)
      (value SLIDE-SWITCH)
      (footprint fab:fab-AYZ0102AGRLC)
      (libsource (lib fab) (part SLIDE-SWITCH) (description ""))
      (sheetpath (names /) (tstamps /))
      (tstamp 5E623CA1))
    (comp (ref RESET1)
      (value S1)
      (footprint fab:fab-6MM_SWITCH)
      (libsource (lib fab) (part 6MM_SWITCH6MM_SWITCH) (description ""))
      (sheetpath (names /) (tstamps /))
      (tstamp 5E6285E1))
    (comp (ref J3)
      (value Conn_01x09_Female)
      (footprint Connector_PinHeader_2.54mm:PinHeader_1x09_P2.54mm_Vertical)
      (datasheet ~)
      (libsource (lib Connector) (part Conn_01x09_Female) (description "Generic connector, single row, 01x09, script generated (kicad-library-utils/schlib/autogen/connector/)"))
      (sheetpath (names /) (tstamps /))
      (tstamp 5E629FE2))
    (comp (ref M1)
      (value FTDI-SMD-HEADER)
      (footprint fab:fab-1X06SMD)
      (libsource (lib fab) (part FTDI-SMD-HEADER) (description ""))
      (sheetpath (names /) (tstamps /))
      (tstamp 5E63067C))
    (comp (ref M2)
      (value LED)
      (footprint fab:fab-LED1206)
      (libsource (lib fab) (part LED) (description ""))
      (sheetpath (names /) (tstamps /))
      (tstamp 5E683612))
    (comp (ref J2)
      (value Conn_01x11_Female)
      (footprint Connector_PinHeader_2.54mm:PinHeader_1x11_P2.54mm_Vertical)
      (datasheet ~)
      (libsource (lib Connector) (part Conn_01x11_Female) (description "Generic connector, single row, 01x11, script generated (kicad-library-utils/schlib/autogen/connector/)"))
      (sheetpath (names /) (tstamps /))
      (tstamp 5E62C9DA))
    (comp (ref S2)
      (value 6MM_SWITCH6MM_SWITCH)
      (footprint fab-6MM_SWITCH)
      (libsource (lib fab) (part 6MM_SWITCH6MM_SWITCH) (description ""))
      (sheetpath (names /) (tstamps /))
      (tstamp 5E6A3DFC))
    (comp (ref R5)
      (value "10K Ohms")
      (footprint fab-R1206FAB)
      (libsource (lib fab) (part RES-US1206FAB) (description ""))
      (sheetpath (names /) (tstamps /))
      (tstamp 5E7038B4))
    (comp (ref R4)
      (value "100 Ohm")
      (footprint fab-R1206FAB)
      (libsource (lib fab) (part RES-US1206FAB) (description ""))
      (sheetpath (names /) (tstamps /))
      (tstamp 5E70632D))
    (comp (ref R3)
      (value "100 Ohm")
      (footprint fab-R1206FAB)
      (libsource (lib fab) (part RES-US1206FAB) (description ""))
      (sheetpath (names /) (tstamps /))
      (tstamp 5E711F86))
    (comp (ref R1)
      (value "10K Ohm")
      (footprint fab-R1206FAB)
      (libsource (lib fab) (part RES-US1206FAB) (description ""))
      (sheetpath (names /) (tstamps /))
      (tstamp 5E717124))
    (comp (ref R2)
      (value "100 Ohm")
      (footprint fab-R1206FAB)
      (libsource (lib fab) (part RES-US1206FAB) (description ""))
      (sheetpath (names /) (tstamps /))
      (tstamp 5E71D187))
    (comp (ref U2)
      (value LT1129-3.3_SOT223)
      (footprint Package_TO_SOT_SMD:SOT-223-3_TabPin2)
      (datasheet https://www.analog.com/media/en/technical-documentation/data-sheets/112935ff.pdf)
      (libsource (lib Regulator_Linear) (part LT1129-3.3_SOT223) (description "700mA Micropower Low drop-out regulator, Fixed Output 3.3V, SOT-223"))
      (sheetpath (names /) (tstamps /))
      (tstamp 5E742571))
    (comp (ref J1)
      (value Conn_01x13_Female)
      (footprint Connector_PinHeader_2.54mm:PinHeader_1x13_P2.54mm_Vertical)
      (datasheet ~)
      (libsource (lib Connector) (part Conn_01x13_Female) (description "Generic connector, single row, 01x13, script generated (kicad-library-utils/schlib/autogen/connector/)"))
      (sheetpath (names /) (tstamps /))
      (tstamp 5E79106C))
    (comp (ref U1)
      (value ESP-32S)
      (footprint ESP32-footprints-Lib:ESP-32S)
      (libsource (lib ESP32-footprints-Shem-Lib) (part ESP-32S) (description ""))
      (sheetpath (names /) (tstamps /))
      (tstamp 5E7C8A8C)))
  (libparts
    (libpart (lib Connector) (part Conn_01x09_Female)
      (description "Generic connector, single row, 01x09, script generated (kicad-library-utils/schlib/autogen/connector/)")
      (docs ~)
      (footprints
        (fp Connector*:*_1x??_*))
      (fields
        (field (name Reference) J)
        (field (name Value) Conn_01x09_Female))
      (pins
        (pin (num 1) (name Pin_1) (type passive))
        (pin (num 2) (name Pin_2) (type passive))
        (pin (num 3) (name Pin_3) (type passive))
        (pin (num 4) (name Pin_4) (type passive))
        (pin (num 5) (name Pin_5) (type passive))
        (pin (num 6) (name Pin_6) (type passive))
        (pin (num 7) (name Pin_7) (type passive))
        (pin (num 8) (name Pin_8) (type passive))
        (pin (num 9) (name Pin_9) (type passive))))
    (libpart (lib Connector) (part Conn_01x11_Female)
      (description "Generic connector, single row, 01x11, script generated (kicad-library-utils/schlib/autogen/connector/)")
      (docs ~)
      (footprints
        (fp Connector*:*_1x??_*))
      (fields
        (field (name Reference) J)
        (field (name Value) Conn_01x11_Female))
      (pins
        (pin (num 1) (name Pin_1) (type passive))
        (pin (num 2) (name Pin_2) (type passive))
        (pin (num 3) (name Pin_3) (type passive))
        (pin (num 4) (name Pin_4) (type passive))
        (pin (num 5) (name Pin_5) (type passive))
        (pin (num 6) (name Pin_6) (type passive))
        (pin (num 7) (name Pin_7) (type passive))
        (pin (num 8) (name Pin_8) (type passive))
        (pin (num 9) (name Pin_9) (type passive))
        (pin (num 10) (name Pin_10) (type passive))
        (pin (num 11) (name Pin_11) (type passive))))
    (libpart (lib Connector) (part Conn_01x13_Female)
      (description "Generic connector, single row, 01x13, script generated (kicad-library-utils/schlib/autogen/connector/)")
      (docs ~)
      (footprints
        (fp Connector*:*_1x??_*))
      (fields
        (field (name Reference) J)
        (field (name Value) Conn_01x13_Female))
      (pins
        (pin (num 1) (name Pin_1) (type passive))
        (pin (num 2) (name Pin_2) (type passive))
        (pin (num 3) (name Pin_3) (type passive))
        (pin (num 4) (name Pin_4) (type passive))
        (pin (num 5) (name Pin_5) (type passive))
        (pin (num 6) (name Pin_6) (type passive))
        (pin (num 7) (name Pin_7) (type passive))
        (pin (num 8) (name Pin_8) (type passive))
        (pin (num 9) (name Pin_9) (type passive))
        (pin (num 10) (name Pin_10) (type passive))
        (pin (num 11) (name Pin_11) (type passive))
        (pin (num 12) (name Pin_12) (type passive))
        (pin (num 13) (name Pin_13) (type passive))))
    (libpart (lib ESP32-footprints-Shem-Lib) (part ESP-32S)
      (fields
        (field (name Reference) U)
        (field (name Value) ESP-32S)
        (field (name Footprint) ESP32-footprints-Lib:ESP-32S))
      (pins
        (pin (num 1) (name GND) (type power_out))
        (pin (num 2) (name 3V3) (type power_in))
        (pin (num 3) (name EN) (type input))
        (pin (num 4) (name SENSOR_VP) (type input))
        (pin (num 5) (name SENSOR_VN) (type input))
        (pin (num 6) (name IO34) (type BiDi))
        (pin (num 7) (name IO35) (type BiDi))
        (pin (num 8) (name IO32) (type BiDi))
        (pin (num 9) (name IO33) (type BiDi))
        (pin (num 10) (name IO25) (type BiDi))
        (pin (num 11) (name IO26) (type BiDi))
        (pin (num 12) (name IO27) (type BiDi))
        (pin (num 13) (name IO14) (type BiDi))
        (pin (num 14) (name IO12) (type BiDi))
        (pin (num 15) (name GND) (type power_in))
        (pin (num 16) (name IO13) (type BiDi))
        (pin (num 17) (name SD2) (type BiDi))
        (pin (num 18) (name SD3) (type BiDi))
        (pin (num 19) (name CMD) (type BiDi))
        (pin (num 20) (name CLK) (type input))
        (pin (num 21) (name SDO) (type BiDi))
        (pin (num 22) (name SD1) (type BiDi))
        (pin (num 23) (name IO15) (type BiDi))
        (pin (num 24) (name IO2) (type BiDi))
        (pin (num 25) (name IO0) (type BiDi))
        (pin (num 26) (name IO4) (type input))
        (pin (num 27) (name IO16) (type BiDi))
        (pin (num 28) (name IO17) (type BiDi))
        (pin (num 29) (name IO5) (type BiDi))
        (pin (num 30) (name IO18) (type input))
        (pin (num 31) (name IO19) (type BiDi))
        (pin (num 32) (name NC) (type NotConnected))
        (pin (num 33) (name IO21) (type BiDi))
        (pin (num 34) (name RXD0) (type BiDi))
        (pin (num 35) (name TXD0) (type BiDi))
        (pin (num 36) (name IO22) (type BiDi))
        (pin (num 37) (name IO23) (type BiDi))
        (pin (num 38) (name GND) (type power_in))
        (pin (num 39) (name GND-PAD) (type power_in))))
    (libpart (lib Regulator_Linear) (part SPX2920M3-3.3_SOT223)
      (aliases
        (alias SPX2920M3-5.0_SOT223)
        (alias LT1129-3.3_SOT223)
        (alias LT1129-5.0_SOT223)
        (alias LM2937xMP)
        (alias AP7361C-10E)
        (alias AP7361C-12E)
        (alias AP7361C-15E)
        (alias AP7361C-18E)
        (alias AP7361C-25E)
        (alias AP7361C-28E)
        (alias AP7361C-33E))
      (description "400mA Low drop-out regulator, Fixed Output 3.3V, SOT-223")
      (docs http://www.zlgmcu.com/Sipex/LDO/PDF/spx2920.pdf)
      (footprints
        (fp SOT?223*))
      (fields
        (field (name Reference) U)
        (field (name Value) SPX2920M3-3.3_SOT223)
        (field (name Footprint) Package_TO_SOT_SMD:SOT-223-3_TabPin2))
      (pins
        (pin (num 1) (name GND) (type power_in))
        (pin (num 2) (name VO) (type power_out))
        (pin (num 3) (name VI) (type power_in))))
    (libpart (lib fab) (part 6MM_SWITCH6MM_SWITCH)
      (footprints
        (fp *6MM_SWITCH*))
      (fields
        (field (name Reference) S)
        (field (name Value) 6MM_SWITCH6MM_SWITCH)
        (field (name Footprint) fab-6MM_SWITCH))
      (pins
        (pin (num 1) (name P) (type passive))
        (pin (num 2) (name P1) (type passive))
        (pin (num 3) (name S) (type passive))
        (pin (num 4) (name S1) (type passive))))
    (libpart (lib fab) (part CAP-UNPOLARIZEDFAB)
      (footprints
        (fp *C1206FAB*))
      (fields
        (field (name Reference) C)
        (field (name Value) CAP-UNPOLARIZEDFAB)
        (field (name Footprint) fab-C1206FAB))
      (pins
        (pin (num 1) (name 1) (type passive))
        (pin (num 2) (name 2) (type passive))))
    (libpart (lib fab) (part FTDI-SMD-HEADER)
      (footprints
        (fp *1X06SMD*))
      (fields
        (field (name Reference) M)
        (field (name Value) FTDI-SMD-HEADER)
        (field (name Footprint) fab-1X06SMD))
      (pins
        (pin (num 1) (name GND) (type BiDi))
        (pin (num 2) (name CTS) (type BiDi))
        (pin (num 3) (name VCC) (type BiDi))
        (pin (num 4) (name TXD) (type BiDi))
        (pin (num 5) (name RXD) (type BiDi))
        (pin (num 6) (name RTS) (type BiDi))))
    (libpart (lib fab) (part LED)
      (footprints
        (fp *LED1206*)
        (fp *LED1206FAB*))
      (fields
        (field (name Reference) M)
        (field (name Value) LED)
        (field (name Footprint) fab-LED1206))
      (pins
        (pin (num 1) (name A) (type passive))
        (pin (num 2) (name C) (type passive))))
    (libpart (lib fab) (part LEDFAB1206)
      (footprints
        (fp *LED1206FAB*))
      (fields
        (field (name Reference) M)
        (field (name Value) LEDFAB1206)
        (field (name Footprint) fab-LED1206FAB))
      (pins
        (pin (num 1) (name A) (type passive))
        (pin (num 2) (name C) (type passive))))
    (libpart (lib fab) (part RES-US1206FAB)
      (footprints
        (fp *R1206FAB*))
      (fields
        (field (name Reference) R)
        (field (name Value) RES-US1206FAB)
        (field (name Footprint) fab-R1206FAB))
      (pins
        (pin (num 1) (name 1) (type passive))
        (pin (num 2) (name 2) (type passive))))
    (libpart (lib fab) (part SLIDE-SWITCH)
      (footprints
        (fp *AYZ0102AGRLC*))
      (fields
        (field (name Reference) S)
        (field (name Value) SLIDE-SWITCH)
        (field (name Footprint) fab-AYZ0102AGRLC))
      (pins
        (pin (num 1) (name 1) (type BiDi))
        (pin (num 2) (name 2) (type BiDi))
        (pin (num 3) (name 3) (type BiDi)))))
  (libraries
    (library (logical Connector)
      (uri "/Library/Application Support/kicad/library/Connector.lib"))
    (library (logical ESP32-footprints-Shem-Lib)
      (uri "/Users/pablo/Documents/MDEF/2 TERM/FAB ACADEMY/W6/ESP32-Footprints/ESP32-footprints-Shem-Lib.lib"))
    (library (logical Regulator_Linear)
      (uri "/Library/Application Support/kicad/library/Regulator_Linear.lib"))
    (library (logical fab)
      (uri "/Users/pablo/Documents/MDEF/2 TERM/FAB ACADEMY/W6/kicad_libraries/fab.lib")))
  (nets
    (net (code 1) (name "Net-(LED2-Pad2)")
      (node (ref LED2) (pin 2))
      (node (ref R2) (pin 1)))
    (net (code 2) (name "Net-(S1-Pad3)")
      (node (ref S1) (pin 3)))
    (net (code 3) (name "Net-(J3-Pad1)")
      (node (ref J3) (pin 1)))
    (net (code 4) (name "Net-(J3-Pad2)")
      (node (ref J3) (pin 2)))
    (net (code 5) (name "Net-(J3-Pad3)")
      (node (ref J3) (pin 3)))
    (net (code 6) (name "Net-(J3-Pad4)")
      (node (ref J3) (pin 4)))
    (net (code 7) (name "Net-(J3-Pad5)")
      (node (ref J3) (pin 5)))
    (net (code 8) (name "Net-(J3-Pad6)")
      (node (ref J3) (pin 6)))
    (net (code 9) (name "Net-(J3-Pad7)")
      (node (ref J3) (pin 7)))
    (net (code 10) (name "Net-(J3-Pad8)")
      (node (ref J3) (pin 8)))
    (net (code 11) (name "Net-(M1-Pad2)")
      (node (ref M1) (pin 2)))
    (net (code 12) (name "Net-(M1-Pad6)")
      (node (ref M1) (pin 6)))
    (net (code 13) (name RXD)
      (node (ref U1) (pin 37))
      (node (ref J1) (pin 5))
      (node (ref M1) (pin 5)))
    (net (code 14) (name TXD)
      (node (ref J1) (pin 6))
      (node (ref M1) (pin 4))
      (node (ref U1) (pin 36)))
    (net (code 15) (name "Net-(C3-Pad1)")
      (node (ref C3) (pin 1))
      (node (ref M1) (pin 3))
      (node (ref U2) (pin 3)))
    (net (code 16) (name "Net-(LED1-Pad1)")
      (node (ref LED1) (pin 1))
      (node (ref R3) (pin 2)))
    (net (code 17) (name RESET)
      (node (ref RESET1) (pin 1))
      (node (ref RESET1) (pin 2))
      (node (ref R1) (pin 2))
      (node (ref U1) (pin 3)))
    (net (code 18) (name PROG)
      (node (ref S1) (pin 2))
      (node (ref U1) (pin 27)))
    (net (code 19) (name "Net-(J2-Pad11)")
      (node (ref J2) (pin 11))
      (node (ref U1) (pin 4)))
    (net (code 20) (name "Net-(J2-Pad10)")
      (node (ref U1) (pin 5))
      (node (ref J2) (pin 10)))
    (net (code 21) (name "Net-(J2-Pad7)")
      (node (ref J2) (pin 7))
      (node (ref U1) (pin 8)))
    (net (code 22) (name "Net-(J2-Pad6)")
      (node (ref U1) (pin 9))
      (node (ref J2) (pin 6)))
    (net (code 23) (name "Net-(J2-Pad5)")
      (node (ref J2) (pin 5))
      (node (ref U1) (pin 10)))
    (net (code 24) (name "Net-(J2-Pad4)")
      (node (ref J2) (pin 4))
      (node (ref U1) (pin 11)))
    (net (code 25) (name "Net-(J2-Pad3)")
      (node (ref J2) (pin 3))
      (node (ref U1) (pin 12)))
    (net (code 26) (name "Net-(J2-Pad2)")
      (node (ref U1) (pin 13))
      (node (ref J2) (pin 2)))
    (net (code 27) (name "Net-(J2-Pad1)")
      (node (ref U1) (pin 14))
      (node (ref J2) (pin 1)))
    (net (code 28) (name "Net-(J3-Pad9)")
      (node (ref LED2) (pin 1))
      (node (ref J3) (pin 9)))
    (net (code 29) (name "Net-(J1-Pad3)")
      (node (ref U1) (pin 39))
      (node (ref J1) (pin 3)))
    (net (code 30) (name "Net-(J1-Pad4)")
      (node (ref U1) (pin 38))
      (node (ref J1) (pin 4)))
    (net (code 31) (name "Net-(J1-Pad7)")
      (node (ref J1) (pin 7))
      (node (ref U1) (pin 35)))
    (net (code 32) (name "Net-(J1-Pad8)")
      (node (ref U1) (pin 33))
      (node (ref J1) (pin 8)))
    (net (code 33) (name "Net-(J1-Pad9)")
      (node (ref U1) (pin 32))
      (node (ref J1) (pin 9)))
    (net (code 34) (name "Net-(J1-Pad10)")
      (node (ref U1) (pin 31))
      (node (ref J1) (pin 10)))
    (net (code 35) (name "Net-(J1-Pad11)")
      (node (ref U1) (pin 30))
      (node (ref J1) (pin 11)))
    (net (code 36) (name "Net-(J1-Pad12)")
      (node (ref J1) (pin 12))
      (node (ref U1) (pin 29)))
    (net (code 37) (name "Net-(J1-Pad13)")
      (node (ref J1) (pin 13))
      (node (ref U1) (pin 28)))
    (net (code 38) (name "Net-(M2-Pad1)")
      (node (ref R4) (pin 1))
      (node (ref M2) (pin 1)))
    (net (code 39) (name LED_PIN)
      (node (ref R4) (pin 2))
      (node (ref J2) (pin 9))
      (node (ref U1) (pin 6)))
    (net (code 40) (name BTN)
      (node (ref R5) (pin 1))
      (node (ref U1) (pin 7))
      (node (ref J2) (pin 8))
      (node (ref S2) (pin 1))
      (node (ref S2) (pin 2)))
    (net (code 41) (name GND)
      (node (ref S2) (pin 4))
      (node (ref S2) (pin 3))
      (node (ref LED1) (pin 2))
      (node (ref M2) (pin 2))
      (node (ref C1) (pin 2))
      (node (ref C3) (pin 2))
      (node (ref C2) (pin 2))
      (node (ref S1) (pin 1))
      (node (ref U1) (pin 26))
      (node (ref RESET1) (pin 3))
      (node (ref U1) (pin 25))
      (node (ref R2) (pin 2))
      (node (ref U2) (pin 1))
      (node (ref RESET1) (pin 4))
      (node (ref M1) (pin 1))
      (node (ref J1) (pin 2))
      (node (ref U1) (pin 1)))
    (net (code 42) (name 3V3)
      (node (ref U1) (pin 2))
      (node (ref C1) (pin 1))
      (node (ref J1) (pin 1))
      (node (ref U2) (pin 2))
      (node (ref C2) (pin 1))
      (node (ref R5) (pin 2))
      (node (ref R1) (pin 1))
      (node (ref R3) (pin 1)))
    (net (code 44) (name "Net-(U1-Pad20)")
      (node (ref U1) (pin 20)))
    (net (code 45) (name "Net-(U1-Pad21)")
      (node (ref U1) (pin 21)))
    (net (code 46) (name "Net-(U1-Pad22)")
      (node (ref U1) (pin 22)))
    (net (code 47) (name "Net-(U1-Pad23)")
      (node (ref U1) (pin 23)))
    (net (code 48) (name "Net-(U1-Pad24)")
      (node (ref U1) (pin 24)))
    (net (code 49) (name "Net-(U1-Pad34)")
      (node (ref U1) (pin 34)))
    (net (code 50) (name "Net-(U1-Pad15)")
      (node (ref U1) (pin 15)))
    (net (code 51) (name "Net-(U1-Pad16)")
      (node (ref U1) (pin 16)))
    (net (code 52) (name "Net-(U1-Pad17)")
      (node (ref U1) (pin 17)))
    (net (code 53) (name "Net-(U1-Pad18)")
      (node (ref U1) (pin 18)))
    (net (code 54) (name "Net-(U1-Pad19)")
      (node (ref U1) (pin 19)))))