%
G28

F2500.0000
G00Z30.0000
G04 P1
Z30.0000
G00X0.0000Y0.3532Z30.0000
G01Z8.1239 F2500.0000
F2500.0000
G01X0.3532Y0.3532Z8.1239
G01X0.3532Y0.0000Z8.1239
Z30.0000
G00X4.5918Y0.0000Z30.0000
G01Z8.1239 F2500.0000
F2500.0000
G01X4.5918Y0.3532Z8.1239
G01X6.0046Y3.1789Z8.1239
G01X10.5964Y15.8946Z8.1239
G01X17.3074Y28.9634Z8.1239
G01X24.3717Y39.2066Z8.1239
G01X25.0781Y39.9130Z8.1239
G01X31.4359Y46.9773Z8.1239
G01X38.5002Y53.3351Z8.1239
G01X46.2709Y58.9865Z8.1239
G01X55.1012Y63.9315Z8.1239
G01X58.6333Y65.3443Z8.1239
G01X61.4590Y66.0508Z8.1239
G01X64.2847Y66.0508Z8.1239
G01X67.4636Y64.2847Z8.1239
G01X70.6425Y60.3994Z8.1239
G01X73.8214Y53.3351Z8.1239
G01X75.5875Y48.0369Z8.1239
G01X77.3536Y41.3259Z8.1239
G01X79.1196Y33.5552Z8.1239
G01X82.6518Y19.4267Z8.1239
G01X85.4775Y15.5414Z8.1239
G01X86.8903Y14.8349Z8.1239
G01X91.1289Y14.4817Z8.1239
G01X95.3674Y16.9542Z8.1239
G01X96.0738Y17.6606Z8.1239
G01X101.3720Y22.9588Z8.1239
G01X118.6794Y42.3855Z8.1239
G01X126.0969Y48.7433Z8.1239
G01X129.2758Y50.5094Z8.1239
G01X132.1015Y50.8626Z8.1239
G01X134.2208Y48.7433Z8.1239
G01X136.6933Y44.1516Z8.1239
G01X145.5236Y22.6056Z8.1239
G01X148.7025Y18.7203Z8.1239
G01X152.2346Y16.2478Z8.1239
G01X156.4732Y14.8349Z8.1239
G01X157.5328Y14.8349Z8.1239
G01X161.7714Y14.4817Z8.1239
G01X167.7760Y16.2478Z8.1239
G01X173.0742Y20.4863Z8.1239
G01X182.6109Y29.3166Z8.1239
G01X185.0834Y31.0827Z8.1239
G01X188.6155Y32.8488Z8.1239
G01X192.1477Y34.2616Z8.1239
G01X195.6798Y34.9680Z8.1239
G01X197.7991Y34.9680Z8.1239
G01X200.2716Y33.5552Z8.1239
G01X202.3908Y30.3763Z8.1239
G01X203.8037Y26.8442Z8.1239
G01X207.6890Y16.9542Z8.1239
G01X212.6340Y9.8900Z8.1239
G01X213.3404Y9.1835Z8.1239
G01X215.8129Y7.4175Z8.1239
G01X220.7579Y4.9450Z8.1239
G01X224.2900Y4.2386Z8.1239
G01X228.8818Y4.2386Z8.1239
G01X235.2396Y6.7110Z8.1239
G01X243.3635Y12.3624Z8.1239
G01X244.0699Y13.0689Z8.1239
G01X256.4324Y22.9588Z8.1239
G01X259.6113Y24.7249Z8.1239
G01X261.3773Y25.0781Z8.1239
G01X262.0838Y24.3717Z8.1239
G01X262.7902Y23.6652Z8.1239
G01X264.9095Y20.4863Z8.1239
G01X269.8544Y12.0092Z8.1239
G01X275.1526Y6.0046Z8.1239
G01X275.8590Y6.0046Z8.1239
G01X276.5655Y5.2982Z8.1239
G01X278.6847Y4.2386Z8.1239
G01X282.2169Y3.5321Z8.1239
G01X286.4554Y3.5321Z8.1239
G01X295.6390Y7.7707Z8.1239
G01X305.1757Y14.1285Z8.1239
G01X316.1253Y23.3120Z8.1239
G01X316.8317Y24.0185Z8.1239
G01X322.1299Y28.9634Z8.1239
G01X322.1299Y29.6699Z8.1239
G01X322.4831Y30.7295Z8.1239
G01X321.0703Y32.4956Z8.1239
G01X318.9510Y32.8488Z8.1239
G01X310.8271Y27.1974Z8.1239
G01X299.1711Y18.0138Z8.1239
G01X292.8133Y13.7753Z8.1239
G01X285.7490Y10.2432Z8.1239
G01X282.2169Y9.5367Z8.1239
G01X277.9783Y12.0092Z8.1239
G01X272.3269Y20.8395Z8.1239
G01X268.0884Y27.9038Z8.1239
G01X264.9095Y31.0827Z8.1239
G01X263.4966Y31.7891Z8.1239
G01X259.6113Y32.1423Z8.1239
G01X253.9599Y29.3166Z8.1239
G01X253.2534Y28.6102Z8.1239
G01X246.1892Y23.3120Z8.1239
G01X233.8267Y13.7753Z8.1239
G01X229.2350Y11.3028Z8.1239
G01X225.7029Y10.5964Z8.1239
G01X223.9368Y10.5964Z8.1239
G01X219.6982Y12.7157Z8.1239
G01X215.4597Y16.9542Z8.1239
G01X212.6340Y23.3120Z8.1239
G01X209.4551Y32.1423Z8.1239
G01X208.0422Y35.3213Z8.1239
G01X204.1569Y39.5598Z8.1239
G01X201.3312Y41.3259Z8.1239
G01X199.2119Y42.0323Z8.1239
G01X194.2669Y42.3855Z8.1239
G01X188.2623Y39.5598Z8.1239
G01X178.0192Y31.7891Z8.1239
G01X177.3127Y31.0827Z8.1239
G01X168.1292Y24.0185Z8.1239
G01X163.1842Y21.5460Z8.1239
G01X160.3585Y20.8395Z8.1239
G01X157.1796Y20.4863Z8.1239
G01X153.2943Y22.9588Z8.1239
G01X151.5282Y25.4313Z8.1239
G01X149.0557Y31.0827Z8.1239
G01X141.6383Y49.4498Z8.1239
G01X137.0465Y55.4544Z8.1239
G01X134.2208Y57.2204Z8.1239
G01X133.5144Y57.2204Z8.1239
G01X128.5694Y57.5737Z8.1239
G01X123.9776Y55.4544Z8.1239
G01X117.6198Y50.5094Z8.1239
G01X115.5005Y48.3901Z8.1239
G01X113.3812Y46.2709Z8.1239
G01X103.4913Y35.3213Z8.1239
G01X91.8353Y22.2524Z8.1239
G01X90.0692Y21.5460Z8.1239
G01X87.9499Y23.3120Z8.1239
G01X87.2435Y26.1377Z8.1239
G01X87.2435Y26.8442Z8.1239
G01X82.2985Y48.7433Z8.1239
G01X78.0600Y60.0461Z8.1239
G01X74.1746Y66.4040Z8.1239
G01X70.6425Y69.9361Z8.1239
G01X67.1104Y71.7022Z8.1239
G01X63.5783Y72.4086Z8.1239
G01X59.6929Y72.4086Z8.1239
G01X52.9819Y70.2893Z8.1239
G01X44.1516Y65.6975Z8.1239
G01X34.9680Y58.9865Z8.1239
G01X25.0781Y49.4498Z8.1239
G01X19.4267Y42.7387Z8.1239
G01X13.4221Y34.2616Z8.1239
G01X7.4175Y24.3717Z8.1239
G01X5.6514Y20.8395Z8.1239
G01X3.5321Y15.5414Z8.1239
G01X0.0000Y5.2982Z8.1239
Z30.0000
G00X341.5566Y89.0096Z30.0000
G01Z8.1239 F2500.0000
F2500.0000
G01X341.5566Y88.6564Z8.1239
G01X340.8502Y88.6564Z8.1239
G01X339.0841Y85.8307Z8.1239
G01X339.0841Y85.1242Z8.1239
G01X338.7309Y83.0050Z8.1239
G01X340.1437Y80.1793Z8.1239
G01X342.6162Y78.7664Z8.1239
G01X345.7951Y78.4132Z8.1239
G01X348.2676Y79.8261Z8.1239
G01X349.6805Y81.5921Z8.1239
Z30.0000
G00X349.6805Y86.5371Z30.0000
G01Z8.1239 F2500.0000
F2500.0000
G01X349.3273Y86.5371Z8.1239
G01X347.5612Y88.6564Z8.1239
G01X347.2080Y89.0096Z8.1239
G00Z30.0000

%
