<?xml version="1.0" encoding="utf-8"?>
<!-- Generator: Adobe Illustrator 23.0.6, SVG Export Plug-In . SVG Version: 6.00 Build 0)  -->
<svg version="1.1" xmlns="http://www.w3.org/2000/svg" xmlns:xlink="http://www.w3.org/1999/xlink" x="0px" y="0px"
	 viewBox="0 0 315.79 351.66" style="enable-background:new 0 0 315.79 351.66;" xml:space="preserve">
<style type="text/css">
	.st0{fill:none;stroke:#000000;stroke-linecap:round;stroke-linejoin:round;}
</style>
<g id="Default">
	<polygon class="st0" points="201.74,81.44 190.77,89.41 194.96,102.3 208.51,102.3 212.7,89.41 	"/>
	
		<rect x="211.35" y="97.21" transform="matrix(0.309 -0.9511 0.9511 0.309 57.7761 279.6528)" class="st0" width="19.99" height="5.72"/>
	
		<rect x="211.52" y="66.64" transform="matrix(0.5878 -0.809 0.809 0.5878 26.3729 205.0294)" class="st0" width="5.72" height="19.99"/>
	<rect x="192.27" y="111.06" class="st0" width="19.99" height="5.72"/>
	
		<rect x="179.27" y="90.07" transform="matrix(0.9511 -0.309 0.309 0.9511 -22.0078 61.1801)" class="st0" width="5.72" height="19.99"/>
	
		<rect x="179.1" y="73.78" transform="matrix(0.809 -0.5878 0.5878 0.809 -8.9312 125.7823)" class="st0" width="19.99" height="5.72"/>
	<polygon class="st0" points="201.74,55.59 166.03,81.54 179.67,123.52 223.81,123.52 237.45,81.54 	"/>
</g>
<g id="Layer_05">
	<line class="st0" x1="247.86" y1="179.94" x2="201.65" y2="179.94"/>
	<line class="st0" x1="201.65" y1="200.53" x2="247.86" y2="200.53"/>
	<line class="st0" x1="84.53" y1="294.83" x2="107.63" y2="254.81"/>
	<line class="st0" x1="89.8" y1="244.52" x2="66.7" y2="284.53"/>
	<line class="st0" x1="89.8" y1="135.95" x2="66.7" y2="95.93"/>
	<line class="st0" x1="107.63" y1="125.66" x2="84.53" y2="85.64"/>
	<line class="st0" x1="84.53" y1="85.64" x2="66.7" y2="95.93"/>
	<line class="st0" x1="84.53" y1="294.83" x2="66.7" y2="284.53"/>
	<line class="st0" x1="247.86" y1="200.53" x2="247.86" y2="179.94"/>
	<path class="st0" d="M89.8,135.95c9.93,17.2,16.96,33.64,16.96,54.28c0,20.64-7.03,37.08-16.96,54.28"/>
	<path class="st0" d="M201.65,200.53c-19.87,0-37.62,2.13-55.49,12.45s-28.6,24.63-38.53,41.83"/>
	<path class="st0" d="M107.63,125.66c9.93,17.2,20.65,31.51,38.53,41.83c17.88,10.32,35.63,12.45,55.49,12.45"/>
	<line class="st0" x1="107.63" y1="254.81" x2="93.37" y2="246.58"/>
	<line class="st0" x1="96.08" y1="274.82" x2="81.82" y2="266.58"/>
	<line class="st0" x1="100.01" y1="268.02" x2="85.74" y2="259.78"/>
	<line class="st0" x1="103.93" y1="261.21" x2="89.67" y2="252.98"/>
	<line class="st0" x1="102.33" y1="255.75" x2="88.07" y2="247.52"/>
	<line class="st0" x1="94.48" y1="269.36" x2="80.21" y2="261.12"/>
	<line class="st0" x1="98.4" y1="262.56" x2="84.14" y2="254.32"/>
	<line class="st0" x1="201.65" y1="200.53" x2="201.65" y2="184.06"/>
	<line class="st0" x1="224.76" y1="200.53" x2="224.76" y2="184.06"/>
	<line class="st0" x1="216.9" y1="200.53" x2="216.9" y2="184.06"/>
	<line class="st0" x1="209.05" y1="200.53" x2="209.05" y2="184.06"/>
	<line class="st0" x1="205.12" y1="196.41" x2="205.12" y2="179.94"/>
	<line class="st0" x1="220.83" y1="196.41" x2="220.83" y2="179.94"/>
	<line class="st0" x1="212.97" y1="196.41" x2="212.97" y2="179.94"/>
	<line class="st0" x1="105.9" y1="122.65" x2="91.63" y2="130.89"/>
	<line class="st0" x1="98.04" y1="109.05" x2="83.78" y2="117.28"/>
	<line class="st0" x1="101.97" y1="115.85" x2="87.71" y2="124.09"/>
	<line class="st0" x1="92.51" y1="107.71" x2="78.25" y2="115.94"/>
	<line class="st0" x1="104.06" y1="127.71" x2="89.8" y2="135.95"/>
	<line class="st0" x1="96.44" y1="114.51" x2="82.18" y2="122.74"/>
	<line class="st0" x1="100.37" y1="121.31" x2="86.1" y2="129.55"/>
</g>
</svg>
