(kicad_pcb (version 20171130) (host pcbnew "(5.1.5)-3")

  (general
    (thickness 1.6)
    (drawings 3)
    (tracks 352)
    (zones 0)
    (modules 20)
    (nets 44)
  )

  (page A4)
  (layers
    (0 F.Cu signal)
    (31 B.Cu signal)
    (32 B.Adhes user)
    (33 F.Adhes user)
    (34 B.Paste user)
    (35 F.Paste user)
    (36 B.SilkS user)
    (37 F.SilkS user)
    (38 B.Mask user)
    (39 F.Mask user)
    (40 Dwgs.User user)
    (41 Cmts.User user)
    (42 Eco1.User user)
    (43 Eco2.User user)
    (44 Edge.Cuts user)
    (45 Margin user)
    (46 B.CrtYd user)
    (47 F.CrtYd user)
    (48 B.Fab user)
    (49 F.Fab user)
  )

  (setup
    (last_trace_width 0.3)
    (user_trace_width 0.4)
    (trace_clearance 0.4)
    (zone_clearance 0.508)
    (zone_45_only no)
    (trace_min 0.2)
    (via_size 0.8)
    (via_drill 0.4)
    (via_min_size 0.4)
    (via_min_drill 0.3)
    (uvia_size 0.3)
    (uvia_drill 0.1)
    (uvias_allowed no)
    (uvia_min_size 0.2)
    (uvia_min_drill 0.1)
    (edge_width 0.1)
    (segment_width 0.2)
    (pcb_text_width 0.3)
    (pcb_text_size 1.5 1.5)
    (mod_edge_width 0.15)
    (mod_text_size 1 1)
    (mod_text_width 0.15)
    (pad_size 1.524 1.524)
    (pad_drill 0.762)
    (pad_to_mask_clearance 0)
    (aux_axis_origin 0 0)
    (visible_elements 7FFFFFFF)
    (pcbplotparams
      (layerselection 0x010fc_ffffffff)
      (usegerberextensions false)
      (usegerberattributes false)
      (usegerberadvancedattributes false)
      (creategerberjobfile false)
      (excludeedgelayer true)
      (linewidth 0.100000)
      (plotframeref false)
      (viasonmask false)
      (mode 1)
      (useauxorigin false)
      (hpglpennumber 1)
      (hpglpenspeed 20)
      (hpglpendiameter 15.000000)
      (psnegative false)
      (psa4output false)
      (plotreference true)
      (plotvalue true)
      (plotinvisibletext false)
      (padsonsilk false)
      (subtractmaskfromsilk false)
      (outputformat 1)
      (mirror false)
      (drillshape 1)
      (scaleselection 1)
      (outputdirectory ""))
  )

  (net 0 "")
  (net 1 3V3)
  (net 2 GND)
  (net 3 "Net-(C2-Pad1)")
  (net 4 "Net-(J1-Pad1)")
  (net 5 "Net-(J1-Pad2)")
  (net 6 "Net-(J1-Pad4)")
  (net 7 "Net-(J1-Pad5)")
  (net 8 "Net-(J1-Pad6)")
  (net 9 "Net-(J1-Pad7)")
  (net 10 "Net-(J1-Pad8)")
  (net 11 "Net-(J1-Pad9)")
  (net 12 "Net-(J1-Pad10)")
  (net 13 "Net-(J1-Pad11)")
  (net 14 "Net-(J2-Pad1)")
  (net 15 "Net-(J2-Pad2)")
  (net 16 "Net-(J2-Pad3)")
  (net 17 "Net-(J2-Pad4)")
  (net 18 "Net-(J2-Pad5)")
  (net 19 "Net-(J2-Pad6)")
  (net 20 "Net-(J2-Pad7)")
  (net 21 "Net-(J2-Pad8)")
  (net 22 "Net-(J2-Pad9)")
  (net 23 "Net-(J3-Pad3)")
  (net 24 "Net-(J3-Pad4)")
  (net 25 "Net-(J3-Pad7)")
  (net 26 "Net-(J3-Pad8)")
  (net 27 "Net-(J3-Pad9)")
  (net 28 "Net-(J3-Pad10)")
  (net 29 "Net-(J3-Pad11)")
  (net 30 "Net-(LED2-Pad1)")
  (net 31 "Net-(LED3-Pad1)")
  (net 32 "Net-(M1-Pad2)")
  (net 33 "Net-(M1-Pad6)")
  (net 34 EN)
  (net 35 I027)
  (net 36 TXD)
  (net 37 RXD)
  (net 38 "Net-(LEDPOWER1-Pad1)")
  (net 39 1O0)
  (net 40 "Net-(S2-Pad1)")
  (net 41 "Net-(U1-Pad32)")
  (net 42 /I016)
  (net 43 /I04)

  (net_class Default "This is the default net class."
    (clearance 0.4)
    (trace_width 0.3)
    (via_dia 0.8)
    (via_drill 0.4)
    (uvia_dia 0.3)
    (uvia_drill 0.1)
    (add_net /I016)
    (add_net /I04)
    (add_net 1O0)
    (add_net 3V3)
    (add_net EN)
    (add_net GND)
    (add_net I027)
    (add_net "Net-(C2-Pad1)")
    (add_net "Net-(J1-Pad1)")
    (add_net "Net-(J1-Pad10)")
    (add_net "Net-(J1-Pad11)")
    (add_net "Net-(J1-Pad2)")
    (add_net "Net-(J1-Pad4)")
    (add_net "Net-(J1-Pad5)")
    (add_net "Net-(J1-Pad6)")
    (add_net "Net-(J1-Pad7)")
    (add_net "Net-(J1-Pad8)")
    (add_net "Net-(J1-Pad9)")
    (add_net "Net-(J2-Pad1)")
    (add_net "Net-(J2-Pad2)")
    (add_net "Net-(J2-Pad3)")
    (add_net "Net-(J2-Pad4)")
    (add_net "Net-(J2-Pad5)")
    (add_net "Net-(J2-Pad6)")
    (add_net "Net-(J2-Pad7)")
    (add_net "Net-(J2-Pad8)")
    (add_net "Net-(J2-Pad9)")
    (add_net "Net-(J3-Pad10)")
    (add_net "Net-(J3-Pad11)")
    (add_net "Net-(J3-Pad3)")
    (add_net "Net-(J3-Pad4)")
    (add_net "Net-(J3-Pad7)")
    (add_net "Net-(J3-Pad8)")
    (add_net "Net-(J3-Pad9)")
    (add_net "Net-(LED2-Pad1)")
    (add_net "Net-(LED3-Pad1)")
    (add_net "Net-(LEDPOWER1-Pad1)")
    (add_net "Net-(M1-Pad2)")
    (add_net "Net-(M1-Pad6)")
    (add_net "Net-(S2-Pad1)")
    (add_net "Net-(U1-Pad32)")
    (add_net RXD)
    (add_net TXD)
  )

  (module Connector_PinHeader_2.54mm:PinHeader_1x13_P2.54mm_Vertical (layer F.Cu) (tedit 59FED5CC) (tstamp 5E68DE7C)
    (at 185.15 75.65)
    (descr "Through hole straight pin header, 1x13, 2.54mm pitch, single row")
    (tags "Through hole pin header THT 1x13 2.54mm single row")
    (path /5E78B59C)
    (fp_text reference J3 (at 0 -2.33) (layer F.SilkS)
      (effects (font (size 1 1) (thickness 0.15)))
    )
    (fp_text value Conn_01x13_Female (at 0 32.81) (layer F.Fab)
      (effects (font (size 1 1) (thickness 0.15)))
    )
    (fp_line (start -0.635 -1.27) (end 1.27 -1.27) (layer F.Fab) (width 0.1))
    (fp_line (start 1.27 -1.27) (end 1.27 31.75) (layer F.Fab) (width 0.1))
    (fp_line (start 1.27 31.75) (end -1.27 31.75) (layer F.Fab) (width 0.1))
    (fp_line (start -1.27 31.75) (end -1.27 -0.635) (layer F.Fab) (width 0.1))
    (fp_line (start -1.27 -0.635) (end -0.635 -1.27) (layer F.Fab) (width 0.1))
    (fp_line (start -1.33 31.81) (end 1.33 31.81) (layer F.SilkS) (width 0.12))
    (fp_line (start -1.33 1.27) (end -1.33 31.81) (layer F.SilkS) (width 0.12))
    (fp_line (start 1.33 1.27) (end 1.33 31.81) (layer F.SilkS) (width 0.12))
    (fp_line (start -1.33 1.27) (end 1.33 1.27) (layer F.SilkS) (width 0.12))
    (fp_line (start -1.33 0) (end -1.33 -1.33) (layer F.SilkS) (width 0.12))
    (fp_line (start -1.33 -1.33) (end 0 -1.33) (layer F.SilkS) (width 0.12))
    (fp_line (start -1.8 -1.8) (end -1.8 32.25) (layer F.CrtYd) (width 0.05))
    (fp_line (start -1.8 32.25) (end 1.8 32.25) (layer F.CrtYd) (width 0.05))
    (fp_line (start 1.8 32.25) (end 1.8 -1.8) (layer F.CrtYd) (width 0.05))
    (fp_line (start 1.8 -1.8) (end -1.8 -1.8) (layer F.CrtYd) (width 0.05))
    (fp_text user %R (at 0 15.24 90) (layer F.Fab)
      (effects (font (size 1 1) (thickness 0.15)))
    )
    (pad 1 thru_hole rect (at 0 0) (size 1.7 1.7) (drill 1) (layers *.Cu *.Mask)
      (net 1 3V3))
    (pad 2 thru_hole oval (at 0 2.54) (size 1.7 1.7) (drill 1) (layers *.Cu *.Mask)
      (net 2 GND))
    (pad 3 thru_hole oval (at 0 5.08) (size 1.7 1.7) (drill 1) (layers *.Cu *.Mask)
      (net 23 "Net-(J3-Pad3)"))
    (pad 4 thru_hole oval (at 0 7.62) (size 1.7 1.7) (drill 1) (layers *.Cu *.Mask)
      (net 24 "Net-(J3-Pad4)"))
    (pad 5 thru_hole oval (at 0 10.16) (size 1.7 1.7) (drill 1) (layers *.Cu *.Mask)
      (net 36 TXD))
    (pad 6 thru_hole oval (at 0 12.7) (size 1.7 1.7) (drill 1) (layers *.Cu *.Mask)
      (net 37 RXD))
    (pad 7 thru_hole oval (at 0 15.24) (size 1.7 1.7) (drill 1) (layers *.Cu *.Mask)
      (net 25 "Net-(J3-Pad7)"))
    (pad 8 thru_hole oval (at 0 17.78) (size 1.7 1.7) (drill 1) (layers *.Cu *.Mask)
      (net 26 "Net-(J3-Pad8)"))
    (pad 9 thru_hole oval (at 0 20.32) (size 1.7 1.7) (drill 1) (layers *.Cu *.Mask)
      (net 27 "Net-(J3-Pad9)"))
    (pad 10 thru_hole oval (at 0 22.86) (size 1.7 1.7) (drill 1) (layers *.Cu *.Mask)
      (net 28 "Net-(J3-Pad10)"))
    (pad 11 thru_hole oval (at 0 25.4) (size 1.7 1.7) (drill 1) (layers *.Cu *.Mask)
      (net 29 "Net-(J3-Pad11)"))
    (pad 12 thru_hole oval (at 0 27.94) (size 1.7 1.7) (drill 1) (layers *.Cu *.Mask)
      (net 42 /I016))
    (pad 13 thru_hole oval (at 0 30.48) (size 1.7 1.7) (drill 1) (layers *.Cu *.Mask)
      (net 43 /I04))
    (model ${KISYS3DMOD}/Connector_PinHeader_2.54mm.3dshapes/PinHeader_1x13_P2.54mm_Vertical.wrl
      (at (xyz 0 0 0))
      (scale (xyz 1 1 1))
      (rotate (xyz 0 0 0))
    )
  )

  (module fab-LED1206 (layer F.Cu) (tedit 200000) (tstamp 5E68D9B7)
    (at 180.25 110.1 180)
    (descr "LED 1206 PADS (STANDARD PATTERN)")
    (tags "LED 1206 PADS (STANDARD PATTERN)")
    (path /5E7000F8)
    (attr smd)
    (fp_text reference LED3 (at 1.905 -1.905) (layer F.SilkS)
      (effects (font (size 1.27 1.27) (thickness 0.1016)))
    )
    (fp_text value LED (at 2.54 1.905) (layer F.SilkS)
      (effects (font (size 1.27 1.27) (thickness 0.1016)))
    )
    (fp_line (start -1.6891 0.8763) (end -0.9525 0.8763) (layer F.SilkS) (width 0.06604))
    (fp_line (start -0.9525 0.8763) (end -0.9525 -0.8763) (layer F.SilkS) (width 0.06604))
    (fp_line (start -1.6891 -0.8763) (end -0.9525 -0.8763) (layer F.SilkS) (width 0.06604))
    (fp_line (start -1.6891 0.8763) (end -1.6891 -0.8763) (layer F.SilkS) (width 0.06604))
    (fp_line (start 0.9525 0.8763) (end 1.6891 0.8763) (layer F.SilkS) (width 0.06604))
    (fp_line (start 1.6891 0.8763) (end 1.6891 -0.8763) (layer F.SilkS) (width 0.06604))
    (fp_line (start 0.9525 -0.8763) (end 1.6891 -0.8763) (layer F.SilkS) (width 0.06604))
    (fp_line (start 0.9525 0.8763) (end 0.9525 -0.8763) (layer F.SilkS) (width 0.06604))
    (fp_line (start 0.9525 0.8128) (end -0.9652 0.8128) (layer F.SilkS) (width 0.1524))
    (fp_line (start 0.9525 -0.8128) (end -0.9652 -0.8128) (layer F.SilkS) (width 0.1524))
    (fp_line (start -2.47142 -0.98298) (end 2.47142 -0.98298) (layer F.SilkS) (width 0.0508))
    (fp_line (start 2.47142 -0.98298) (end 2.47142 0.98298) (layer F.SilkS) (width 0.0508))
    (fp_line (start 2.47142 0.98298) (end -2.47142 0.98298) (layer F.SilkS) (width 0.0508))
    (fp_line (start -2.47142 0.98298) (end -2.47142 -0.98298) (layer F.SilkS) (width 0.0508))
    (pad 1 smd rect (at -1.41986 0 180) (size 1.59766 1.80086) (layers F.Cu F.Paste F.Mask)
      (net 31 "Net-(LED3-Pad1)"))
    (pad 2 smd rect (at 1.41986 0 180) (size 1.59766 1.80086) (layers F.Cu F.Paste F.Mask)
      (net 2 GND))
  )

  (module Connector_PinHeader_2.54mm:PinHeader_1x11_P2.54mm_Vertical (layer F.Cu) (tedit 59FED5CC) (tstamp 5E68DE5B)
    (at 128.05 106.45 180)
    (descr "Through hole straight pin header, 1x11, 2.54mm pitch, single row")
    (tags "Through hole pin header THT 1x11 2.54mm single row")
    (path /5E7605AA)
    (fp_text reference J1 (at 0 -2.33) (layer F.SilkS)
      (effects (font (size 1 1) (thickness 0.15)))
    )
    (fp_text value Conn_01x11_Female (at 0 27.73) (layer F.Fab)
      (effects (font (size 1 1) (thickness 0.15)))
    )
    (fp_line (start -0.635 -1.27) (end 1.27 -1.27) (layer F.Fab) (width 0.1))
    (fp_line (start 1.27 -1.27) (end 1.27 26.67) (layer F.Fab) (width 0.1))
    (fp_line (start 1.27 26.67) (end -1.27 26.67) (layer F.Fab) (width 0.1))
    (fp_line (start -1.27 26.67) (end -1.27 -0.635) (layer F.Fab) (width 0.1))
    (fp_line (start -1.27 -0.635) (end -0.635 -1.27) (layer F.Fab) (width 0.1))
    (fp_line (start -1.33 26.73) (end 1.33 26.73) (layer F.SilkS) (width 0.12))
    (fp_line (start -1.33 1.27) (end -1.33 26.73) (layer F.SilkS) (width 0.12))
    (fp_line (start 1.33 1.27) (end 1.33 26.73) (layer F.SilkS) (width 0.12))
    (fp_line (start -1.33 1.27) (end 1.33 1.27) (layer F.SilkS) (width 0.12))
    (fp_line (start -1.33 0) (end -1.33 -1.33) (layer F.SilkS) (width 0.12))
    (fp_line (start -1.33 -1.33) (end 0 -1.33) (layer F.SilkS) (width 0.12))
    (fp_line (start -1.8 -1.8) (end -1.8 27.2) (layer F.CrtYd) (width 0.05))
    (fp_line (start -1.8 27.2) (end 1.8 27.2) (layer F.CrtYd) (width 0.05))
    (fp_line (start 1.8 27.2) (end 1.8 -1.8) (layer F.CrtYd) (width 0.05))
    (fp_line (start 1.8 -1.8) (end -1.8 -1.8) (layer F.CrtYd) (width 0.05))
    (fp_text user %R (at 0 12.7 90) (layer F.Fab)
      (effects (font (size 1 1) (thickness 0.15)))
    )
    (pad 1 thru_hole rect (at 0 0 180) (size 1.7 1.7) (drill 1) (layers *.Cu *.Mask)
      (net 4 "Net-(J1-Pad1)"))
    (pad 2 thru_hole oval (at 0 2.54 180) (size 1.7 1.7) (drill 1) (layers *.Cu *.Mask)
      (net 5 "Net-(J1-Pad2)"))
    (pad 3 thru_hole oval (at 0 5.08 180) (size 1.7 1.7) (drill 1) (layers *.Cu *.Mask)
      (net 35 I027))
    (pad 4 thru_hole oval (at 0 7.62 180) (size 1.7 1.7) (drill 1) (layers *.Cu *.Mask)
      (net 6 "Net-(J1-Pad4)"))
    (pad 5 thru_hole oval (at 0 10.16 180) (size 1.7 1.7) (drill 1) (layers *.Cu *.Mask)
      (net 7 "Net-(J1-Pad5)"))
    (pad 6 thru_hole oval (at 0 12.7 180) (size 1.7 1.7) (drill 1) (layers *.Cu *.Mask)
      (net 8 "Net-(J1-Pad6)"))
    (pad 7 thru_hole oval (at 0 15.24 180) (size 1.7 1.7) (drill 1) (layers *.Cu *.Mask)
      (net 9 "Net-(J1-Pad7)"))
    (pad 8 thru_hole oval (at 0 17.78 180) (size 1.7 1.7) (drill 1) (layers *.Cu *.Mask)
      (net 10 "Net-(J1-Pad8)"))
    (pad 9 thru_hole oval (at 0 20.32 180) (size 1.7 1.7) (drill 1) (layers *.Cu *.Mask)
      (net 11 "Net-(J1-Pad9)"))
    (pad 10 thru_hole oval (at 0 22.86 180) (size 1.7 1.7) (drill 1) (layers *.Cu *.Mask)
      (net 12 "Net-(J1-Pad10)"))
    (pad 11 thru_hole oval (at 0 25.4 180) (size 1.7 1.7) (drill 1) (layers *.Cu *.Mask)
      (net 13 "Net-(J1-Pad11)"))
    (model ${KISYS3DMOD}/Connector_PinHeader_2.54mm.3dshapes/PinHeader_1x11_P2.54mm_Vertical.wrl
      (at (xyz 0 0 0))
      (scale (xyz 1 1 1))
      (rotate (xyz 0 0 0))
    )
  )

  (module fab-6MM_SWITCH (layer F.Cu) (tedit 200000) (tstamp 5E688D54)
    (at 137.9 108.15)
    (descr "OMRON SWITCH")
    (tags "OMRON SWITCH")
    (path /5E6B437C)
    (attr smd)
    (fp_text reference S1 (at 0.127 -4.318) (layer F.SilkS)
      (effects (font (size 1.27 1.27) (thickness 0.127)))
    )
    (fp_text value 6MM_SWITCH6MM_SWITCH (at 0.762 4.445) (layer F.SilkS)
      (effects (font (size 1.27 1.27) (thickness 0.127)))
    )
    (fp_text user 4 (at 4.191 2.159) (layer B.SilkS)
      (effects (font (size 1.27 1.27) (thickness 0.127)))
    )
    (fp_text user 3 (at -3.937 2.159) (layer B.SilkS)
      (effects (font (size 1.27 1.27) (thickness 0.127)))
    )
    (fp_text user 2 (at 4.191 -2.159) (layer B.SilkS)
      (effects (font (size 1.27 1.27) (thickness 0.127)))
    )
    (fp_text user 1 (at -3.683 -2.286) (layer B.SilkS)
      (effects (font (size 1.27 1.27) (thickness 0.127)))
    )
    (fp_circle (center 0 0) (end -0.127 0.127) (layer B.SilkS) (width 0.0762))
    (fp_circle (center 0 0) (end -0.3175 0.3175) (layer F.SilkS) (width 0.0254))
    (fp_circle (center -2.159 -2.159) (end -2.413 -2.413) (layer F.SilkS) (width 0.0762))
    (fp_circle (center 2.159 -2.159) (end 2.413 -2.413) (layer F.SilkS) (width 0.0762))
    (fp_circle (center 2.159 2.032) (end 2.413 2.286) (layer F.SilkS) (width 0.0762))
    (fp_circle (center -2.159 2.159) (end -2.413 2.413) (layer F.SilkS) (width 0.0762))
    (fp_circle (center 0 0) (end -0.889 0.889) (layer B.SilkS) (width 0.0762))
    (fp_line (start -2.413 -0.508) (end -2.159 0.381) (layer F.SilkS) (width 0.1524))
    (fp_line (start -2.413 0.508) (end -2.413 1.27) (layer F.SilkS) (width 0.1524))
    (fp_line (start -2.413 -1.27) (end -2.413 -0.508) (layer F.SilkS) (width 0.1524))
    (fp_line (start 1.27 -2.286) (end -1.27 -2.286) (layer F.SilkS) (width 0.1524))
    (fp_line (start -1.27 2.159) (end 1.27 2.159) (layer F.SilkS) (width 0.1524))
    (fp_line (start -3.048 -0.762) (end -3.048 -1.016) (layer B.SilkS) (width 0.1524))
    (fp_line (start -3.048 0.762) (end -3.048 1.016) (layer B.SilkS) (width 0.1524))
    (fp_line (start 3.048 -0.762) (end 3.048 -1.016) (layer B.SilkS) (width 0.1524))
    (fp_line (start 3.048 0.762) (end 3.048 1.016) (layer B.SilkS) (width 0.1524))
    (fp_line (start 1.143 3.048) (end 2.159 3.048) (layer B.SilkS) (width 0.1524))
    (fp_line (start -1.27 3.048) (end 1.143 3.048) (layer B.SilkS) (width 0.1524))
    (fp_line (start -1.27 -3.048) (end -2.159 -3.048) (layer B.SilkS) (width 0.1524))
    (fp_line (start 1.27 -3.048) (end -1.27 -3.048) (layer B.SilkS) (width 0.1524))
    (fp_line (start 2.159 -3.048) (end 1.27 -3.048) (layer B.SilkS) (width 0.1524))
    (fp_line (start 2.54 -3.048) (end 2.159 -3.048) (layer F.SilkS) (width 0.1524))
    (fp_line (start -2.54 -3.048) (end -2.159 -3.048) (layer F.SilkS) (width 0.1524))
    (fp_line (start -2.159 3.048) (end -1.27 3.048) (layer B.SilkS) (width 0.1524))
    (fp_line (start -2.54 3.048) (end -2.159 3.048) (layer F.SilkS) (width 0.1524))
    (fp_line (start 2.54 3.048) (end 2.159 3.048) (layer F.SilkS) (width 0.1524))
    (fp_line (start -1.27 2.794) (end -1.27 3.048) (layer B.SilkS) (width 0.0508))
    (fp_line (start 1.143 2.794) (end 1.143 3.048) (layer B.SilkS) (width 0.0508))
    (fp_line (start 1.143 2.794) (end -1.27 2.794) (layer B.SilkS) (width 0.0508))
    (fp_line (start 1.27 -2.794) (end 1.27 -3.048) (layer B.SilkS) (width 0.0508))
    (fp_line (start 1.27 -2.794) (end -1.27 -2.794) (layer B.SilkS) (width 0.0508))
    (fp_line (start -1.27 -3.048) (end -1.27 -2.794) (layer B.SilkS) (width 0.0508))
    (fp_line (start -1.27 -1.27) (end 1.27 -1.27) (layer F.SilkS) (width 0.0508))
    (fp_line (start 1.27 1.27) (end 1.27 -1.27) (layer F.SilkS) (width 0.0508))
    (fp_line (start 1.27 1.27) (end -1.27 1.27) (layer F.SilkS) (width 0.0508))
    (fp_line (start -1.27 -1.27) (end -1.27 1.27) (layer F.SilkS) (width 0.0508))
    (fp_line (start -3.048 2.54) (end -3.048 1.016) (layer F.SilkS) (width 0.1524))
    (fp_line (start -2.54 3.048) (end -3.048 2.54) (layer F.SilkS) (width 0.1524))
    (fp_line (start -3.048 -2.54) (end -3.048 -1.016) (layer F.SilkS) (width 0.1524))
    (fp_line (start -2.54 -3.048) (end -3.048 -2.54) (layer F.SilkS) (width 0.1524))
    (fp_line (start 3.048 2.54) (end 3.048 1.016) (layer F.SilkS) (width 0.1524))
    (fp_line (start 2.54 3.048) (end 3.048 2.54) (layer F.SilkS) (width 0.1524))
    (fp_line (start 3.048 -2.54) (end 2.54 -3.048) (layer F.SilkS) (width 0.1524))
    (fp_line (start -3.048 0.762) (end -3.302 0.762) (layer B.SilkS) (width 0.1524))
    (fp_line (start -3.302 -0.762) (end -3.302 0.762) (layer B.SilkS) (width 0.1524))
    (fp_line (start -3.302 -0.762) (end -3.048 -0.762) (layer B.SilkS) (width 0.1524))
    (fp_line (start 3.048 -1.016) (end 3.048 -2.54) (layer F.SilkS) (width 0.1524))
    (fp_line (start 3.048 -0.762) (end 3.302 -0.762) (layer B.SilkS) (width 0.1524))
    (fp_line (start 3.302 0.762) (end 3.302 -0.762) (layer B.SilkS) (width 0.1524))
    (fp_line (start 3.302 0.762) (end 3.048 0.762) (layer B.SilkS) (width 0.1524))
    (pad 4 smd rect (at 3.302 2.286) (size 2.286 1.524) (layers F.Cu F.Paste F.Mask)
      (net 1 3V3))
    (pad 3 smd rect (at -3.302 2.286) (size 2.286 1.524) (layers F.Cu F.Paste F.Mask)
      (net 1 3V3))
    (pad 2 smd rect (at 3.302 -2.286) (size 2.286 1.524) (layers F.Cu F.Paste F.Mask)
      (net 35 I027))
    (pad 1 smd rect (at -3.302 -2.286) (size 2.286 1.524) (layers F.Cu F.Paste F.Mask)
      (net 35 I027))
  )

  (module fab-C1206FAB (layer F.Cu) (tedit 200000) (tstamp 5E6884D1)
    (at 142.57 81.63 90)
    (path /5E701702)
    (attr smd)
    (fp_text reference C1 (at 0.762 -1.778 90) (layer F.SilkS)
      (effects (font (size 1.016 1.016) (thickness 0.1524)))
    )
    (fp_text value 0.1uF (at 1.27 1.778 90) (layer F.SilkS)
      (effects (font (size 1.016 1.016) (thickness 0.1524)))
    )
    (fp_line (start -2.032 -1.016) (end 2.032 -1.016) (layer B.SilkS) (width 0.127))
    (fp_line (start 2.032 -1.016) (end 2.032 1.016) (layer B.SilkS) (width 0.127))
    (fp_line (start 2.032 1.016) (end -2.032 1.016) (layer B.SilkS) (width 0.127))
    (fp_line (start -2.032 1.016) (end -2.032 -1.016) (layer B.SilkS) (width 0.127))
    (pad 1 smd rect (at -1.651 0 90) (size 1.27 1.905) (layers F.Cu F.Paste F.Mask)
      (net 1 3V3))
    (pad 2 smd rect (at 1.651 0 90) (size 1.27 1.905) (layers F.Cu F.Paste F.Mask)
      (net 2 GND))
  )

  (module fab-C1206FAB (layer F.Cu) (tedit 200000) (tstamp 5E6884DB)
    (at 180.2 75.55 270)
    (path /5E7023DF)
    (attr smd)
    (fp_text reference C2 (at 0.762 -1.778 90) (layer F.SilkS)
      (effects (font (size 1.016 1.016) (thickness 0.1524)))
    )
    (fp_text value 10μF (at 1.27 1.778 90) (layer F.SilkS)
      (effects (font (size 1.016 1.016) (thickness 0.1524)))
    )
    (fp_line (start -2.032 1.016) (end -2.032 -1.016) (layer B.SilkS) (width 0.127))
    (fp_line (start 2.032 1.016) (end -2.032 1.016) (layer B.SilkS) (width 0.127))
    (fp_line (start 2.032 -1.016) (end 2.032 1.016) (layer B.SilkS) (width 0.127))
    (fp_line (start -2.032 -1.016) (end 2.032 -1.016) (layer B.SilkS) (width 0.127))
    (pad 2 smd rect (at 1.651 0 270) (size 1.27 1.905) (layers F.Cu F.Paste F.Mask)
      (net 2 GND))
    (pad 1 smd rect (at -1.651 0 270) (size 1.27 1.905) (layers F.Cu F.Paste F.Mask)
      (net 3 "Net-(C2-Pad1)"))
  )

  (module fab-C1206FAB (layer F.Cu) (tedit 200000) (tstamp 5E6884E5)
    (at 168.86 82.41 180)
    (path /5E702814)
    (attr smd)
    (fp_text reference C3 (at 0.762 -1.778) (layer F.SilkS)
      (effects (font (size 1.016 1.016) (thickness 0.1524)))
    )
    (fp_text value 10μF (at 1.27 1.778) (layer F.SilkS)
      (effects (font (size 1.016 1.016) (thickness 0.1524)))
    )
    (fp_line (start -2.032 -1.016) (end 2.032 -1.016) (layer B.SilkS) (width 0.127))
    (fp_line (start 2.032 -1.016) (end 2.032 1.016) (layer B.SilkS) (width 0.127))
    (fp_line (start 2.032 1.016) (end -2.032 1.016) (layer B.SilkS) (width 0.127))
    (fp_line (start -2.032 1.016) (end -2.032 -1.016) (layer B.SilkS) (width 0.127))
    (pad 1 smd rect (at -1.651 0 180) (size 1.27 1.905) (layers F.Cu F.Paste F.Mask)
      (net 1 3V3))
    (pad 2 smd rect (at 1.651 0 180) (size 1.27 1.905) (layers F.Cu F.Paste F.Mask)
      (net 2 GND))
  )

  (module Connector_PinHeader_2.54mm:PinHeader_1x09_P2.54mm_Vertical (layer F.Cu) (tedit 59FED5CC) (tstamp 5E688523)
    (at 166.32 111.15 270)
    (descr "Through hole straight pin header, 1x09, 2.54mm pitch, single row")
    (tags "Through hole pin header THT 1x09 2.54mm single row")
    (path /5E6E9790)
    (fp_text reference J2 (at 0 -2.33 90) (layer F.SilkS)
      (effects (font (size 1 1) (thickness 0.15)))
    )
    (fp_text value Conn_01x09_Female (at 0 22.65 90) (layer F.Fab)
      (effects (font (size 1 1) (thickness 0.15)))
    )
    (fp_line (start -0.635 -1.27) (end 1.27 -1.27) (layer F.Fab) (width 0.1))
    (fp_line (start 1.27 -1.27) (end 1.27 21.59) (layer F.Fab) (width 0.1))
    (fp_line (start 1.27 21.59) (end -1.27 21.59) (layer F.Fab) (width 0.1))
    (fp_line (start -1.27 21.59) (end -1.27 -0.635) (layer F.Fab) (width 0.1))
    (fp_line (start -1.27 -0.635) (end -0.635 -1.27) (layer F.Fab) (width 0.1))
    (fp_line (start -1.33 21.65) (end 1.33 21.65) (layer F.SilkS) (width 0.12))
    (fp_line (start -1.33 1.27) (end -1.33 21.65) (layer F.SilkS) (width 0.12))
    (fp_line (start 1.33 1.27) (end 1.33 21.65) (layer F.SilkS) (width 0.12))
    (fp_line (start -1.33 1.27) (end 1.33 1.27) (layer F.SilkS) (width 0.12))
    (fp_line (start -1.33 0) (end -1.33 -1.33) (layer F.SilkS) (width 0.12))
    (fp_line (start -1.33 -1.33) (end 0 -1.33) (layer F.SilkS) (width 0.12))
    (fp_line (start -1.8 -1.8) (end -1.8 22.1) (layer F.CrtYd) (width 0.05))
    (fp_line (start -1.8 22.1) (end 1.8 22.1) (layer F.CrtYd) (width 0.05))
    (fp_line (start 1.8 22.1) (end 1.8 -1.8) (layer F.CrtYd) (width 0.05))
    (fp_line (start 1.8 -1.8) (end -1.8 -1.8) (layer F.CrtYd) (width 0.05))
    (fp_text user %R (at 0 10.16) (layer F.Fab)
      (effects (font (size 1 1) (thickness 0.15)))
    )
    (pad 1 thru_hole rect (at 0 0 270) (size 1.7 1.7) (drill 1) (layers *.Cu *.Mask)
      (net 14 "Net-(J2-Pad1)"))
    (pad 2 thru_hole oval (at 0 2.54 270) (size 1.7 1.7) (drill 1) (layers *.Cu *.Mask)
      (net 15 "Net-(J2-Pad2)"))
    (pad 3 thru_hole oval (at 0 5.08 270) (size 1.7 1.7) (drill 1) (layers *.Cu *.Mask)
      (net 16 "Net-(J2-Pad3)"))
    (pad 4 thru_hole oval (at 0 7.62 270) (size 1.7 1.7) (drill 1) (layers *.Cu *.Mask)
      (net 17 "Net-(J2-Pad4)"))
    (pad 5 thru_hole oval (at 0 10.16 270) (size 1.7 1.7) (drill 1) (layers *.Cu *.Mask)
      (net 18 "Net-(J2-Pad5)"))
    (pad 6 thru_hole oval (at 0 12.7 270) (size 1.7 1.7) (drill 1) (layers *.Cu *.Mask)
      (net 19 "Net-(J2-Pad6)"))
    (pad 7 thru_hole oval (at 0 15.24 270) (size 1.7 1.7) (drill 1) (layers *.Cu *.Mask)
      (net 20 "Net-(J2-Pad7)"))
    (pad 8 thru_hole oval (at 0 17.78 270) (size 1.7 1.7) (drill 1) (layers *.Cu *.Mask)
      (net 21 "Net-(J2-Pad8)"))
    (pad 9 thru_hole oval (at 0 20.32 270) (size 1.7 1.7) (drill 1) (layers *.Cu *.Mask)
      (net 22 "Net-(J2-Pad9)"))
    (model ${KISYS3DMOD}/Connector_PinHeader_2.54mm.3dshapes/PinHeader_1x09_P2.54mm_Vertical.wrl
      (at (xyz 0 0 0))
      (scale (xyz 1 1 1))
      (rotate (xyz 0 0 0))
    )
  )

  (module fab-LED1206 (layer F.Cu) (tedit 200000) (tstamp 5E68D9F0)
    (at 173.4 109.7 180)
    (descr "LED 1206 PADS (STANDARD PATTERN)")
    (tags "LED 1206 PADS (STANDARD PATTERN)")
    (path /5E6FFCA0)
    (attr smd)
    (fp_text reference LED2 (at 1.905 -1.905) (layer F.SilkS)
      (effects (font (size 1.27 1.27) (thickness 0.1016)))
    )
    (fp_text value LED (at 2.54 1.905) (layer F.SilkS)
      (effects (font (size 1.27 1.27) (thickness 0.1016)))
    )
    (fp_line (start -2.47142 0.98298) (end -2.47142 -0.98298) (layer F.SilkS) (width 0.0508))
    (fp_line (start 2.47142 0.98298) (end -2.47142 0.98298) (layer F.SilkS) (width 0.0508))
    (fp_line (start 2.47142 -0.98298) (end 2.47142 0.98298) (layer F.SilkS) (width 0.0508))
    (fp_line (start -2.47142 -0.98298) (end 2.47142 -0.98298) (layer F.SilkS) (width 0.0508))
    (fp_line (start 0.9525 -0.8128) (end -0.9652 -0.8128) (layer F.SilkS) (width 0.1524))
    (fp_line (start 0.9525 0.8128) (end -0.9652 0.8128) (layer F.SilkS) (width 0.1524))
    (fp_line (start 0.9525 0.8763) (end 0.9525 -0.8763) (layer F.SilkS) (width 0.06604))
    (fp_line (start 0.9525 -0.8763) (end 1.6891 -0.8763) (layer F.SilkS) (width 0.06604))
    (fp_line (start 1.6891 0.8763) (end 1.6891 -0.8763) (layer F.SilkS) (width 0.06604))
    (fp_line (start 0.9525 0.8763) (end 1.6891 0.8763) (layer F.SilkS) (width 0.06604))
    (fp_line (start -1.6891 0.8763) (end -1.6891 -0.8763) (layer F.SilkS) (width 0.06604))
    (fp_line (start -1.6891 -0.8763) (end -0.9525 -0.8763) (layer F.SilkS) (width 0.06604))
    (fp_line (start -0.9525 0.8763) (end -0.9525 -0.8763) (layer F.SilkS) (width 0.06604))
    (fp_line (start -1.6891 0.8763) (end -0.9525 0.8763) (layer F.SilkS) (width 0.06604))
    (pad 2 smd rect (at 1.41986 0 180) (size 1.59766 1.80086) (layers F.Cu F.Paste F.Mask)
      (net 2 GND))
    (pad 1 smd rect (at -1.41986 0 180) (size 1.59766 1.80086) (layers F.Cu F.Paste F.Mask)
      (net 30 "Net-(LED2-Pad1)"))
  )

  (module fab-1X06SMD (layer F.Cu) (tedit 200000) (tstamp 5E68EDB6)
    (at 157.95 72.39 90)
    (path /5E700CB2)
    (attr smd)
    (fp_text reference M1 (at -2.54 0) (layer F.SilkS)
      (effects (font (size 1.27 1.27) (thickness 0.1016)))
    )
    (fp_text value FTDI-SMD-HEADER (at 0 0 90) (layer F.SilkS)
      (effects (font (size 1.27 1.27) (thickness 0.15)))
    )
    (pad 1 smd rect (at 0 -6.35 90) (size 2.54 1.27) (layers F.Cu F.Paste F.Mask)
      (net 2 GND))
    (pad 2 smd rect (at 0 -3.81 90) (size 2.54 1.27) (layers F.Cu F.Paste F.Mask)
      (net 32 "Net-(M1-Pad2)"))
    (pad 3 smd rect (at 0 -1.27 90) (size 2.54 1.27) (layers F.Cu F.Paste F.Mask)
      (net 3 "Net-(C2-Pad1)"))
    (pad 4 smd rect (at 0 1.27 90) (size 2.54 1.27) (layers F.Cu F.Paste F.Mask)
      (net 37 RXD))
    (pad 5 smd rect (at 0 3.81 90) (size 2.54 1.27) (layers F.Cu F.Paste F.Mask)
      (net 36 TXD))
    (pad 6 smd rect (at 0 6.35 90) (size 2.54 1.27) (layers F.Cu F.Paste F.Mask)
      (net 33 "Net-(M1-Pad6)"))
  )

  (module fab-R1206FAB (layer F.Cu) (tedit 200000) (tstamp 5E688595)
    (at 135.301 81.15 180)
    (path /5E6FDD26)
    (attr smd)
    (fp_text reference R1 (at 0.762 -1.778) (layer F.SilkS)
      (effects (font (size 1.016 1.016) (thickness 0.1524)))
    )
    (fp_text value 10KΩ (at 1.27 1.778) (layer F.SilkS)
      (effects (font (size 1.016 1.016) (thickness 0.1524)))
    )
    (fp_line (start -2.032 -1.016) (end 2.032 -1.016) (layer B.SilkS) (width 0.127))
    (fp_line (start 2.032 -1.016) (end 2.032 1.016) (layer B.SilkS) (width 0.127))
    (fp_line (start 2.032 1.016) (end -2.032 1.016) (layer B.SilkS) (width 0.127))
    (fp_line (start -2.032 1.016) (end -2.032 -1.016) (layer B.SilkS) (width 0.127))
    (pad 1 smd rect (at -1.651 0 180) (size 1.27 1.905) (layers F.Cu F.Paste F.Mask)
      (net 34 EN))
    (pad 2 smd rect (at 1.651 0 180) (size 1.27 1.905) (layers F.Cu F.Paste F.Mask)
      (net 1 3V3))
  )

  (module fab-R1206FAB (layer F.Cu) (tedit 200000) (tstamp 5E68859F)
    (at 174.95 104.9 270)
    (path /5E6FE2C7)
    (attr smd)
    (fp_text reference R2 (at 0.762 -1.778 90) (layer F.SilkS)
      (effects (font (size 1.016 1.016) (thickness 0.1524)))
    )
    (fp_text value 100Ω (at 1.27 1.778 90) (layer F.SilkS)
      (effects (font (size 1.016 1.016) (thickness 0.1524)))
    )
    (fp_line (start -2.032 1.016) (end -2.032 -1.016) (layer B.SilkS) (width 0.127))
    (fp_line (start 2.032 1.016) (end -2.032 1.016) (layer B.SilkS) (width 0.127))
    (fp_line (start 2.032 -1.016) (end 2.032 1.016) (layer B.SilkS) (width 0.127))
    (fp_line (start -2.032 -1.016) (end 2.032 -1.016) (layer B.SilkS) (width 0.127))
    (pad 2 smd rect (at 1.651 0 270) (size 1.27 1.905) (layers F.Cu F.Paste F.Mask)
      (net 30 "Net-(LED2-Pad1)"))
    (pad 1 smd rect (at -1.651 0 270) (size 1.27 1.905) (layers F.Cu F.Paste F.Mask)
      (net 43 /I04))
  )

  (module fab-R1206FAB (layer F.Cu) (tedit 200000) (tstamp 5E6885A9)
    (at 179.4 104.5 270)
    (path /5E6FE93C)
    (attr smd)
    (fp_text reference R3 (at 0.762 -1.778 90) (layer F.SilkS)
      (effects (font (size 1.016 1.016) (thickness 0.1524)))
    )
    (fp_text value 100Ω (at 1.27 1.778 90) (layer F.SilkS)
      (effects (font (size 1.016 1.016) (thickness 0.1524)))
    )
    (fp_line (start -2.032 -1.016) (end 2.032 -1.016) (layer B.SilkS) (width 0.127))
    (fp_line (start 2.032 -1.016) (end 2.032 1.016) (layer B.SilkS) (width 0.127))
    (fp_line (start 2.032 1.016) (end -2.032 1.016) (layer B.SilkS) (width 0.127))
    (fp_line (start -2.032 1.016) (end -2.032 -1.016) (layer B.SilkS) (width 0.127))
    (pad 1 smd rect (at -1.651 0 270) (size 1.27 1.905) (layers F.Cu F.Paste F.Mask)
      (net 42 /I016))
    (pad 2 smd rect (at 1.651 0 270) (size 1.27 1.905) (layers F.Cu F.Paste F.Mask)
      (net 31 "Net-(LED3-Pad1)"))
  )

  (module ESP32-footprints-Lib:ESP32-WROOM_FAB (layer F.Cu) (tedit 5E60E014) (tstamp 5E6885DC)
    (at 155.71 90.14 180)
    (path /5E6BE087)
    (fp_text reference U1 (at -11.557 9.017) (layer F.SilkS)
      (effects (font (size 1 1) (thickness 0.15)))
    )
    (fp_text value ESP32-WROOM (at 5.715 14.224) (layer F.Fab)
      (effects (font (size 1 1) (thickness 0.15)))
    )
    (fp_line (start -9 12.75) (end 9 12.75) (layer F.SilkS) (width 0.15))
    (fp_line (start -9 -12.75) (end 9 -12.75) (layer F.SilkS) (width 0.15))
    (fp_line (start -9 12.75) (end -9 -12.75) (layer F.SilkS) (width 0.15))
    (fp_line (start 9 12.75) (end 9 -12.75) (layer F.SilkS) (width 0.15))
    (fp_line (start -9 6.75) (end 9 6.75) (layer F.SilkS) (width 0.15))
    (fp_text user ESP32-WROOM (at -5.207 0.254 90) (layer F.SilkS)
      (effects (font (size 1 1) (thickness 0.15)))
    )
    (fp_circle (center 9.906 6.604) (end 10.033 6.858) (layer F.SilkS) (width 0.5))
    (fp_text user "Espressif Systems" (at -6.858 -0.889 90) (layer F.SilkS)
      (effects (font (size 1 1) (thickness 0.15)))
    )
    (pad 39 smd rect (at 0.3 -2.45 180) (size 6 6) (layers F.Cu F.Paste F.Mask)
      (net 2 GND))
    (pad 1 smd rect (at 9 5.25 180) (size 2.5 0.7) (layers F.Cu F.Paste F.Mask)
      (net 2 GND))
    (pad 2 smd rect (at 9 3.98 180) (size 2.5 0.7) (layers F.Cu F.Paste F.Mask)
      (net 1 3V3))
    (pad 3 smd rect (at 9 2.71 180) (size 2.5 0.7) (layers F.Cu F.Paste F.Mask)
      (net 34 EN))
    (pad 4 smd rect (at 9 1.44 180) (size 2.5 0.7) (layers F.Cu F.Paste F.Mask)
      (net 13 "Net-(J1-Pad11)"))
    (pad 5 smd rect (at 9 0.17 180) (size 2.5 0.7) (layers F.Cu F.Paste F.Mask)
      (net 12 "Net-(J1-Pad10)"))
    (pad 6 smd rect (at 9 -1.1 180) (size 2.5 0.7) (layers F.Cu F.Paste F.Mask)
      (net 11 "Net-(J1-Pad9)"))
    (pad 7 smd rect (at 9 -2.37 180) (size 2.5 0.7) (layers F.Cu F.Paste F.Mask)
      (net 10 "Net-(J1-Pad8)"))
    (pad 8 smd rect (at 9 -3.64 180) (size 2.5 0.7) (layers F.Cu F.Paste F.Mask)
      (net 9 "Net-(J1-Pad7)"))
    (pad 9 smd rect (at 9 -4.91 180) (size 2.5 0.7) (layers F.Cu F.Paste F.Mask)
      (net 8 "Net-(J1-Pad6)"))
    (pad 10 smd rect (at 9 -6.18 180) (size 2.5 0.7) (layers F.Cu F.Paste F.Mask)
      (net 7 "Net-(J1-Pad5)"))
    (pad 11 smd rect (at 9 -7.45 180) (size 2.5 0.7) (layers F.Cu F.Paste F.Mask)
      (net 6 "Net-(J1-Pad4)"))
    (pad 12 smd rect (at 9 -8.72 180) (size 2.5 0.7) (layers F.Cu F.Paste F.Mask)
      (net 35 I027))
    (pad 13 smd rect (at 9 -9.99 180) (size 2.5 0.7) (layers F.Cu F.Paste F.Mask)
      (net 5 "Net-(J1-Pad2)"))
    (pad 14 smd rect (at 9 -11.26 180) (size 2.5 0.7) (layers F.Cu F.Paste F.Mask)
      (net 4 "Net-(J1-Pad1)"))
    (pad 15 smd rect (at 5.715 -12.75 180) (size 0.7 2.5) (layers F.Cu F.Paste F.Mask)
      (net 2 GND))
    (pad 16 smd rect (at 4.445 -12.75 180) (size 0.7 2.5) (layers F.Cu F.Paste F.Mask)
      (net 22 "Net-(J2-Pad9)"))
    (pad 17 smd rect (at 3.175 -12.75 180) (size 0.7 2.5) (layers F.Cu F.Paste F.Mask)
      (net 21 "Net-(J2-Pad8)"))
    (pad 18 smd rect (at 1.905 -12.75 180) (size 0.7 2.5) (layers F.Cu F.Paste F.Mask)
      (net 20 "Net-(J2-Pad7)"))
    (pad 19 smd rect (at 0.635 -12.75 180) (size 0.7 2.5) (layers F.Cu F.Paste F.Mask)
      (net 19 "Net-(J2-Pad6)"))
    (pad 20 smd rect (at -0.635 -12.75 180) (size 0.7 2.5) (layers F.Cu F.Paste F.Mask)
      (net 18 "Net-(J2-Pad5)"))
    (pad 21 smd rect (at -1.905 -12.75 180) (size 0.7 2.5) (layers F.Cu F.Paste F.Mask)
      (net 17 "Net-(J2-Pad4)"))
    (pad 22 smd rect (at -3.175 -12.75 180) (size 0.7 2.5) (layers F.Cu F.Paste F.Mask)
      (net 16 "Net-(J2-Pad3)"))
    (pad 23 smd rect (at -4.445 -12.75 180) (size 0.7 2.5) (layers F.Cu F.Paste F.Mask)
      (net 15 "Net-(J2-Pad2)"))
    (pad 24 smd rect (at -5.715 -12.75 180) (size 0.7 2.5) (layers F.Cu F.Paste F.Mask)
      (net 14 "Net-(J2-Pad1)"))
    (pad 25 smd rect (at -9 -11.26 180) (size 2.5 0.7) (layers F.Cu F.Paste F.Mask)
      (net 39 1O0))
    (pad 26 smd rect (at -9 -9.99 180) (size 2.5 0.7) (layers F.Cu F.Paste F.Mask)
      (net 43 /I04))
    (pad 27 smd rect (at -9 -8.72 180) (size 2.5 0.7) (layers F.Cu F.Paste F.Mask)
      (net 42 /I016))
    (pad 28 smd rect (at -9 -7.45 180) (size 2.5 0.7) (layers F.Cu F.Paste F.Mask)
      (net 29 "Net-(J3-Pad11)"))
    (pad 29 smd rect (at -9 -6.18 180) (size 2.5 0.7) (layers F.Cu F.Paste F.Mask)
      (net 28 "Net-(J3-Pad10)"))
    (pad 30 smd rect (at -9 -4.91 180) (size 2.5 0.7) (layers F.Cu F.Paste F.Mask)
      (net 27 "Net-(J3-Pad9)"))
    (pad 31 smd rect (at -9 -3.64 180) (size 2.5 0.7) (layers F.Cu F.Paste F.Mask)
      (net 26 "Net-(J3-Pad8)"))
    (pad 32 smd rect (at -9 -2.37 180) (size 2.5 0.7) (layers F.Cu F.Paste F.Mask)
      (net 41 "Net-(U1-Pad32)"))
    (pad 33 smd rect (at -9 -1.1 180) (size 2.5 0.7) (layers F.Cu F.Paste F.Mask)
      (net 25 "Net-(J3-Pad7)"))
    (pad 34 smd rect (at -9 0.17 180) (size 2.5 0.7) (layers F.Cu F.Paste F.Mask)
      (net 37 RXD))
    (pad 35 smd rect (at -9 1.44 180) (size 2.5 0.7) (layers F.Cu F.Paste F.Mask)
      (net 36 TXD))
    (pad 36 smd rect (at -9 2.71 180) (size 2.5 0.7) (layers F.Cu F.Paste F.Mask)
      (net 24 "Net-(J3-Pad4)"))
    (pad 37 smd rect (at -9 3.98 180) (size 2.5 0.7) (layers F.Cu F.Paste F.Mask)
      (net 23 "Net-(J3-Pad3)"))
    (pad 38 smd rect (at -9 5.25 180) (size 2.5 0.7) (layers F.Cu F.Paste F.Mask)
      (net 2 GND))
  )

  (module Package_TO_SOT_SMD:SOT-223-3_TabPin2 (layer F.Cu) (tedit 5A02FF57) (tstamp 5E68D188)
    (at 171.33 75.07 90)
    (descr "module CMS SOT223 4 pins")
    (tags "CMS SOT")
    (path /5E6FB097)
    (attr smd)
    (fp_text reference U2 (at 0 -4.5 90) (layer F.SilkS)
      (effects (font (size 1 1) (thickness 0.15)))
    )
    (fp_text value AP1117-15 (at 0 4.5 90) (layer F.Fab)
      (effects (font (size 1 1) (thickness 0.15)))
    )
    (fp_text user %R (at -1.27 -1.27) (layer F.Fab)
      (effects (font (size 0.8 0.8) (thickness 0.12)))
    )
    (fp_line (start 1.91 3.41) (end 1.91 2.15) (layer F.SilkS) (width 0.12))
    (fp_line (start 1.91 -3.41) (end 1.91 -2.15) (layer F.SilkS) (width 0.12))
    (fp_line (start 4.4 -3.6) (end -4.4 -3.6) (layer F.CrtYd) (width 0.05))
    (fp_line (start 4.4 3.6) (end 4.4 -3.6) (layer F.CrtYd) (width 0.05))
    (fp_line (start -4.4 3.6) (end 4.4 3.6) (layer F.CrtYd) (width 0.05))
    (fp_line (start -4.4 -3.6) (end -4.4 3.6) (layer F.CrtYd) (width 0.05))
    (fp_line (start -1.85 -2.35) (end -0.85 -3.35) (layer F.Fab) (width 0.1))
    (fp_line (start -1.85 -2.35) (end -1.85 3.35) (layer F.Fab) (width 0.1))
    (fp_line (start -1.85 3.41) (end 1.91 3.41) (layer F.SilkS) (width 0.12))
    (fp_line (start -0.85 -3.35) (end 1.85 -3.35) (layer F.Fab) (width 0.1))
    (fp_line (start -4.1 -3.41) (end 1.91 -3.41) (layer F.SilkS) (width 0.12))
    (fp_line (start -1.85 3.35) (end 1.85 3.35) (layer F.Fab) (width 0.1))
    (fp_line (start 1.85 -3.35) (end 1.85 3.35) (layer F.Fab) (width 0.1))
    (pad 2 smd rect (at 3.15 0 90) (size 2 3.8) (layers F.Cu F.Paste F.Mask)
      (net 1 3V3))
    (pad 2 smd rect (at -3.15 0 90) (size 2 1.5) (layers F.Cu F.Paste F.Mask)
      (net 1 3V3))
    (pad 3 smd rect (at -3.15 2.3 90) (size 2 1.5) (layers F.Cu F.Paste F.Mask)
      (net 3 "Net-(C2-Pad1)"))
    (pad 1 smd rect (at -3.15 -2.3 90) (size 2 1.5) (layers F.Cu F.Paste F.Mask)
      (net 2 GND))
    (model ${KISYS3DMOD}/Package_TO_SOT_SMD.3dshapes/SOT-223.wrl
      (at (xyz 0 0 0))
      (scale (xyz 1 1 1))
      (rotate (xyz 0 0 0))
    )
  )

  (module fab-LED1206 (layer F.Cu) (tedit 200000) (tstamp 5E68ED6C)
    (at 143.45 74.3 270)
    (descr "LED 1206 PADS (STANDARD PATTERN)")
    (tags "LED 1206 PADS (STANDARD PATTERN)")
    (path /5E680CDB)
    (attr smd)
    (fp_text reference LEDPOWER1 (at 0 -3.81 90) (layer F.SilkS)
      (effects (font (size 1.27 1.27) (thickness 0.1016)))
    )
    (fp_text value LED (at 2.54 1.905 90) (layer F.SilkS)
      (effects (font (size 1.27 1.27) (thickness 0.1016)))
    )
    (fp_line (start -1.6891 0.8763) (end -0.9525 0.8763) (layer F.SilkS) (width 0.06604))
    (fp_line (start -0.9525 0.8763) (end -0.9525 -0.8763) (layer F.SilkS) (width 0.06604))
    (fp_line (start -1.6891 -0.8763) (end -0.9525 -0.8763) (layer F.SilkS) (width 0.06604))
    (fp_line (start -1.6891 0.8763) (end -1.6891 -0.8763) (layer F.SilkS) (width 0.06604))
    (fp_line (start 0.9525 0.8763) (end 1.6891 0.8763) (layer F.SilkS) (width 0.06604))
    (fp_line (start 1.6891 0.8763) (end 1.6891 -0.8763) (layer F.SilkS) (width 0.06604))
    (fp_line (start 0.9525 -0.8763) (end 1.6891 -0.8763) (layer F.SilkS) (width 0.06604))
    (fp_line (start 0.9525 0.8763) (end 0.9525 -0.8763) (layer F.SilkS) (width 0.06604))
    (fp_line (start 0.9525 0.8128) (end -0.9652 0.8128) (layer F.SilkS) (width 0.1524))
    (fp_line (start 0.9525 -0.8128) (end -0.9652 -0.8128) (layer F.SilkS) (width 0.1524))
    (fp_line (start -2.47142 -0.98298) (end 2.47142 -0.98298) (layer F.SilkS) (width 0.0508))
    (fp_line (start 2.47142 -0.98298) (end 2.47142 0.98298) (layer F.SilkS) (width 0.0508))
    (fp_line (start 2.47142 0.98298) (end -2.47142 0.98298) (layer F.SilkS) (width 0.0508))
    (fp_line (start -2.47142 0.98298) (end -2.47142 -0.98298) (layer F.SilkS) (width 0.0508))
    (pad 1 smd rect (at -1.41986 0 270) (size 1.59766 1.80086) (layers F.Cu F.Paste F.Mask)
      (net 38 "Net-(LEDPOWER1-Pad1)"))
    (pad 2 smd rect (at 1.41986 0 270) (size 1.59766 1.80086) (layers F.Cu F.Paste F.Mask)
      (net 2 GND))
  )

  (module fab-R1206FAB (layer F.Cu) (tedit 200000) (tstamp 5E68ED9B)
    (at 148.25 71.96 270)
    (path /5E681792)
    (attr smd)
    (fp_text reference R4 (at 0.762 -1.778 90) (layer F.SilkS)
      (effects (font (size 1.016 1.016) (thickness 0.1524)))
    )
    (fp_text value 100Ω (at 1.27 1.778 90) (layer F.SilkS)
      (effects (font (size 1.016 1.016) (thickness 0.1524)))
    )
    (fp_line (start -2.032 1.016) (end -2.032 -1.016) (layer B.SilkS) (width 0.127))
    (fp_line (start 2.032 1.016) (end -2.032 1.016) (layer B.SilkS) (width 0.127))
    (fp_line (start 2.032 -1.016) (end 2.032 1.016) (layer B.SilkS) (width 0.127))
    (fp_line (start -2.032 -1.016) (end 2.032 -1.016) (layer B.SilkS) (width 0.127))
    (pad 2 smd rect (at 1.651 0 270) (size 1.27 1.905) (layers F.Cu F.Paste F.Mask)
      (net 38 "Net-(LEDPOWER1-Pad1)"))
    (pad 1 smd rect (at -1.651 0 270) (size 1.27 1.905) (layers F.Cu F.Paste F.Mask)
      (net 1 3V3))
  )

  (module fab-R1206FAB (layer F.Cu) (tedit 200000) (tstamp 5E688CD8)
    (at 146.3 105.25 270)
    (path /5E6E1ACE)
    (attr smd)
    (fp_text reference R5 (at 0.762 -1.778 90) (layer F.SilkS)
      (effects (font (size 1.016 1.016) (thickness 0.1524)))
    )
    (fp_text value 2.2k (at 0 6.35 90) (layer F.SilkS)
      (effects (font (size 1.016 1.016) (thickness 0.1524)))
    )
    (fp_line (start -2.032 -1.016) (end 2.032 -1.016) (layer B.SilkS) (width 0.127))
    (fp_line (start 2.032 -1.016) (end 2.032 1.016) (layer B.SilkS) (width 0.127))
    (fp_line (start 2.032 1.016) (end -2.032 1.016) (layer B.SilkS) (width 0.127))
    (fp_line (start -2.032 1.016) (end -2.032 -1.016) (layer B.SilkS) (width 0.127))
    (pad 1 smd rect (at -1.651 0 270) (size 1.27 1.905) (layers F.Cu F.Paste F.Mask)
      (net 35 I027))
    (pad 2 smd rect (at 1.651 0 270) (size 1.27 1.905) (layers F.Cu F.Paste F.Mask)
      (net 2 GND))
  )

  (module fab-6MM_SWITCH (layer F.Cu) (tedit 200000) (tstamp 5E688D16)
    (at 135.65 72.7 270)
    (descr "OMRON SWITCH")
    (tags "OMRON SWITCH")
    (path /5E6B8795)
    (attr smd)
    (fp_text reference RESETBUTTON1 (at 0.127 -4.318 90) (layer F.SilkS)
      (effects (font (size 1.27 1.27) (thickness 0.127)))
    )
    (fp_text value 6MM_SWITCH6MM_SWITCH (at 0.762 4.445 90) (layer F.SilkS)
      (effects (font (size 1.27 1.27) (thickness 0.127)))
    )
    (fp_line (start 3.302 0.762) (end 3.048 0.762) (layer B.SilkS) (width 0.1524))
    (fp_line (start 3.302 0.762) (end 3.302 -0.762) (layer B.SilkS) (width 0.1524))
    (fp_line (start 3.048 -0.762) (end 3.302 -0.762) (layer B.SilkS) (width 0.1524))
    (fp_line (start 3.048 -1.016) (end 3.048 -2.54) (layer F.SilkS) (width 0.1524))
    (fp_line (start -3.302 -0.762) (end -3.048 -0.762) (layer B.SilkS) (width 0.1524))
    (fp_line (start -3.302 -0.762) (end -3.302 0.762) (layer B.SilkS) (width 0.1524))
    (fp_line (start -3.048 0.762) (end -3.302 0.762) (layer B.SilkS) (width 0.1524))
    (fp_line (start 3.048 -2.54) (end 2.54 -3.048) (layer F.SilkS) (width 0.1524))
    (fp_line (start 2.54 3.048) (end 3.048 2.54) (layer F.SilkS) (width 0.1524))
    (fp_line (start 3.048 2.54) (end 3.048 1.016) (layer F.SilkS) (width 0.1524))
    (fp_line (start -2.54 -3.048) (end -3.048 -2.54) (layer F.SilkS) (width 0.1524))
    (fp_line (start -3.048 -2.54) (end -3.048 -1.016) (layer F.SilkS) (width 0.1524))
    (fp_line (start -2.54 3.048) (end -3.048 2.54) (layer F.SilkS) (width 0.1524))
    (fp_line (start -3.048 2.54) (end -3.048 1.016) (layer F.SilkS) (width 0.1524))
    (fp_line (start -1.27 -1.27) (end -1.27 1.27) (layer F.SilkS) (width 0.0508))
    (fp_line (start 1.27 1.27) (end -1.27 1.27) (layer F.SilkS) (width 0.0508))
    (fp_line (start 1.27 1.27) (end 1.27 -1.27) (layer F.SilkS) (width 0.0508))
    (fp_line (start -1.27 -1.27) (end 1.27 -1.27) (layer F.SilkS) (width 0.0508))
    (fp_line (start -1.27 -3.048) (end -1.27 -2.794) (layer B.SilkS) (width 0.0508))
    (fp_line (start 1.27 -2.794) (end -1.27 -2.794) (layer B.SilkS) (width 0.0508))
    (fp_line (start 1.27 -2.794) (end 1.27 -3.048) (layer B.SilkS) (width 0.0508))
    (fp_line (start 1.143 2.794) (end -1.27 2.794) (layer B.SilkS) (width 0.0508))
    (fp_line (start 1.143 2.794) (end 1.143 3.048) (layer B.SilkS) (width 0.0508))
    (fp_line (start -1.27 2.794) (end -1.27 3.048) (layer B.SilkS) (width 0.0508))
    (fp_line (start 2.54 3.048) (end 2.159 3.048) (layer F.SilkS) (width 0.1524))
    (fp_line (start -2.54 3.048) (end -2.159 3.048) (layer F.SilkS) (width 0.1524))
    (fp_line (start -2.159 3.048) (end -1.27 3.048) (layer B.SilkS) (width 0.1524))
    (fp_line (start -2.54 -3.048) (end -2.159 -3.048) (layer F.SilkS) (width 0.1524))
    (fp_line (start 2.54 -3.048) (end 2.159 -3.048) (layer F.SilkS) (width 0.1524))
    (fp_line (start 2.159 -3.048) (end 1.27 -3.048) (layer B.SilkS) (width 0.1524))
    (fp_line (start 1.27 -3.048) (end -1.27 -3.048) (layer B.SilkS) (width 0.1524))
    (fp_line (start -1.27 -3.048) (end -2.159 -3.048) (layer B.SilkS) (width 0.1524))
    (fp_line (start -1.27 3.048) (end 1.143 3.048) (layer B.SilkS) (width 0.1524))
    (fp_line (start 1.143 3.048) (end 2.159 3.048) (layer B.SilkS) (width 0.1524))
    (fp_line (start 3.048 0.762) (end 3.048 1.016) (layer B.SilkS) (width 0.1524))
    (fp_line (start 3.048 -0.762) (end 3.048 -1.016) (layer B.SilkS) (width 0.1524))
    (fp_line (start -3.048 0.762) (end -3.048 1.016) (layer B.SilkS) (width 0.1524))
    (fp_line (start -3.048 -0.762) (end -3.048 -1.016) (layer B.SilkS) (width 0.1524))
    (fp_line (start -1.27 2.159) (end 1.27 2.159) (layer F.SilkS) (width 0.1524))
    (fp_line (start 1.27 -2.286) (end -1.27 -2.286) (layer F.SilkS) (width 0.1524))
    (fp_line (start -2.413 -1.27) (end -2.413 -0.508) (layer F.SilkS) (width 0.1524))
    (fp_line (start -2.413 0.508) (end -2.413 1.27) (layer F.SilkS) (width 0.1524))
    (fp_line (start -2.413 -0.508) (end -2.159 0.381) (layer F.SilkS) (width 0.1524))
    (fp_circle (center 0 0) (end -0.889 0.889) (layer B.SilkS) (width 0.0762))
    (fp_circle (center -2.159 2.159) (end -2.413 2.413) (layer F.SilkS) (width 0.0762))
    (fp_circle (center 2.159 2.032) (end 2.413 2.286) (layer F.SilkS) (width 0.0762))
    (fp_circle (center 2.159 -2.159) (end 2.413 -2.413) (layer F.SilkS) (width 0.0762))
    (fp_circle (center -2.159 -2.159) (end -2.413 -2.413) (layer F.SilkS) (width 0.0762))
    (fp_circle (center 0 0) (end -0.3175 0.3175) (layer F.SilkS) (width 0.0254))
    (fp_circle (center 0 0) (end -0.127 0.127) (layer B.SilkS) (width 0.0762))
    (fp_text user 1 (at -3.683 -2.286 90) (layer B.SilkS)
      (effects (font (size 1.27 1.27) (thickness 0.127)))
    )
    (fp_text user 2 (at 4.191 -2.159 90) (layer B.SilkS)
      (effects (font (size 1.27 1.27) (thickness 0.127)))
    )
    (fp_text user 3 (at -3.937 2.159 90) (layer B.SilkS)
      (effects (font (size 1.27 1.27) (thickness 0.127)))
    )
    (fp_text user 4 (at 4.191 2.159 90) (layer B.SilkS)
      (effects (font (size 1.27 1.27) (thickness 0.127)))
    )
    (pad 1 smd rect (at -3.302 -2.286 270) (size 2.286 1.524) (layers F.Cu F.Paste F.Mask)
      (net 2 GND))
    (pad 2 smd rect (at 3.302 -2.286 270) (size 2.286 1.524) (layers F.Cu F.Paste F.Mask)
      (net 2 GND))
    (pad 3 smd rect (at -3.302 2.286 270) (size 2.286 1.524) (layers F.Cu F.Paste F.Mask)
      (net 34 EN))
    (pad 4 smd rect (at 3.302 2.286 270) (size 2.286 1.524) (layers F.Cu F.Paste F.Mask)
      (net 34 EN))
  )

  (module fab:fab-AYZ0102AGRLC (layer F.Cu) (tedit 200000) (tstamp 5E68DC05)
    (at 166.9 106.4 180)
    (path /5E772C4E)
    (attr smd)
    (fp_text reference S2 (at 0.381 -3.429) (layer F.SilkS)
      (effects (font (size 1.27 1.27) (thickness 0.1016)))
    )
    (fp_text value SLIDE-SWITCH (at 0.508 3.937) (layer F.SilkS)
      (effects (font (size 1.27 1.27) (thickness 0.1016)))
    )
    (fp_line (start -3.59918 1.4986) (end 3.59918 1.4986) (layer B.SilkS) (width 0.127))
    (fp_line (start 3.59918 1.4986) (end 3.59918 -1.4986) (layer B.SilkS) (width 0.127))
    (fp_line (start 3.59918 -1.4986) (end 1.4986 -1.4986) (layer B.SilkS) (width 0.127))
    (fp_line (start 1.4986 -1.4986) (end -1.4986 -1.4986) (layer B.SilkS) (width 0.127))
    (fp_line (start -1.4986 -1.4986) (end -3.59918 -1.4986) (layer B.SilkS) (width 0.127))
    (fp_line (start -3.59918 -1.4986) (end -3.59918 1.4986) (layer B.SilkS) (width 0.127))
    (fp_line (start 0 -1.59766) (end 0 -2.49936) (layer B.SilkS) (width 0.127))
    (fp_line (start 0 -2.49936) (end 1.4986 -2.49936) (layer B.SilkS) (width 0.127))
    (fp_line (start 1.4986 -2.49936) (end 1.4986 -1.4986) (layer B.SilkS) (width 0.127))
    (fp_circle (center -1.4986 -0.39878) (end -1.70942 -0.6096) (layer F.SilkS) (width 0.127))
    (fp_line (start -1.92278 -0.39878) (end -1.07442 -0.39878) (layer F.SilkS) (width 0.127))
    (fp_line (start -1.4986 0.02286) (end -1.4986 -0.82296) (layer F.SilkS) (width 0.127))
    (fp_circle (center 1.4986 -0.39878) (end 1.70942 -0.6096) (layer F.SilkS) (width 0.127))
    (fp_line (start 1.07442 -0.39878) (end 1.92278 -0.39878) (layer F.SilkS) (width 0.127))
    (fp_line (start 1.4986 0.02286) (end 1.4986 -0.82296) (layer F.SilkS) (width 0.127))
    (pad 1 smd rect (at 2.49936 2.2987 180) (size 0.99822 1.19888) (layers F.Cu F.Paste F.Mask)
      (net 40 "Net-(S2-Pad1)"))
    (pad 2 smd rect (at 0 2.2987 180) (size 0.99822 1.19888) (layers F.Cu F.Paste F.Mask)
      (net 39 1O0))
    (pad 3 smd rect (at -2.49936 2.2987 180) (size 0.99822 1.19888) (layers F.Cu F.Paste F.Mask)
      (net 2 GND))
  )

  (dimension 49.850627 (width 0.15) (layer F.SilkS)
    (gr_text "49.851 mm" (at 204.88783 89.519949 89.71266149) (layer F.SilkS)
      (effects (font (size 1 1) (thickness 0.15)))
    )
    (feature1 (pts (xy 195.8 114.4) (xy 204.049259 114.44137)))
    (feature2 (pts (xy 196.05 64.55) (xy 204.299259 64.59137)))
    (crossbar (pts (xy 203.712846 64.58843) (xy 203.462846 114.43843)))
    (arrow1a (pts (xy 203.462846 114.43843) (xy 202.882082 113.309)))
    (arrow1b (pts (xy 203.462846 114.43843) (xy 204.054909 113.314881)))
    (arrow2a (pts (xy 203.712846 64.58843) (xy 203.120783 65.711979)))
    (arrow2b (pts (xy 203.712846 64.58843) (xy 204.29361 65.71786)))
  )
  (dimension 56.100557 (width 0.15) (layer F.SilkS)
    (gr_text "56.101 mm" (at 210.390726 92.723733 89.7446729) (layer F.SilkS)
      (effects (font (size 1 1) (thickness 0.15)))
    )
    (feature1 (pts (xy 182.75 64.55) (xy 209.802154 64.670553)))
    (feature2 (pts (xy 182.5 120.65) (xy 209.552154 120.770553)))
    (crossbar (pts (xy 208.965739 120.76794) (xy 209.215739 64.66794)))
    (arrow1a (pts (xy 209.215739 64.66794) (xy 209.797134 65.797046)))
    (arrow1b (pts (xy 209.215739 64.66794) (xy 208.624304 65.791819)))
    (arrow2a (pts (xy 208.965739 120.76794) (xy 209.557174 119.644061)))
    (arrow2b (pts (xy 208.965739 120.76794) (xy 208.384344 119.638834)))
  )
  (dimension 63.550079 (width 0.15) (layer F.SilkS) (tstamp 5E68D244)
    (gr_text "63.550 mm" (at 157.951649 44.540019 359.9098415) (layer F.SilkS) (tstamp 5E68D245)
      (effects (font (size 1 1) (thickness 0.15)))
    )
    (feature1 (pts (xy 189.65 93.3) (xy 189.725525 45.303597)))
    (feature2 (pts (xy 126.1 93.2) (xy 126.175525 45.203597)))
    (crossbar (pts (xy 126.174603 45.790017) (xy 189.724603 45.890017)))
    (arrow1a (pts (xy 189.724603 45.890017) (xy 188.597178 46.474664)))
    (arrow1b (pts (xy 189.724603 45.890017) (xy 188.599023 45.301824)))
    (arrow2a (pts (xy 126.174603 45.790017) (xy 127.300183 46.37821)))
    (arrow2b (pts (xy 126.174603 45.790017) (xy 127.302028 45.20537)))
  )

  (segment (start 170.13 82.029) (end 170.511 82.41) (width 0.4) (layer F.Cu) (net 1))
  (segment (start 125 78.1) (end 125 109.731384) (width 0.4) (layer F.Cu) (net 1))
  (segment (start 136.141 110.436) (end 141.202 110.436) (width 0.4) (layer F.Cu) (net 1))
  (segment (start 134.598 110.436) (end 136.141 110.436) (width 0.4) (layer F.Cu) (net 1))
  (segment (start 145.06 86.16) (end 146.71 86.16) (width 0.4) (layer F.Cu) (net 1))
  (segment (start 143.164 86.16) (end 145.06 86.16) (width 0.4) (layer F.Cu) (net 1))
  (segment (start 142.57 83.281) (end 142.57 84.316) (width 0.4) (layer F.Cu) (net 1))
  (segment (start 142.57 83.281) (end 141.2175 83.281) (width 0.4) (layer F.Cu) (net 1))
  (segment (start 132.615 81.15) (end 133.65 81.15) (width 0.4) (layer F.Cu) (net 1))
  (segment (start 131.176998 79.711998) (end 132.615 81.15) (width 0.4) (layer F.Cu) (net 1))
  (segment (start 131.15 78.15) (end 131.176998 79.711998) (width 0.4) (layer F.Cu) (net 1))
  (segment (start 139.8175 83.281) (end 142.57 83.281) (width 0.3) (layer F.Cu) (net 1))
  (segment (start 139.15 82.6135) (end 139.8175 83.281) (width 0.3) (layer F.Cu) (net 1))
  (segment (start 142.57 85.566) (end 143.164 86.16) (width 0.3) (layer F.Cu) (net 1))
  (segment (start 142.57 83.281) (end 142.57 85.566) (width 0.3) (layer F.Cu) (net 1))
  (segment (start 148.25 70.309) (end 148.22925 68.47925) (width 0.4) (layer F.Cu) (net 1))
  (segment (start 148.2 68.45) (end 148.22925 68.47925) (width 0.3) (layer F.Cu) (net 1))
  (segment (start 170.511 82.41) (end 170.511 80.789) (width 0.3) (layer F.Cu) (net 1))
  (segment (start 171.33 79.97) (end 171.33 78.22) (width 0.3) (layer F.Cu) (net 1))
  (segment (start 170.511 80.789) (end 171.33 79.97) (width 0.3) (layer F.Cu) (net 1))
  (segment (start 171.33 79.97) (end 177.15 79.95) (width 0.3) (layer F.Cu) (net 1))
  (segment (start 177.15 79.95) (end 177.15 75.9) (width 0.3) (layer F.Cu) (net 1))
  (segment (start 177.4 75.65) (end 185.15 75.65) (width 0.3) (layer F.Cu) (net 1))
  (segment (start 177.15 75.9) (end 177.4 75.65) (width 0.3) (layer F.Cu) (net 1))
  (segment (start 171.33 73.22) (end 169.6 74.95) (width 0.3) (layer F.Cu) (net 1))
  (segment (start 171.33 71.92) (end 171.33 73.22) (width 0.3) (layer F.Cu) (net 1))
  (segment (start 169.6 74.95) (end 159.05 74.95) (width 0.3) (layer F.Cu) (net 1))
  (segment (start 157.865001 73.765001) (end 157.865001 70.365001) (width 0.3) (layer F.Cu) (net 1))
  (segment (start 159.05 74.95) (end 157.865001 73.765001) (width 0.3) (layer F.Cu) (net 1))
  (segment (start 157.865001 70.365001) (end 157 69.5) (width 0.3) (layer F.Cu) (net 1))
  (segment (start 149.5025 70.309) (end 148.25 70.309) (width 0.3) (layer F.Cu) (net 1))
  (segment (start 150.3115 69.5) (end 149.5025 70.309) (width 0.3) (layer F.Cu) (net 1))
  (segment (start 157 69.5) (end 150.3115 69.5) (width 0.3) (layer F.Cu) (net 1))
  (segment (start 133.738952 66.811048) (end 148.188952 66.811048) (width 0.3) (layer F.Cu) (net 1))
  (segment (start 148.188952 66.811048) (end 148.2 66.8) (width 0.3) (layer F.Cu) (net 1))
  (segment (start 148.2 68.45) (end 148.2 66.8) (width 0.3) (layer F.Cu) (net 1))
  (segment (start 131.176998 68.6) (end 131.15 78.15) (width 0.4) (layer F.Cu) (net 1))
  (segment (start 133 66.8) (end 131.176998 68.6) (width 0.4) (layer F.Cu) (net 1))
  (segment (start 133.738952 66.811048) (end 133.65 66.8) (width 0.4) (layer F.Cu) (net 1))
  (segment (start 133.65 66.8) (end 133 66.8) (width 0.4) (layer F.Cu) (net 1))
  (segment (start 135.35 76.880498) (end 135.3 68.45) (width 0.4) (layer F.Cu) (net 1))
  (segment (start 139.15 82.6135) (end 139.15 80.680498) (width 0.4) (layer F.Cu) (net 1))
  (segment (start 139.15 80.680498) (end 135.35 76.880498) (width 0.4) (layer F.Cu) (net 1))
  (segment (start 135.3 68.45) (end 133.738952 66.811048) (width 0.4) (layer F.Cu) (net 1))
  (segment (start 125 110.45) (end 125.2 110.65) (width 0.3) (layer F.Cu) (net 1))
  (segment (start 125 109.731384) (end 125 110.45) (width 0.3) (layer F.Cu) (net 1))
  (segment (start 125.2 110.65) (end 132.891 110.7) (width 0.3) (layer F.Cu) (net 1))
  (segment (start 133.155 110.436) (end 134.598 110.436) (width 0.3) (layer F.Cu) (net 1))
  (segment (start 132.891 110.7) (end 133.155 110.436) (width 0.3) (layer F.Cu) (net 1))
  (segment (start 125 78.1) (end 131.15 78.15) (width 0.3) (layer F.Cu) (net 1))
  (segment (start 166.174 82.41) (end 164.66 83.924) (width 0.4) (layer F.Cu) (net 2))
  (segment (start 164.71 84.14) (end 164.71 84.89) (width 0.4) (layer F.Cu) (net 2))
  (segment (start 167.209 82.41) (end 166.174 82.41) (width 0.4) (layer F.Cu) (net 2))
  (segment (start 168.409 78.841) (end 169.03 78.22) (width 0.4) (layer F.Cu) (net 2))
  (segment (start 151.6 74.06) (end 151.6 72.39) (width 0.4) (layer F.Cu) (net 2) (tstamp 5E68EDE7))
  (segment (start 144.75043 75.71986) (end 145.53057 76.5) (width 0.4) (layer F.Cu) (net 2) (tstamp 5E68EDF3))
  (segment (start 143.45 75.71986) (end 144.75043 75.71986) (width 0.4) (layer F.Cu) (net 2) (tstamp 5E68EDEA))
  (segment (start 152.01 92.59) (end 155.41 92.59) (width 0.4) (layer F.Cu) (net 2))
  (segment (start 149.995 94.605) (end 152.01 92.59) (width 0.4) (layer F.Cu) (net 2))
  (segment (start 149.995 102.89) (end 149.995 94.605) (width 0.4) (layer F.Cu) (net 2))
  (segment (start 151.11 84.89) (end 155.41 89.19) (width 0.4) (layer F.Cu) (net 2))
  (segment (start 146.71 84.89) (end 151.11 84.89) (width 0.4) (layer F.Cu) (net 2))
  (segment (start 159.71 84.89) (end 155.41 89.19) (width 0.4) (layer F.Cu) (net 2))
  (segment (start 155.41 89.19) (end 155.41 92.59) (width 0.4) (layer F.Cu) (net 2))
  (segment (start 164.71 84.89) (end 159.71 84.89) (width 0.4) (layer F.Cu) (net 2))
  (segment (start 137.936 76.002) (end 139.098 76.002) (width 0.4) (layer F.Cu) (net 2))
  (segment (start 137.936 69.398) (end 137.936 76.002) (width 0.4) (layer F.Cu) (net 2))
  (segment (start 149.995 104.54) (end 149.995 102.89) (width 0.4) (layer F.Cu) (net 2))
  (segment (start 149.995 105.04) (end 149.995 104.54) (width 0.4) (layer F.Cu) (net 2))
  (segment (start 170.29847 104.1013) (end 170.29977 104.1) (width 0.4) (layer F.Cu) (net 2))
  (segment (start 169.39936 104.1013) (end 170.29847 104.1013) (width 0.4) (layer F.Cu) (net 2))
  (segment (start 170.29977 104.1) (end 171.6 104.1) (width 0.4) (layer F.Cu) (net 2))
  (segment (start 171.93014 104.83014) (end 171.93014 111) (width 0.4) (layer F.Cu) (net 2))
  (segment (start 171.6 104.1) (end 171.63014 104.13014) (width 0.4) (layer F.Cu) (net 2))
  (segment (start 171.98014 111.00043) (end 173.07971 112.1) (width 0.4) (layer F.Cu) (net 2) (tstamp 5E68DA1A))
  (segment (start 171.98014 109.7) (end 171.98014 111.00043) (width 0.4) (layer F.Cu) (net 2) (tstamp 5E68DA26))
  (segment (start 178.83014 111.40043) (end 178.83014 110.1) (width 0.4) (layer F.Cu) (net 2) (tstamp 5E68DA23))
  (segment (start 178.13057 112.1) (end 178.83014 111.40043) (width 0.4) (layer F.Cu) (net 2) (tstamp 5E68DA20))
  (segment (start 173.07971 112.1) (end 178.13057 112.1) (width 0.4) (layer F.Cu) (net 2) (tstamp 5E68DA1D))
  (segment (start 149.995 105.04) (end 149.995 105.455) (width 0.3) (layer F.Cu) (net 2))
  (segment (start 148.549 106.901) (end 146.3 106.901) (width 0.3) (layer F.Cu) (net 2))
  (segment (start 149.995 105.455) (end 148.549 106.901) (width 0.3) (layer F.Cu) (net 2))
  (segment (start 162.859999 96.639999) (end 162.859999 102.230001) (width 0.4) (layer F.Cu) (net 2))
  (segment (start 155.41 92.59) (end 158.81 92.59) (width 0.4) (layer F.Cu) (net 2))
  (segment (start 158.81 92.59) (end 162.859999 96.639999) (width 0.4) (layer F.Cu) (net 2))
  (segment (start 162.859999 102.230001) (end 162.85 102.35) (width 0.4) (layer F.Cu) (net 2))
  (segment (start 169.249359 105.250741) (end 169.39936 105.10074) (width 0.3) (layer F.Cu) (net 2))
  (segment (start 163.199259 105.250741) (end 169.249359 105.250741) (width 0.3) (layer F.Cu) (net 2))
  (segment (start 162.85 102.35) (end 162.85 104.901482) (width 0.3) (layer F.Cu) (net 2))
  (segment (start 162.85 104.901482) (end 163.199259 105.250741) (width 0.3) (layer F.Cu) (net 2))
  (segment (start 169.39936 105.10074) (end 169.39936 104.1013) (width 0.3) (layer F.Cu) (net 2))
  (segment (start 171.6 104.1) (end 171.85 104.1) (width 0.3) (layer F.Cu) (net 2))
  (segment (start 171.93014 104.18014) (end 171.93014 104.83014) (width 0.3) (layer F.Cu) (net 2))
  (segment (start 171.85 104.1) (end 171.93014 104.18014) (width 0.3) (layer F.Cu) (net 2))
  (segment (start 146.71 84.89) (end 146.71 84.14) (width 0.4) (layer F.Cu) (net 2))
  (segment (start 143.799 79.979) (end 142.57 79.979) (width 0.4) (layer F.Cu) (net 2))
  (segment (start 141.3175 79.979) (end 142.57 79.979) (width 0.3) (layer F.Cu) (net 2))
  (segment (start 140.47 79.979) (end 141.3175 79.979) (width 0.3) (layer F.Cu) (net 2))
  (segment (start 137.936 77.445) (end 140.47 79.979) (width 0.3) (layer F.Cu) (net 2))
  (segment (start 137.936 76.002) (end 137.936 77.445) (width 0.3) (layer F.Cu) (net 2))
  (segment (start 142.57 79.979) (end 143.8225 79.979) (width 0.3) (layer F.Cu) (net 2))
  (segment (start 145.4 81.5565) (end 145.4 84.45) (width 0.3) (layer F.Cu) (net 2))
  (segment (start 145.84 84.89) (end 146.71 84.89) (width 0.3) (layer F.Cu) (net 2))
  (segment (start 145.4 84.45) (end 145.84 84.89) (width 0.3) (layer F.Cu) (net 2))
  (segment (start 164.66 84.54) (end 164.71 84.59) (width 0.3) (layer F.Cu) (net 2))
  (segment (start 164.66 83.924) (end 164.66 84.54) (width 0.3) (layer F.Cu) (net 2))
  (segment (start 145.75 76.5) (end 145.75 79.5) (width 0.3) (layer F.Cu) (net 2))
  (segment (start 145.75 79.5) (end 144.55 80.7) (width 0.3) (layer F.Cu) (net 2))
  (segment (start 145.75 76.5) (end 150.4 76.5) (width 0.4) (layer F.Cu) (net 2))
  (segment (start 145.53057 76.5) (end 145.75 76.5) (width 0.4) (layer F.Cu) (net 2))
  (segment (start 143.8225 79.979) (end 144.55 80.7) (width 0.3) (layer F.Cu) (net 2))
  (segment (start 144.55 80.7) (end 145.4 81.5565) (width 0.3) (layer F.Cu) (net 2))
  (segment (start 151.6 74.06) (end 151.6 76.25) (width 0.3) (layer F.Cu) (net 2))
  (segment (start 150.4 76.5) (end 151.35 76.5) (width 0.4) (layer F.Cu) (net 2))
  (segment (start 151.6 76.25) (end 151.35 76.5) (width 0.3) (layer F.Cu) (net 2))
  (segment (start 182.4415 78.19) (end 185.15 78.19) (width 0.3) (layer F.Cu) (net 2))
  (segment (start 180.2 77.201) (end 181.4525 77.201) (width 0.3) (layer F.Cu) (net 2))
  (segment (start 181.4525 77.201) (end 182.4415 78.19) (width 0.3) (layer F.Cu) (net 2))
  (segment (start 167.43 78.22) (end 169.03 78.22) (width 0.3) (layer F.Cu) (net 2))
  (segment (start 167.15 78.5) (end 167.43 78.22) (width 0.3) (layer F.Cu) (net 2))
  (segment (start 167.209 78.559) (end 167.209 82.41) (width 0.3) (layer F.Cu) (net 2))
  (segment (start 167.15 78.5) (end 167.209 78.559) (width 0.3) (layer F.Cu) (net 2))
  (segment (start 168.0465 84.6) (end 175.45 84.6) (width 0.4) (layer F.Cu) (net 2))
  (segment (start 167.209 82.41) (end 167.209 83.7625) (width 0.4) (layer F.Cu) (net 2))
  (segment (start 167.209 83.7625) (end 168.0465 84.6) (width 0.4) (layer F.Cu) (net 2))
  (segment (start 180.1 81.7) (end 180.2 81.6) (width 0.3) (layer F.Cu) (net 2))
  (segment (start 178.55 81.7) (end 180.1 81.7) (width 0.3) (layer F.Cu) (net 2))
  (segment (start 180.2 81.6) (end 180.2 77.201) (width 0.3) (layer F.Cu) (net 2))
  (segment (start 175.45 84.6) (end 175.65 84.6) (width 0.3) (layer F.Cu) (net 2))
  (segment (start 175.65 84.6) (end 178.55 81.7) (width 0.3) (layer F.Cu) (net 2))
  (segment (start 156.68 70.82) (end 156.65 70.79) (width 0.3) (layer F.Cu) (net 3))
  (segment (start 156.68 72.39) (end 156.68 70.82) (width 0.3) (layer F.Cu) (net 3))
  (segment (start 180.2 72.964) (end 180.2 73.899) (width 0.3) (layer F.Cu) (net 3))
  (segment (start 172.56 75.85) (end 173.63 76.92) (width 0.3) (layer F.Cu) (net 3))
  (segment (start 158.57 75.85) (end 172.56 75.85) (width 0.3) (layer F.Cu) (net 3))
  (segment (start 173.63 76.92) (end 173.63 78.22) (width 0.3) (layer F.Cu) (net 3))
  (segment (start 156.68 73.96) (end 158.57 75.85) (width 0.3) (layer F.Cu) (net 3))
  (segment (start 156.68 72.39) (end 156.68 73.96) (width 0.3) (layer F.Cu) (net 3))
  (segment (start 176.651 73.899) (end 180.2 73.899) (width 0.3) (layer F.Cu) (net 3))
  (segment (start 173.63 76.92) (end 176.651 73.899) (width 0.3) (layer F.Cu) (net 3))
  (segment (start 129.3 106.45) (end 129.4 106.35) (width 0.4) (layer F.Cu) (net 4))
  (segment (start 128.05 106.45) (end 129.3 106.45) (width 0.4) (layer F.Cu) (net 4))
  (segment (start 129.4 106.35) (end 130.95 106.35) (width 0.4) (layer F.Cu) (net 4))
  (segment (start 135.9 101.4) (end 146.71 101.4) (width 0.4) (layer F.Cu) (net 4))
  (segment (start 130.95 106.35) (end 135.9 101.4) (width 0.4) (layer F.Cu) (net 4))
  (segment (start 145.06 100.13) (end 146.71 100.13) (width 0.4) (layer F.Cu) (net 5))
  (segment (start 129.252081 103.91) (end 129.362081 103.8) (width 0.4) (layer F.Cu) (net 5))
  (segment (start 128.05 103.91) (end 129.252081 103.91) (width 0.4) (layer F.Cu) (net 5))
  (segment (start 129.362081 103.8) (end 131.25 103.8) (width 0.4) (layer F.Cu) (net 5))
  (segment (start 134.92 100.13) (end 145.06 100.13) (width 0.4) (layer F.Cu) (net 5))
  (segment (start 131.25 103.8) (end 134.92 100.13) (width 0.4) (layer F.Cu) (net 5))
  (segment (start 129.252081 98.83) (end 129.282081 98.8) (width 0.4) (layer F.Cu) (net 6))
  (segment (start 128.05 98.83) (end 129.252081 98.83) (width 0.4) (layer F.Cu) (net 6))
  (segment (start 129.282081 98.8) (end 131.35 98.8) (width 0.4) (layer F.Cu) (net 6))
  (segment (start 132.56 97.59) (end 146.71 97.59) (width 0.4) (layer F.Cu) (net 6))
  (segment (start 131.35 98.8) (end 132.56 97.59) (width 0.4) (layer F.Cu) (net 6))
  (segment (start 146.68 96.29) (end 146.71 96.32) (width 0.4) (layer F.Cu) (net 7))
  (segment (start 128.05 96.29) (end 146.68 96.29) (width 0.4) (layer F.Cu) (net 7))
  (segment (start 131.4 93.75) (end 128.05 93.75) (width 0.4) (layer F.Cu) (net 8))
  (segment (start 146.71 95.05) (end 132.7 95.05) (width 0.4) (layer F.Cu) (net 8))
  (segment (start 132.7 95.05) (end 131.4 93.75) (width 0.4) (layer F.Cu) (net 8))
  (segment (start 145.06 93.78) (end 145.03 93.75) (width 0.4) (layer F.Cu) (net 9))
  (segment (start 146.71 93.78) (end 145.06 93.78) (width 0.4) (layer F.Cu) (net 9))
  (segment (start 145.03 93.75) (end 133.6 93.75) (width 0.4) (layer F.Cu) (net 9))
  (segment (start 131.06 91.21) (end 128.05 91.21) (width 0.4) (layer F.Cu) (net 9))
  (segment (start 133.6 93.75) (end 131.06 91.21) (width 0.4) (layer F.Cu) (net 9))
  (segment (start 130.82 88.67) (end 128.05 88.67) (width 0.4) (layer F.Cu) (net 10))
  (segment (start 146.71 92.51) (end 134.66 92.51) (width 0.4) (layer F.Cu) (net 10))
  (segment (start 134.66 92.51) (end 130.82 88.67) (width 0.4) (layer F.Cu) (net 10))
  (segment (start 135.79 91.24) (end 146.71 91.24) (width 0.4) (layer F.Cu) (net 11))
  (segment (start 133.029999 88.479999) (end 135.79 91.24) (width 0.4) (layer F.Cu) (net 11))
  (segment (start 130.68 86.13) (end 133.029999 88.479999) (width 0.4) (layer F.Cu) (net 11))
  (segment (start 128.05 86.13) (end 130.68 86.13) (width 0.4) (layer F.Cu) (net 11))
  (segment (start 131.7 84.85) (end 132 85.05) (width 0.4) (layer F.Cu) (net 12))
  (segment (start 146.71 89.97) (end 136.87 89.97) (width 0.4) (layer F.Cu) (net 12))
  (segment (start 136.87 89.97) (end 131.7 84.85) (width 0.4) (layer F.Cu) (net 12))
  (segment (start 131.389999 84.439999) (end 132 85.05) (width 0.3) (layer F.Cu) (net 12))
  (segment (start 128.05 83.59) (end 128.899999 84.439999) (width 0.3) (layer F.Cu) (net 12))
  (segment (start 128.899999 84.439999) (end 131.389999 84.439999) (width 0.3) (layer F.Cu) (net 12))
  (segment (start 139.45 88.7) (end 146.71 88.7) (width 0.4) (layer F.Cu) (net 13))
  (segment (start 129.252081 81.05) (end 132.052081 83.85) (width 0.3) (layer F.Cu) (net 13))
  (segment (start 128.05 81.05) (end 129.252081 81.05) (width 0.3) (layer F.Cu) (net 13))
  (segment (start 134.5 83.85) (end 139.45 88.7) (width 0.4) (layer F.Cu) (net 13))
  (segment (start 132.052081 83.85) (end 134.5 83.85) (width 0.3) (layer F.Cu) (net 13))
  (segment (start 161.425 102.89) (end 161.4 107) (width 0.3) (layer F.Cu) (net 14))
  (segment (start 161.4 107) (end 161.45 107) (width 0.3) (layer F.Cu) (net 14))
  (segment (start 164.74999 108.42999) (end 166.32 110) (width 0.3) (layer F.Cu) (net 14))
  (segment (start 166.32 110) (end 166.32 111.15) (width 0.3) (layer F.Cu) (net 14))
  (segment (start 162.87999 108.42999) (end 164.74999 108.42999) (width 0.3) (layer F.Cu) (net 14))
  (segment (start 161.45 107) (end 162.87999 108.42999) (width 0.3) (layer F.Cu) (net 14))
  (segment (start 160.155 102.89) (end 160.25 107.55) (width 0.3) (layer F.Cu) (net 15))
  (segment (start 160.25 107.55) (end 162.45 109.13) (width 0.3) (layer F.Cu) (net 15))
  (segment (start 162.45 109.13) (end 163.38 109.13) (width 0.3) (layer F.Cu) (net 15))
  (segment (start 163.78 109.53) (end 163.78 111.15) (width 0.3) (layer F.Cu) (net 15))
  (segment (start 163.38 109.13) (end 163.78 109.53) (width 0.3) (layer F.Cu) (net 15))
  (segment (start 158.885 102.89) (end 158.9 107.95) (width 0.3) (layer F.Cu) (net 16))
  (segment (start 158.9 107.95) (end 160.05 109.15) (width 0.3) (layer F.Cu) (net 16))
  (segment (start 160.05 109.15) (end 161.1 109.15) (width 0.3) (layer F.Cu) (net 16))
  (segment (start 161.24 109.29) (end 161.24 111.15) (width 0.3) (layer F.Cu) (net 16))
  (segment (start 161.1 109.15) (end 161.24 109.29) (width 0.3) (layer F.Cu) (net 16))
  (segment (start 157.65 104.475) (end 157.6 108.45) (width 0.3) (layer F.Cu) (net 17))
  (segment (start 158.7 109.35) (end 158.7 111.15) (width 0.3) (layer F.Cu) (net 17))
  (segment (start 157.6 108.45) (end 158.7 109.35) (width 0.3) (layer F.Cu) (net 17))
  (segment (start 157.615 102.89) (end 157.615 104.44) (width 0.3) (layer F.Cu) (net 17))
  (segment (start 157.615 104.44) (end 157.65 104.475) (width 0.3) (layer F.Cu) (net 17))
  (segment (start 156.345 110.965) (end 156.16 111.15) (width 0.3) (layer F.Cu) (net 18))
  (segment (start 156.345 102.89) (end 156.345 110.965) (width 0.3) (layer F.Cu) (net 18))
  (segment (start 154.87 103.095) (end 155.075 102.89) (width 0.4) (layer F.Cu) (net 19))
  (segment (start 155.075 102.89) (end 155.075 106.775) (width 0.3) (layer F.Cu) (net 19))
  (segment (start 155.075 106.775) (end 153.6 108.25) (width 0.3) (layer F.Cu) (net 19))
  (segment (start 153.62 108.27) (end 153.62 111.15) (width 0.3) (layer F.Cu) (net 19))
  (segment (start 153.6 108.25) (end 153.62 108.27) (width 0.3) (layer F.Cu) (net 19))
  (segment (start 153.805 104.245) (end 153.805 102.89) (width 0.4) (layer F.Cu) (net 20))
  (segment (start 153.805 104.54) (end 153.805 104.245) (width 0.4) (layer F.Cu) (net 20))
  (segment (start 151.08 108.82) (end 151.08 111.15) (width 0.3) (layer F.Cu) (net 20))
  (segment (start 153.805 104.245) (end 153.805 106.095) (width 0.3) (layer F.Cu) (net 20))
  (segment (start 153.805 106.095) (end 151.08 108.82) (width 0.3) (layer F.Cu) (net 20))
  (segment (start 152.535 104.44) (end 152.55 104.455) (width 0.3) (layer F.Cu) (net 21))
  (segment (start 152.535 102.89) (end 152.535 104.44) (width 0.3) (layer F.Cu) (net 21))
  (segment (start 152.55 104.455) (end 152.55 105.7) (width 0.3) (layer F.Cu) (net 21))
  (segment (start 148.54 109.71) (end 148.54 111.15) (width 0.3) (layer F.Cu) (net 21))
  (segment (start 152.55 105.7) (end 148.54 109.71) (width 0.3) (layer F.Cu) (net 21))
  (segment (start 151.265 104.44) (end 151.25 104.455) (width 0.3) (layer F.Cu) (net 22))
  (segment (start 151.265 102.89) (end 151.265 104.44) (width 0.3) (layer F.Cu) (net 22))
  (segment (start 151.25 104.455) (end 151.25 105.4) (width 0.3) (layer F.Cu) (net 22))
  (segment (start 151.25 105.4) (end 148 108.65) (width 0.3) (layer F.Cu) (net 22))
  (segment (start 148 108.65) (end 146.05 108.65) (width 0.3) (layer F.Cu) (net 22))
  (segment (start 146 108.7) (end 146 111.15) (width 0.3) (layer F.Cu) (net 22))
  (segment (start 146.05 108.65) (end 146 108.7) (width 0.3) (layer F.Cu) (net 22))
  (segment (start 164.71 86.16) (end 178.84 86.16) (width 0.4) (layer F.Cu) (net 23))
  (segment (start 182.9 80.75) (end 185.15 80.73) (width 0.3) (layer F.Cu) (net 23))
  (segment (start 180.95 82.85) (end 182.2 81.5) (width 0.3) (layer F.Cu) (net 23))
  (segment (start 178.84 86.16) (end 179.09 86.16) (width 0.3) (layer F.Cu) (net 23))
  (segment (start 182.2 81.5) (end 182.9 80.75) (width 0.3) (layer F.Cu) (net 23))
  (segment (start 179.09 86.16) (end 180.95 82.85) (width 0.3) (layer F.Cu) (net 23))
  (segment (start 164.71 87.43) (end 179.8 87.3) (width 0.4) (layer F.Cu) (net 24))
  (segment (start 182.3 83.35) (end 183.1 83.35) (width 0.3) (layer F.Cu) (net 24))
  (segment (start 183.48 83.27) (end 185.15 83.27) (width 0.3) (layer F.Cu) (net 24))
  (segment (start 179.8 87.3) (end 180.05 87.3) (width 0.3) (layer F.Cu) (net 24))
  (segment (start 183.1 83.35) (end 183.48 83.27) (width 0.3) (layer F.Cu) (net 24))
  (segment (start 180.05 87.3) (end 182.3 83.35) (width 0.3) (layer F.Cu) (net 24))
  (segment (start 184.85 91.19) (end 185.15 90.89) (width 0.4) (layer F.Cu) (net 25))
  (segment (start 164.71 91.24) (end 182.3 91.25) (width 0.4) (layer F.Cu) (net 25))
  (segment (start 182.71 90.89) (end 185.15 90.89) (width 0.4) (layer F.Cu) (net 25))
  (segment (start 182.3 91.25) (end 182.71 90.89) (width 0.4) (layer F.Cu) (net 25))
  (segment (start 184.85 93.73) (end 185.15 93.43) (width 0.4) (layer F.Cu) (net 26))
  (segment (start 164.71 93.78) (end 182.35 93.75) (width 0.4) (layer F.Cu) (net 26))
  (segment (start 182.67 93.43) (end 185.15 93.43) (width 0.4) (layer F.Cu) (net 26))
  (segment (start 182.35 93.75) (end 182.67 93.43) (width 0.4) (layer F.Cu) (net 26))
  (segment (start 182.27 96.02) (end 185.15 95.97) (width 0.4) (layer F.Cu) (net 27))
  (segment (start 164.71 95.05) (end 181.3 95.05) (width 0.4) (layer F.Cu) (net 27))
  (segment (start 181.3 95.05) (end 182.27 96.02) (width 0.4) (layer F.Cu) (net 27))
  (segment (start 182.81 98.56) (end 185.15 98.51) (width 0.4) (layer F.Cu) (net 28))
  (segment (start 164.71 96.32) (end 180.57 96.32) (width 0.4) (layer F.Cu) (net 28))
  (segment (start 180.57 96.32) (end 182.81 98.56) (width 0.4) (layer F.Cu) (net 28))
  (segment (start 182.9 101.05) (end 185.15 101.05) (width 0.4) (layer F.Cu) (net 29))
  (segment (start 164.71 97.59) (end 179.59 97.59) (width 0.4) (layer F.Cu) (net 29))
  (segment (start 179.59 97.59) (end 182.9 101.05) (width 0.4) (layer F.Cu) (net 29))
  (segment (start 174.76986 106.73114) (end 174.95 106.551) (width 0.4) (layer F.Cu) (net 30))
  (segment (start 174.95 109.56986) (end 174.81986 109.7) (width 0.3) (layer F.Cu) (net 30))
  (segment (start 174.95 106.551) (end 174.95 109.56986) (width 0.3) (layer F.Cu) (net 30))
  (segment (start 179.4 107.086) (end 180.464 108.15) (width 0.3) (layer F.Cu) (net 31))
  (segment (start 179.4 106.151) (end 179.4 107.086) (width 0.3) (layer F.Cu) (net 31))
  (segment (start 180.464 108.15) (end 181.55 108.15) (width 0.3) (layer F.Cu) (net 31))
  (segment (start 181.66986 108.26986) (end 181.66986 110.1) (width 0.3) (layer F.Cu) (net 31))
  (segment (start 181.55 108.15) (end 181.66986 108.26986) (width 0.3) (layer F.Cu) (net 31))
  (segment (start 146.71 87.43) (end 140.703458 87.43) (width 0.4) (layer F.Cu) (net 34))
  (segment (start 136.952 80.8325) (end 136.952 81.15) (width 0.4) (layer F.Cu) (net 34))
  (segment (start 133.364 76.002) (end 133.364 77.562) (width 0.4) (layer F.Cu) (net 34))
  (segment (start 133.364 74.459) (end 133.364 69.398) (width 0.4) (layer F.Cu) (net 34))
  (segment (start 133.364 76.002) (end 133.364 74.459) (width 0.4) (layer F.Cu) (net 34))
  (segment (start 136.952 83.828542) (end 136.952 81.15) (width 0.4) (layer F.Cu) (net 34))
  (segment (start 135.917 79.7975) (end 136.952 80.8325) (width 0.4) (layer F.Cu) (net 34))
  (segment (start 135.5995 79.7975) (end 135.917 79.7975) (width 0.4) (layer F.Cu) (net 34))
  (segment (start 133.364 77.562) (end 135.5995 79.7975) (width 0.4) (layer F.Cu) (net 34))
  (segment (start 137.102 83.828542) (end 140.703458 87.43) (width 0.3) (layer F.Cu) (net 34))
  (segment (start 136.952 83.828542) (end 137.102 83.828542) (width 0.3) (layer F.Cu) (net 34))
  (segment (start 148.120002 98.86) (end 148.7 99.439998) (width 0.4) (layer F.Cu) (net 35))
  (segment (start 146.71 98.86) (end 148.120002 98.86) (width 0.4) (layer F.Cu) (net 35))
  (segment (start 148.7 99.439998) (end 148.7 101.998) (width 0.4) (layer F.Cu) (net 35))
  (segment (start 141.202 105.864) (end 134.598 105.864) (width 0.4) (layer F.Cu) (net 35))
  (segment (start 143.548 105.1025) (end 143.548 103.85) (width 0.3) (layer F.Cu) (net 35))
  (segment (start 142.7865 105.864) (end 143.548 105.1025) (width 0.3) (layer F.Cu) (net 35))
  (segment (start 141.202 105.864) (end 142.7865 105.864) (width 0.3) (layer F.Cu) (net 35))
  (segment (start 132.2 106.8) (end 133.136 105.864) (width 0.3) (layer F.Cu) (net 35))
  (segment (start 132.2 107.178) (end 132.2 106.8) (width 0.3) (layer F.Cu) (net 35))
  (segment (start 133.15 105.864) (end 134.662 105.864) (width 0.3) (layer F.Cu) (net 35))
  (segment (start 148.7 101.998) (end 148.7 102.9) (width 0.3) (layer F.Cu) (net 35))
  (segment (start 148.001 103.599) (end 146.3 103.599) (width 0.3) (layer F.Cu) (net 35))
  (segment (start 148.7 102.9) (end 148.001 103.599) (width 0.3) (layer F.Cu) (net 35))
  (segment (start 146.3 103.599) (end 143.6145 103.599) (width 0.3) (layer F.Cu) (net 35))
  (segment (start 143.6145 103.7835) (end 143.548 103.85) (width 0.3) (layer F.Cu) (net 35))
  (segment (start 143.6145 103.599) (end 143.6145 103.7835) (width 0.3) (layer F.Cu) (net 35))
  (segment (start 126.847919 101.37) (end 126.827919 101.35) (width 0.4) (layer F.Cu) (net 35))
  (segment (start 126.827919 101.35) (end 126.3 101.6) (width 0.4) (layer F.Cu) (net 35))
  (segment (start 128.05 101.37) (end 126.847919 101.37) (width 0.4) (layer F.Cu) (net 35))
  (segment (start 126.3 101.6) (end 125.85 101.9) (width 0.4) (layer F.Cu) (net 35))
  (segment (start 125.85 101.9) (end 125.85 109.75) (width 0.4) (layer F.Cu) (net 35))
  (segment (start 130.4 109.75) (end 132.2 107.95) (width 0.3) (layer F.Cu) (net 35))
  (segment (start 125.85 109.75) (end 130.4 109.75) (width 0.3) (layer F.Cu) (net 35))
  (segment (start 132.2 107.95) (end 132.186 107.214) (width 0.3) (layer F.Cu) (net 35))
  (segment (start 182.55 88.45) (end 187.5 88.4) (width 0.4) (layer F.Cu) (net 37))
  (segment (start 164.71 89.97) (end 181.83 89.97) (width 0.4) (layer F.Cu) (net 37))
  (segment (start 181.83 89.97) (end 182.55 88.45) (width 0.4) (layer F.Cu) (net 37))
  (segment (start 185.15 88.35) (end 187.5 88.4) (width 0.4) (layer F.Cu) (net 37))
  (segment (start 186.59 85.81) (end 184.31 85.81) (width 0.3) (layer F.Cu) (net 36))
  (segment (start 186.6 85.8) (end 186.59 85.81) (width 0.3) (layer F.Cu) (net 36))
  (segment (start 187.29 85.81) (end 187.34 85.76) (width 0.3) (layer F.Cu) (net 36))
  (segment (start 187.14 85.81) (end 187.29 85.81) (width 0.3) (layer F.Cu) (net 36))
  (segment (start 161.76 70.49) (end 161.76 72.39) (width 0.3) (layer F.Cu) (net 36))
  (segment (start 187.3 71) (end 187.3 69.75) (width 0.3) (layer F.Cu) (net 36))
  (segment (start 161.75 69.8) (end 161.75 70.48) (width 0.3) (layer F.Cu) (net 36))
  (segment (start 171.5 69.75) (end 161.75 69.8) (width 0.3) (layer F.Cu) (net 36))
  (segment (start 161.75 70.48) (end 161.76 70.49) (width 0.3) (layer F.Cu) (net 36))
  (segment (start 187.13 85.8) (end 187.14 85.81) (width 0.3) (layer F.Cu) (net 36))
  (segment (start 182.25 86.35) (end 180.65 88.75) (width 0.3) (layer F.Cu) (net 36))
  (segment (start 185.15 85.81) (end 182.56 85.81) (width 0.3) (layer F.Cu) (net 36))
  (segment (start 182.56 85.81) (end 182.25 86.35) (width 0.3) (layer F.Cu) (net 36))
  (segment (start 164.71 88.7) (end 180.65 88.75) (width 0.4) (layer F.Cu) (net 36))
  (segment (start 187.3 85.63) (end 187.13 85.8) (width 0.3) (layer F.Cu) (net 36))
  (segment (start 187.3 70.7) (end 187.3 85.63) (width 0.3) (layer F.Cu) (net 36))
  (segment (start 186.6 85.8) (end 187.13 85.8) (width 0.3) (layer F.Cu) (net 36))
  (segment (start 187.3 69.75) (end 171.5 69.75) (width 0.3) (layer F.Cu) (net 36))
  (segment (start 159.2 70.8) (end 159.22 70.82) (width 0.3) (layer F.Cu) (net 37))
  (segment (start 159.22 70.82) (end 159.22 72.39) (width 0.3) (layer F.Cu) (net 37))
  (segment (start 188.4 88.4) (end 188.45 88.35) (width 0.3) (layer F.Cu) (net 37))
  (segment (start 187 88.4) (end 188.4 88.4) (width 0.3) (layer F.Cu) (net 37))
  (segment (start 188.45 88.35) (end 188.45 69) (width 0.4) (layer F.Cu) (net 37))
  (segment (start 159.35 69) (end 159.15 69.2) (width 0.3) (layer F.Cu) (net 37))
  (segment (start 188.45 69) (end 159.35 69) (width 0.3) (layer F.Cu) (net 37))
  (segment (start 159.2 70.8) (end 159.15 69.2) (width 0.3) (layer F.Cu) (net 37))
  (segment (start 159.15 69.2) (end 159.2 69) (width 0.3) (layer F.Cu) (net 37))
  (segment (start 147.71914 73.08014) (end 148.25 73.611) (width 0.4) (layer F.Cu) (net 38) (tstamp 5E68EDCC))
  (segment (start 143.45 72.88014) (end 149.26914 72.88014) (width 0.4) (layer F.Cu) (net 38) (tstamp 5E68EDD2))
  (segment (start 164.71 101.4) (end 166.36 101.4) (width 0.4) (layer F.Cu) (net 39))
  (segment (start 166.9 101.94) (end 166.9 104.1013) (width 0.3) (layer F.Cu) (net 39))
  (segment (start 166.36 101.4) (end 166.9 101.94) (width 0.3) (layer F.Cu) (net 39))
  (segment (start 177.15 102.45) (end 177.15 98.95) (width 0.3) (layer F.Cu) (net 42))
  (segment (start 177.15 98.95) (end 177.05 98.85) (width 0.3) (layer F.Cu) (net 42))
  (segment (start 164.71 98.86) (end 177.05 98.85) (width 0.4) (layer F.Cu) (net 42))
  (segment (start 177.549 102.849) (end 179.4 102.849) (width 0.3) (layer F.Cu) (net 42))
  (segment (start 177.15 102.45) (end 177.549 102.849) (width 0.3) (layer F.Cu) (net 42))
  (segment (start 184.409 102.849) (end 185.15 103.59) (width 0.3) (layer F.Cu) (net 42))
  (segment (start 179.4 102.849) (end 184.409 102.849) (width 0.3) (layer F.Cu) (net 42))
  (segment (start 164.71 100.13) (end 174.55 100.2) (width 0.4) (layer F.Cu) (net 43))
  (segment (start 176.3025 103.249) (end 174.95 103.249) (width 0.4) (layer F.Cu) (net 43))
  (segment (start 174.95 100.6) (end 174.95 103.249) (width 0.3) (layer F.Cu) (net 43))
  (segment (start 174.55 100.2) (end 174.95 100.6) (width 0.3) (layer F.Cu) (net 43))
  (segment (start 176.3025 103.249) (end 177.5535 104.5) (width 0.3) (layer F.Cu) (net 43))
  (segment (start 177.5535 104.5) (end 180.9 104.5) (width 0.3) (layer F.Cu) (net 43))
  (segment (start 182.53 106.13) (end 185.15 106.13) (width 0.3) (layer F.Cu) (net 43))
  (segment (start 180.9 104.5) (end 182.53 106.13) (width 0.3) (layer F.Cu) (net 43))

)
