%
(Header)
(Generated by gcodetools from Inkscape.)
(Using default header. To add your own header create file "header" in the output dir.)

(Header end.)
G21 (All units in mm)

(Start cutting path id: path4541)
(Change tool to Default tool)

G00 Z40.000000
G00 X99.029755 Y164.041670

G01 Z8F1000.0(Penetrate)
G02 X95.643822 Y161.610563 Z8I-2.565738 J0.000002 F1000.000000
G02 X92.541164 Y164.041680 Z8I1.893202 J5.611563
G02 X92.665464 Y172.271212 Z8I6.315111 J4.020320
G02 X99.029762 Y177.018850 Z8I10.050696 J-6.833597
G02 X111.734661 Y174.783919 Z8I4.217991 J-13.251213
G02 X118.495530 Y164.041660 Z8I-11.214465 J-14.556739
G02 X114.274130 Y146.806718 Z8I-19.981811 J-4.240252
G02 X99.029739 Y138.087310 Z8I-19.144337 J15.784787
G02 X77.241051 Y144.255242 Z8I-4.234920 J26.608885
G02 X66.586800 Y164.041690 Z8I20.385593 J23.738547
G02 X74.683810 Y190.395860 Z8I33.185034 J4.225228
G02 X99.029778 Y202.973217 Z8I28.331998 J-24.990295
G02 X129.956040 Y192.956273 Z8I4.215818 J-39.733370
G02 X144.449890 Y164.041640 Z8I-29.593723 J-32.924188
G02 X132.518379 Y128.539177 Z8I-46.265131 J-4.207595
G02 X99.029724 Y112.132940 Z8I-37.515344 J34.194989
G02 X58.948367 Y125.975604 Z8I-4.200556 J52.786318
G02 X40.632437 Y164.041710 Z8I38.794239 J42.105789
G02 X56.383930 Y208.703842 Z8I59.300276 J4.194603
G02 X99.029793 Y228.927581 Z8I46.695718 J-43.391805
G02 X148.274063 Y211.268884 Z8I4.189503 J-65.809207
G02 X170.404250 Y164.041630 Z8I-47.987981 J-51.285267
G02 X150.839559 Y110.214210 Z8I-72.314432 J-4.185128
G02 X99.029709 Y86.178580 Z8 I-55.874549 J52.583020
G00 Z40.000000

(End cutting path id: path4541)


(Footer)
M5
G00 X0.0000 Y0.0000
M2
(Using default footer. To add your own footer create file "footer" in the output dir.)
(end)
%
