(export (version D)
  (design
    (source "C:\\Users\\ergin\\OneDrive\\Έγγραφα\\cry cry.sch")
    (date "10/03/2020 19:27:17")
    (tool "Eeschema (5.1.5)-3")
    (sheet (number 1) (name /) (tstamps /)
      (title_block
        (title)
        (company)
        (rev)
        (date)
        (source "cry cry.sch")
        (comment (number 1) (value ""))
        (comment (number 2) (value ""))
        (comment (number 3) (value ""))
        (comment (number 4) (value "")))))
  (components
    (comp (ref U1)
      (value ESP32-WROOM)
      (footprint ESP32-footprints-Lib:ESP32-WROOM_FAB)
      (libsource (lib ESP32-footprints-Shem-Lib) (part ESP32-WROOM) (description ""))
      (sheetpath (names /) (tstamps /))
      (tstamp 5E6BE087))
    (comp (ref J2)
      (value Conn_01x09_Female)
      (footprint Connector_PinHeader_2.54mm:PinHeader_1x09_P2.54mm_Vertical)
      (datasheet ~)
      (libsource (lib Connector) (part Conn_01x09_Female) (description "Generic connector, single row, 01x09, script generated (kicad-library-utils/schlib/autogen/connector/)"))
      (sheetpath (names /) (tstamps /))
      (tstamp 5E6E9790))
    (comp (ref U2)
      (value AP1117-15)
      (footprint Package_TO_SOT_SMD:SOT-223-3_TabPin2)
      (datasheet http://www.diodes.com/datasheets/AP1117.pdf)
      (libsource (lib Regulator_Linear) (part AP1117-15) (description "1A Low Dropout regulator, positive, 1.5V fixed output, SOT-223"))
      (sheetpath (names /) (tstamps /))
      (tstamp 5E6FB097))
    (comp (ref R1)
      (value 10KΩ)
      (footprint fab-R1206FAB)
      (libsource (lib fab) (part RES-US1206FAB) (description ""))
      (sheetpath (names /) (tstamps /))
      (tstamp 5E6FDD26))
    (comp (ref R2)
      (value 100Ω)
      (footprint fab-R1206FAB)
      (libsource (lib fab) (part RES-US1206FAB) (description ""))
      (sheetpath (names /) (tstamps /))
      (tstamp 5E6FE2C7))
    (comp (ref R3)
      (value 100Ω)
      (footprint fab-R1206FAB)
      (libsource (lib fab) (part RES-US1206FAB) (description ""))
      (sheetpath (names /) (tstamps /))
      (tstamp 5E6FE93C))
    (comp (ref LED2)
      (value LED)
      (footprint fab-LED1206)
      (libsource (lib fab) (part LED) (description ""))
      (sheetpath (names /) (tstamps /))
      (tstamp 5E6FFCA0))
    (comp (ref LED3)
      (value LED)
      (footprint fab-LED1206)
      (libsource (lib fab) (part LED) (description ""))
      (sheetpath (names /) (tstamps /))
      (tstamp 5E7000F8))
    (comp (ref M1)
      (value FTDI-SMD-HEADER)
      (footprint fab-1X06SMD)
      (libsource (lib fab) (part FTDI-SMD-HEADER) (description ""))
      (sheetpath (names /) (tstamps /))
      (tstamp 5E700CB2))
    (comp (ref C1)
      (value 0.1uF)
      (footprint fab-C1206FAB)
      (libsource (lib fab) (part CAP-UNPOLARIZEDFAB) (description ""))
      (sheetpath (names /) (tstamps /))
      (tstamp 5E701702))
    (comp (ref C2)
      (value 10μF)
      (footprint fab-C1206FAB)
      (libsource (lib fab) (part CAP-UNPOLARIZEDFAB) (description ""))
      (sheetpath (names /) (tstamps /))
      (tstamp 5E7023DF))
    (comp (ref C3)
      (value 10μF)
      (footprint fab-C1206FAB)
      (libsource (lib fab) (part CAP-UNPOLARIZEDFAB) (description ""))
      (sheetpath (names /) (tstamps /))
      (tstamp 5E702814))
    (comp (ref LEDPOWER1)
      (value LED)
      (footprint fab-LED1206)
      (libsource (lib fab) (part LED) (description ""))
      (sheetpath (names /) (tstamps /))
      (tstamp 5E680CDB))
    (comp (ref R4)
      (value 100Ω)
      (footprint fab-R1206FAB)
      (libsource (lib fab) (part RES-US1206FAB) (description ""))
      (sheetpath (names /) (tstamps /))
      (tstamp 5E681792))
    (comp (ref RESETBUTTON1)
      (value 6MM_SWITCH6MM_SWITCH)
      (footprint fab-6MM_SWITCH)
      (libsource (lib fab) (part 6MM_SWITCH6MM_SWITCH) (description ""))
      (sheetpath (names /) (tstamps /))
      (tstamp 5E6B8795))
    (comp (ref S1)
      (value 6MM_SWITCH6MM_SWITCH)
      (footprint fab-6MM_SWITCH)
      (libsource (lib fab) (part 6MM_SWITCH6MM_SWITCH) (description ""))
      (sheetpath (names /) (tstamps /))
      (tstamp 5E6B437C))
    (comp (ref R5)
      (value 2.2k)
      (footprint fab-R1206FAB)
      (libsource (lib fab) (part RES-US1206FAB) (description ""))
      (sheetpath (names /) (tstamps /))
      (tstamp 5E6E1ACE))
    (comp (ref J1)
      (value Conn_01x11_Female)
      (footprint Connector_PinHeader_2.54mm:PinHeader_1x11_P2.54mm_Vertical)
      (datasheet ~)
      (libsource (lib Connector) (part Conn_01x11_Female) (description "Generic connector, single row, 01x11, script generated (kicad-library-utils/schlib/autogen/connector/)"))
      (sheetpath (names /) (tstamps /))
      (tstamp 5E7605AA))
    (comp (ref S2)
      (value SLIDE-SWITCH)
      (footprint fab:fab-AYZ0102AGRLC)
      (libsource (lib fab) (part SLIDE-SWITCH) (description ""))
      (sheetpath (names /) (tstamps /))
      (tstamp 5E772C4E))
    (comp (ref J3)
      (value Conn_01x13_Female)
      (footprint Connector_PinHeader_2.54mm:PinHeader_1x13_P2.54mm_Vertical)
      (datasheet ~)
      (libsource (lib Connector) (part Conn_01x13_Female) (description "Generic connector, single row, 01x13, script generated (kicad-library-utils/schlib/autogen/connector/)"))
      (sheetpath (names /) (tstamps /))
      (tstamp 5E78B59C)))
  (libparts
    (libpart (lib Connector) (part Conn_01x09_Female)
      (description "Generic connector, single row, 01x09, script generated (kicad-library-utils/schlib/autogen/connector/)")
      (docs ~)
      (footprints
        (fp Connector*:*_1x??_*))
      (fields
        (field (name Reference) J)
        (field (name Value) Conn_01x09_Female))
      (pins
        (pin (num 1) (name Pin_1) (type passive))
        (pin (num 2) (name Pin_2) (type passive))
        (pin (num 3) (name Pin_3) (type passive))
        (pin (num 4) (name Pin_4) (type passive))
        (pin (num 5) (name Pin_5) (type passive))
        (pin (num 6) (name Pin_6) (type passive))
        (pin (num 7) (name Pin_7) (type passive))
        (pin (num 8) (name Pin_8) (type passive))
        (pin (num 9) (name Pin_9) (type passive))))
    (libpart (lib Connector) (part Conn_01x11_Female)
      (description "Generic connector, single row, 01x11, script generated (kicad-library-utils/schlib/autogen/connector/)")
      (docs ~)
      (footprints
        (fp Connector*:*_1x??_*))
      (fields
        (field (name Reference) J)
        (field (name Value) Conn_01x11_Female))
      (pins
        (pin (num 1) (name Pin_1) (type passive))
        (pin (num 2) (name Pin_2) (type passive))
        (pin (num 3) (name Pin_3) (type passive))
        (pin (num 4) (name Pin_4) (type passive))
        (pin (num 5) (name Pin_5) (type passive))
        (pin (num 6) (name Pin_6) (type passive))
        (pin (num 7) (name Pin_7) (type passive))
        (pin (num 8) (name Pin_8) (type passive))
        (pin (num 9) (name Pin_9) (type passive))
        (pin (num 10) (name Pin_10) (type passive))
        (pin (num 11) (name Pin_11) (type passive))))
    (libpart (lib Connector) (part Conn_01x13_Female)
      (description "Generic connector, single row, 01x13, script generated (kicad-library-utils/schlib/autogen/connector/)")
      (docs ~)
      (footprints
        (fp Connector*:*_1x??_*))
      (fields
        (field (name Reference) J)
        (field (name Value) Conn_01x13_Female))
      (pins
        (pin (num 1) (name Pin_1) (type passive))
        (pin (num 2) (name Pin_2) (type passive))
        (pin (num 3) (name Pin_3) (type passive))
        (pin (num 4) (name Pin_4) (type passive))
        (pin (num 5) (name Pin_5) (type passive))
        (pin (num 6) (name Pin_6) (type passive))
        (pin (num 7) (name Pin_7) (type passive))
        (pin (num 8) (name Pin_8) (type passive))
        (pin (num 9) (name Pin_9) (type passive))
        (pin (num 10) (name Pin_10) (type passive))
        (pin (num 11) (name Pin_11) (type passive))
        (pin (num 12) (name Pin_12) (type passive))
        (pin (num 13) (name Pin_13) (type passive))))
    (libpart (lib ESP32-footprints-Shem-Lib) (part ESP32-WROOM)
      (fields
        (field (name Reference) U)
        (field (name Value) ESP32-WROOM)
        (field (name Footprint) ESP32-footprints-Lib:ESP32-WROOM_FAB))
      (pins
        (pin (num 1) (name GND) (type power_out))
        (pin (num 2) (name 3V3) (type power_in))
        (pin (num 3) (name EN) (type input))
        (pin (num 4) (name SENSOR_VP) (type input))
        (pin (num 5) (name SENSOR_VN) (type input))
        (pin (num 6) (name IO34) (type BiDi))
        (pin (num 7) (name IO35) (type BiDi))
        (pin (num 8) (name IO32) (type BiDi))
        (pin (num 9) (name IO33) (type BiDi))
        (pin (num 10) (name IO25) (type BiDi))
        (pin (num 11) (name IO26) (type BiDi))
        (pin (num 12) (name IO27) (type BiDi))
        (pin (num 13) (name IO14) (type BiDi))
        (pin (num 14) (name IO12) (type BiDi))
        (pin (num 15) (name GND) (type power_in))
        (pin (num 16) (name IO13) (type BiDi))
        (pin (num 17) (name SD2) (type BiDi))
        (pin (num 18) (name SD3) (type BiDi))
        (pin (num 19) (name CMD) (type BiDi))
        (pin (num 20) (name CLK) (type input))
        (pin (num 21) (name SDO) (type BiDi))
        (pin (num 22) (name SD1) (type BiDi))
        (pin (num 23) (name IO15) (type BiDi))
        (pin (num 24) (name IO2) (type BiDi))
        (pin (num 25) (name IO0) (type BiDi))
        (pin (num 26) (name IO4) (type input))
        (pin (num 27) (name IO16) (type BiDi))
        (pin (num 28) (name IO17) (type BiDi))
        (pin (num 29) (name IO5) (type BiDi))
        (pin (num 30) (name IO18) (type input))
        (pin (num 31) (name IO19) (type BiDi))
        (pin (num 32) (name NC) (type NotConnected))
        (pin (num 33) (name IO21) (type BiDi))
        (pin (num 34) (name RXD0) (type BiDi))
        (pin (num 35) (name TXD0) (type BiDi))
        (pin (num 36) (name IO22) (type BiDi))
        (pin (num 37) (name IO23) (type BiDi))
        (pin (num 38) (name GND) (type power_in))
        (pin (num 39) (name GND-PAD) (type power_in))))
    (libpart (lib Regulator_Linear) (part AP1117-15)
      (aliases
        (alias AP1117-18)
        (alias AP1117-25)
        (alias AP1117-33)
        (alias AP1117-50)
        (alias LD1117S33TR_SOT223)
        (alias LD1117S12TR_SOT223)
        (alias LD1117S18TR_SOT223)
        (alias LD1117S25TR_SOT223)
        (alias LD1117S50TR_SOT223)
        (alias NCP1117-12_SOT223)
        (alias NCP1117-1.5_SOT223)
        (alias NCP1117-1.8_SOT223)
        (alias NCP1117-2.0_SOT223)
        (alias NCP1117-2.5_SOT223)
        (alias NCP1117-2.85_SOT223)
        (alias NCP1117-3.3_SOT223)
        (alias NCP1117-5.0_SOT223)
        (alias AMS1117-1.5)
        (alias AMS1117-1.8)
        (alias AMS1117-2.5)
        (alias AMS1117-2.85)
        (alias AMS1117-3.3)
        (alias AMS1117-5.0))
      (description "1A Low Dropout regulator, positive, 1.5V fixed output, SOT-223")
      (docs http://www.diodes.com/datasheets/AP1117.pdf)
      (footprints
        (fp SOT?223*TabPin2*))
      (fields
        (field (name Reference) U)
        (field (name Value) AP1117-15)
        (field (name Footprint) Package_TO_SOT_SMD:SOT-223-3_TabPin2))
      (pins
        (pin (num 1) (name GND) (type power_in))
        (pin (num 2) (name VO) (type power_out))
        (pin (num 3) (name VI) (type power_in))))
    (libpart (lib fab) (part 6MM_SWITCH6MM_SWITCH)
      (footprints
        (fp *6MM_SWITCH*))
      (fields
        (field (name Reference) S)
        (field (name Value) 6MM_SWITCH6MM_SWITCH)
        (field (name Footprint) fab-6MM_SWITCH))
      (pins
        (pin (num 1) (name P) (type passive))
        (pin (num 2) (name P1) (type passive))
        (pin (num 3) (name S) (type passive))
        (pin (num 4) (name S1) (type passive))))
    (libpart (lib fab) (part CAP-UNPOLARIZEDFAB)
      (footprints
        (fp *C1206FAB*))
      (fields
        (field (name Reference) C)
        (field (name Value) CAP-UNPOLARIZEDFAB)
        (field (name Footprint) fab-C1206FAB))
      (pins
        (pin (num 1) (name 1) (type passive))
        (pin (num 2) (name 2) (type passive))))
    (libpart (lib fab) (part FTDI-SMD-HEADER)
      (footprints
        (fp *1X06SMD*))
      (fields
        (field (name Reference) M)
        (field (name Value) FTDI-SMD-HEADER)
        (field (name Footprint) fab-1X06SMD))
      (pins
        (pin (num 1) (name GND) (type BiDi))
        (pin (num 2) (name CTS) (type BiDi))
        (pin (num 3) (name VCC) (type BiDi))
        (pin (num 4) (name TXD) (type BiDi))
        (pin (num 5) (name RXD) (type BiDi))
        (pin (num 6) (name RTS) (type BiDi))))
    (libpart (lib fab) (part LED)
      (footprints
        (fp *LED1206*)
        (fp *LED1206FAB*))
      (fields
        (field (name Reference) M)
        (field (name Value) LED)
        (field (name Footprint) fab-LED1206))
      (pins
        (pin (num 1) (name A) (type passive))
        (pin (num 2) (name C) (type passive))))
    (libpart (lib fab) (part RES-US1206FAB)
      (footprints
        (fp *R1206FAB*))
      (fields
        (field (name Reference) R)
        (field (name Value) RES-US1206FAB)
        (field (name Footprint) fab-R1206FAB))
      (pins
        (pin (num 1) (name 1) (type passive))
        (pin (num 2) (name 2) (type passive))))
    (libpart (lib fab) (part SLIDE-SWITCH)
      (footprints
        (fp *AYZ0102AGRLC*))
      (fields
        (field (name Reference) S)
        (field (name Value) SLIDE-SWITCH)
        (field (name Footprint) fab-AYZ0102AGRLC))
      (pins
        (pin (num 1) (name 1) (type BiDi))
        (pin (num 2) (name 2) (type BiDi))
        (pin (num 3) (name 3) (type BiDi)))))
  (libraries
    (library (logical Connector)
      (uri "C:\\Program Files\\KiCad\\share\\kicad\\library/Connector.lib"))
    (library (logical ESP32-footprints-Shem-Lib)
      (uri "C:/Users/ergin/OneDrive/Desktop/KICAD STUFF/ESP32-Footprints/ESP32-footprints-Shem-Lib.lib"))
    (library (logical Regulator_Linear)
      (uri "C:\\Program Files\\KiCad\\share\\kicad\\library/Regulator_Linear.lib"))
    (library (logical fab)
      (uri "C:/Users/ergin/OneDrive/Desktop/KICAD STUFF/fab.lib")))
  (nets
    (net (code 1) (name 3V3)
      (node (ref J3) (pin 1))
      (node (ref U1) (pin 2))
      (node (ref C3) (pin 1))
      (node (ref C1) (pin 1))
      (node (ref R1) (pin 2))
      (node (ref U2) (pin 2))
      (node (ref R4) (pin 1))
      (node (ref S1) (pin 4))
      (node (ref S1) (pin 3)))
    (net (code 2) (name EN)
      (node (ref RESETBUTTON1) (pin 4))
      (node (ref U1) (pin 3))
      (node (ref RESETBUTTON1) (pin 3))
      (node (ref R1) (pin 1)))
    (net (code 3) (name RXD)
      (node (ref J3) (pin 6))
      (node (ref U1) (pin 34))
      (node (ref M1) (pin 4)))
    (net (code 4) (name "Net-(J1-Pad1)")
      (node (ref U1) (pin 14))
      (node (ref J1) (pin 1)))
    (net (code 5) (name 1O0)
      (node (ref U1) (pin 25))
      (node (ref S2) (pin 2)))
    (net (code 6) (name TXD)
      (node (ref U1) (pin 35))
      (node (ref M1) (pin 5))
      (node (ref J3) (pin 5)))
    (net (code 7) (name I027)
      (node (ref R5) (pin 1))
      (node (ref S1) (pin 1))
      (node (ref J1) (pin 3))
      (node (ref S1) (pin 2))
      (node (ref U1) (pin 12)))
    (net (code 8) (name "Net-(J1-Pad10)")
      (node (ref J1) (pin 10))
      (node (ref U1) (pin 5)))
    (net (code 9) (name "Net-(J3-Pad9)")
      (node (ref J3) (pin 9))
      (node (ref U1) (pin 30)))
    (net (code 10) (name "Net-(J3-Pad10)")
      (node (ref U1) (pin 29))
      (node (ref J3) (pin 10)))
    (net (code 11) (name "Net-(J3-Pad11)")
      (node (ref J3) (pin 11))
      (node (ref U1) (pin 28)))
    (net (code 12) (name "Net-(J3-Pad7)")
      (node (ref U1) (pin 33))
      (node (ref J3) (pin 7)))
    (net (code 13) (name "Net-(J3-Pad8)")
      (node (ref J3) (pin 8))
      (node (ref U1) (pin 31)))
    (net (code 14) (name "Net-(J1-Pad8)")
      (node (ref J1) (pin 8))
      (node (ref U1) (pin 7)))
    (net (code 15) (name "Net-(J1-Pad7)")
      (node (ref J1) (pin 7))
      (node (ref U1) (pin 8)))
    (net (code 16) (name /I016)
      (node (ref J3) (pin 12))
      (node (ref U1) (pin 27))
      (node (ref R3) (pin 1)))
    (net (code 17) (name GND)
      (node (ref LED3) (pin 2))
      (node (ref M1) (pin 1))
      (node (ref LED2) (pin 2))
      (node (ref U2) (pin 1))
      (node (ref U1) (pin 38))
      (node (ref U1) (pin 1))
      (node (ref LEDPOWER1) (pin 2))
      (node (ref U1) (pin 15))
      (node (ref C3) (pin 2))
      (node (ref C2) (pin 2))
      (node (ref C1) (pin 2))
      (node (ref J3) (pin 2))
      (node (ref R5) (pin 2))
      (node (ref S2) (pin 3))
      (node (ref U1) (pin 39))
      (node (ref RESETBUTTON1) (pin 2))
      (node (ref RESETBUTTON1) (pin 1)))
    (net (code 18) (name "Net-(S2-Pad1)")
      (node (ref S2) (pin 1)))
    (net (code 19) (name "Net-(J1-Pad9)")
      (node (ref J1) (pin 9))
      (node (ref U1) (pin 6)))
    (net (code 20) (name "Net-(J1-Pad6)")
      (node (ref U1) (pin 9))
      (node (ref J1) (pin 6)))
    (net (code 21) (name "Net-(J1-Pad5)")
      (node (ref U1) (pin 10))
      (node (ref J1) (pin 5)))
    (net (code 22) (name "Net-(J1-Pad4)")
      (node (ref J1) (pin 4))
      (node (ref U1) (pin 11)))
    (net (code 23) (name "Net-(J1-Pad2)")
      (node (ref J1) (pin 2))
      (node (ref U1) (pin 13)))
    (net (code 24) (name "Net-(J1-Pad11)")
      (node (ref U1) (pin 4))
      (node (ref J1) (pin 11)))
    (net (code 25) (name "Net-(J3-Pad3)")
      (node (ref J3) (pin 3))
      (node (ref U1) (pin 37)))
    (net (code 26) (name "Net-(J3-Pad4)")
      (node (ref U1) (pin 36))
      (node (ref J3) (pin 4)))
    (net (code 27) (name "Net-(J2-Pad6)")
      (node (ref U1) (pin 19))
      (node (ref J2) (pin 6)))
    (net (code 28) (name "Net-(J2-Pad7)")
      (node (ref U1) (pin 18))
      (node (ref J2) (pin 7)))
    (net (code 29) (name "Net-(J2-Pad3)")
      (node (ref J2) (pin 3))
      (node (ref U1) (pin 22)))
    (net (code 30) (name "Net-(J2-Pad5)")
      (node (ref U1) (pin 20))
      (node (ref J2) (pin 5)))
    (net (code 31) (name "Net-(U1-Pad32)")
      (node (ref U1) (pin 32)))
    (net (code 32) (name "Net-(J2-Pad4)")
      (node (ref J2) (pin 4))
      (node (ref U1) (pin 21)))
    (net (code 33) (name "Net-(J2-Pad2)")
      (node (ref U1) (pin 23))
      (node (ref J2) (pin 2)))
    (net (code 34) (name "Net-(J2-Pad1)")
      (node (ref J2) (pin 1))
      (node (ref U1) (pin 24)))
    (net (code 35) (name "Net-(J2-Pad9)")
      (node (ref J2) (pin 9))
      (node (ref U1) (pin 16)))
    (net (code 36) (name "Net-(J2-Pad8)")
      (node (ref J2) (pin 8))
      (node (ref U1) (pin 17)))
    (net (code 37) (name "Net-(C2-Pad1)")
      (node (ref C2) (pin 1))
      (node (ref U2) (pin 3))
      (node (ref M1) (pin 3)))
    (net (code 38) (name "Net-(LED3-Pad1)")
      (node (ref LED3) (pin 1))
      (node (ref R3) (pin 2)))
    (net (code 39) (name "Net-(LEDPOWER1-Pad1)")
      (node (ref LEDPOWER1) (pin 1))
      (node (ref R4) (pin 2)))
    (net (code 40) (name "Net-(LED2-Pad1)")
      (node (ref R2) (pin 2))
      (node (ref LED2) (pin 1)))
    (net (code 41) (name /I04)
      (node (ref J3) (pin 13))
      (node (ref R2) (pin 1))
      (node (ref U1) (pin 26)))
    (net (code 42) (name "Net-(M1-Pad2)")
      (node (ref M1) (pin 2)))
    (net (code 43) (name "Net-(M1-Pad6)")
      (node (ref M1) (pin 6)))))