EESchema Schematic File Version 4
EELAYER 30 0
EELAYER END
$Descr A4 11693 8268
encoding utf-8
Sheet 1 1
Title ""
Date ""
Rev ""
Comp ""
Comment1 ""
Comment2 ""
Comment3 ""
Comment4 ""
$EndDescr
$Comp
L ESP32-footprints-Shem-Lib:ESP32-WROOM U1
U 1 1 5E6BE087
P 5300 2900
F 0 "U1" H 5275 4287 60  0000 C CNN
F 1 "ESP32-WROOM" H 5275 4181 60  0000 C CNN
F 2 "ESP32-footprints-Lib:ESP32-WROOM_FAB" H 5650 4250 60  0001 C CNN
F 3 "" H 4850 3350 60  0001 C CNN
	1    5300 2900
	1    0    0    -1  
$EndComp
Wire Wire Line
	6200 3550 6350 3550
$Comp
L power:GND #PWR0101
U 1 1 5E6C5C44
P 6850 3550
F 0 "#PWR0101" H 6850 3300 50  0001 C CNN
F 1 "GND" H 6855 3377 50  0000 C CNN
F 2 "" H 6850 3550 50  0001 C CNN
F 3 "" H 6850 3550 50  0001 C CNN
	1    6850 3550
	1    0    0    -1  
$EndComp
$Comp
L power:GND #PWR0102
U 1 1 5E6C6321
P 3400 3600
F 0 "#PWR0102" H 3400 3350 50  0001 C CNN
F 1 "GND" H 3405 3427 50  0000 C CNN
F 2 "" H 3400 3600 50  0001 C CNN
F 3 "" H 3400 3600 50  0001 C CNN
	1    3400 3600
	1    0    0    -1  
$EndComp
$Comp
L power:GND #PWR0103
U 1 1 5E6C6BD8
P 4450 4000
F 0 "#PWR0103" H 4450 3750 50  0001 C CNN
F 1 "GND" H 4455 3827 50  0000 C CNN
F 2 "" H 4450 4000 50  0001 C CNN
F 3 "" H 4450 4000 50  0001 C CNN
	1    4450 4000
	1    0    0    -1  
$EndComp
Wire Wire Line
	4450 4000 4850 4000
Wire Wire Line
	4850 4000 4850 3950
Wire Wire Line
	3400 3600 4350 3600
Wire Wire Line
	6200 2150 7350 2150
Wire Wire Line
	6200 2250 7350 2250
Wire Wire Line
	6200 2350 7350 2350
Wire Wire Line
	6200 2450 7350 2450
Wire Wire Line
	6200 2550 7350 2550
Wire Wire Line
	3250 2500 4350 2500
Wire Wire Line
	3250 2600 4350 2600
Wire Wire Line
	3250 3000 4350 3000
Wire Wire Line
	3250 3100 4350 3100
Wire Wire Line
	3250 3200 4350 3200
Wire Wire Line
	3250 3300 4350 3300
Wire Wire Line
	3250 3400 4350 3400
Wire Wire Line
	3250 3500 4350 3500
Wire Wire Line
	3250 2700 4350 2700
$Comp
L Connector:Conn_01x09_Female J2
U 1 1 5E6E9790
P 5350 4450
F 0 "J2" V 5423 4430 50  0000 C CNN
F 1 "Conn_01x09_Female" V 5514 4430 50  0000 C CNN
F 2 "Connector_PinHeader_2.54mm:PinHeader_1x09_P2.54mm_Vertical" H 5350 4450 50  0001 C CNN
F 3 "~" H 5350 4450 50  0001 C CNN
	1    5350 4450
	0    1    1    0   
$EndComp
Wire Wire Line
	4950 3950 4950 4250
Wire Wire Line
	5050 3950 5050 4250
Wire Wire Line
	5150 3950 5150 4250
Wire Wire Line
	5250 3950 5250 4250
Wire Wire Line
	5350 3950 5350 4250
Wire Wire Line
	5450 3950 5450 4250
Wire Wire Line
	5550 3950 5550 4250
Wire Wire Line
	5650 3950 5650 4250
Wire Wire Line
	5750 3950 5750 4250
$Comp
L Regulator_Linear:AP1117-15 U2
U 1 1 5E6FB097
P 9750 1300
F 0 "U2" H 9750 1542 50  0000 C CNN
F 1 "AP1117-15" H 9750 1451 50  0000 C CNN
F 2 "Package_TO_SOT_SMD:SOT-223-3_TabPin2" H 9750 1500 50  0001 C CNN
F 3 "http://www.diodes.com/datasheets/AP1117.pdf" H 9850 1050 50  0001 C CNN
	1    9750 1300
	1    0    0    -1  
$EndComp
$Comp
L fab:RES-US1206FAB R1
U 1 1 5E6FDD26
P 8550 2250
F 0 "R1" H 8550 2444 45  0000 C CNN
F 1 "10KΩ" H 8550 2360 45  0000 C CNN
F 2 "fab-R1206FAB" H 8580 2400 20  0001 C CNN
F 3 "" H 8550 2250 50  0001 C CNN
	1    8550 2250
	0    -1   -1   0   
$EndComp
$Comp
L fab:RES-US1206FAB R2
U 1 1 5E6FE2C7
P 9300 2350
F 0 "R2" H 9300 2544 45  0000 C CNN
F 1 "100Ω" H 9300 2460 45  0000 C CNN
F 2 "fab-R1206FAB" H 9330 2500 20  0001 C CNN
F 3 "" H 9300 2350 50  0001 C CNN
	1    9300 2350
	0    1    1    0   
$EndComp
$Comp
L fab:RES-US1206FAB R3
U 1 1 5E6FE93C
P 9950 2350
F 0 "R3" H 9950 2544 45  0000 C CNN
F 1 "100Ω" H 9950 2460 45  0000 C CNN
F 2 "fab-R1206FAB" H 9980 2500 20  0001 C CNN
F 3 "" H 9950 2350 50  0001 C CNN
	1    9950 2350
	0    1    1    0   
$EndComp
$Comp
L fab:LED LED2
U 1 1 5E6FFCA0
P 9200 3000
F 0 "LED2" H 9278 3092 45  0000 L CNN
F 1 "LED" H 9278 3008 45  0000 L CNN
F 2 "fab-LED1206" H 9230 3150 20  0001 C CNN
F 3 "" H 9200 3000 50  0001 C CNN
	1    9200 3000
	1    0    0    -1  
$EndComp
$Comp
L fab:LED LED3
U 1 1 5E7000F8
P 9950 3000
F 0 "LED3" H 10028 3092 45  0000 L CNN
F 1 "LED" H 10028 3008 45  0000 L CNN
F 2 "fab-LED1206" H 9980 3150 20  0001 C CNN
F 3 "" H 9950 3000 50  0001 C CNN
	1    9950 3000
	1    0    0    -1  
$EndComp
$Comp
L fab:FTDI-SMD-HEADER M1
U 1 1 5E700CB2
P 8000 1100
F 0 "M1" H 8000 1100 45  0001 C CNN
F 1 "FTDI-SMD-HEADER" H 8000 1100 45  0001 C CNN
F 2 "fab-1X06SMD" H 8030 1250 20  0001 C CNN
F 3 "" H 8000 1100 50  0001 C CNN
	1    8000 1100
	0    -1   -1   0   
$EndComp
$Comp
L fab:CAP-UNPOLARIZEDFAB C1
U 1 1 5E701702
P 9500 3800
F 0 "C1" H 9450 4014 45  0000 C CNN
F 1 "0.1uF" H 9450 3930 45  0000 C CNN
F 2 "fab-C1206FAB" H 9530 3950 20  0001 C CNN
F 3 "" H 9500 3800 50  0001 C CNN
	1    9500 3800
	1    0    0    -1  
$EndComp
$Comp
L fab:CAP-UNPOLARIZEDFAB C2
U 1 1 5E7023DF
P 9150 1500
F 0 "C2" V 9058 1588 45  0000 L CNN
F 1 "10μF" V 9142 1588 45  0000 L CNN
F 2 "fab-C1206FAB" H 9180 1650 20  0001 C CNN
F 3 "" H 9150 1500 50  0001 C CNN
	1    9150 1500
	0    1    1    0   
$EndComp
$Comp
L fab:CAP-UNPOLARIZEDFAB C3
U 1 1 5E702814
P 10400 1500
F 0 "C3" H 10350 1714 45  0000 C CNN
F 1 "10μF" H 10350 1630 45  0000 C CNN
F 2 "fab-C1206FAB" H 10430 1650 20  0001 C CNN
F 3 "" H 10400 1500 50  0001 C CNN
	1    10400 1500
	0    1    1    0   
$EndComp
Wire Wire Line
	7700 1100 7700 1300
Wire Wire Line
	7700 1300 9150 1300
Wire Wire Line
	9450 1300 9150 1300
Connection ~ 9150 1300
Wire Wire Line
	10400 1300 10050 1300
Wire Wire Line
	10400 1300 10850 1300
Connection ~ 10400 1300
Wire Wire Line
	10400 1600 9750 1600
Wire Wire Line
	9750 1600 9150 1600
Connection ~ 9750 1600
$Comp
L power:GND #PWR0104
U 1 1 5E711B07
P 9750 1600
F 0 "#PWR0104" H 9750 1350 50  0001 C CNN
F 1 "GND" H 9755 1427 50  0000 C CNN
F 2 "" H 9750 1600 50  0001 C CNN
F 3 "" H 9750 1600 50  0001 C CNN
	1    9750 1600
	1    0    0    -1  
$EndComp
$Comp
L power:GND #PWR0105
U 1 1 5E7120F9
P 7500 1100
F 0 "#PWR0105" H 7500 850 50  0001 C CNN
F 1 "GND" H 7505 927 50  0000 C CNN
F 2 "" H 7500 1100 50  0001 C CNN
F 3 "" H 7500 1100 50  0001 C CNN
	1    7500 1100
	1    0    0    -1  
$EndComp
Wire Wire Line
	9300 3800 9000 3800
Wire Wire Line
	9600 3800 9850 3800
Text GLabel 9000 3800 0    50   Input ~ 0
3V3
Text GLabel 9850 3800 2    50   Input ~ 0
GND
Wire Wire Line
	9950 2550 9950 2800
$Comp
L fab:LED LEDPOWER1
U 1 1 5E680CDB
P 10700 3000
F 0 "LEDPOWER1" H 10778 3092 45  0000 L CNN
F 1 "LED" H 10778 3008 45  0000 L CNN
F 2 "fab-LED1206" H 10730 3150 20  0001 C CNN
F 3 "" H 10700 3000 50  0001 C CNN
	1    10700 3000
	1    0    0    -1  
$EndComp
$Comp
L fab:RES-US1206FAB R4
U 1 1 5E681792
P 10700 2350
F 0 "R4" H 10700 2544 45  0000 C CNN
F 1 "100Ω" H 10700 2460 45  0000 C CNN
F 2 "fab-R1206FAB" H 10730 2500 20  0001 C CNN
F 3 "" H 10700 2350 50  0001 C CNN
	1    10700 2350
	0    1    1    0   
$EndComp
Wire Wire Line
	10700 2800 10700 2550
Wire Wire Line
	9300 2550 9200 2550
Wire Wire Line
	9200 2550 9200 2800
Text Label 3750 2300 0    50   ~ 0
3V3
Text Label 10850 1300 0    50   ~ 0
3V3
Wire Wire Line
	9200 3100 9200 3300
Wire Wire Line
	9950 3100 9950 3300
Wire Wire Line
	10700 3100 10700 3300
Text GLabel 10700 2150 1    50   Input ~ 0
3V3
Connection ~ 10700 2550
Wire Wire Line
	10700 2550 10700 2500
Wire Wire Line
	1750 2350 1750 2250
Wire Wire Line
	1750 2250 1800 2250
Wire Wire Line
	1850 2250 1850 2350
Wire Wire Line
	1750 2750 1750 2850
Wire Wire Line
	1750 2850 1800 2850
Wire Wire Line
	1850 2850 1850 2750
$Comp
L fab:6MM_SWITCH6MM_SWITCH RESETBUTTON1
U 1 1 5E6B8795
P 8550 2900
F 0 "RESETBUTTON1" H 8703 2942 45  0000 L CNN
F 1 "6MM_SWITCH6MM_SWITCH" H 8703 2858 45  0000 L CNN
F 2 "fab-6MM_SWITCH" H 8580 3050 20  0001 C CNN
F 3 "" H 8550 2900 50  0001 C CNN
	1    8550 2900
	1    0    0    -1  
$EndComp
Text GLabel 10700 3300 0    50   Input ~ 0
GND
Wire Wire Line
	8550 1800 8550 2050
Wire Wire Line
	8550 2450 8550 2550
Wire Wire Line
	8550 2550 8650 2550
Wire Wire Line
	8650 2550 8650 2700
Connection ~ 8550 2550
Wire Wire Line
	8550 2550 8550 2650
Wire Wire Line
	8550 3100 8550 3300
Wire Wire Line
	8550 3300 8650 3300
Wire Wire Line
	8650 3300 8650 3100
Wire Wire Line
	8550 2650 8300 2650
Connection ~ 8550 2650
Wire Wire Line
	8550 2650 8550 2700
Wire Wire Line
	8550 3300 8550 3400
Connection ~ 8550 3300
Text GLabel 8550 3400 0    50   Input ~ 0
GND
Text GLabel 8300 2650 0    50   Input ~ 0
EN
Text GLabel 3600 2400 0    50   Input ~ 0
EN
Text GLabel 8550 1800 0    50   Input ~ 0
3V3
$Comp
L fab:6MM_SWITCH6MM_SWITCH S1
U 1 1 5E6B437C
P 1750 2550
F 0 "S1" H 1903 2592 45  0000 L CNN
F 1 "6MM_SWITCH6MM_SWITCH" H 1903 2508 45  0000 L CNN
F 2 "fab-6MM_SWITCH" H 1780 2700 20  0001 C CNN
F 3 "" H 1750 2550 50  0001 C CNN
	1    1750 2550
	1    0    0    -1  
$EndComp
Connection ~ 1800 2850
Wire Wire Line
	1800 2850 1850 2850
Wire Wire Line
	1800 2250 1800 2100
Connection ~ 1800 2250
Wire Wire Line
	1800 2250 1850 2250
Text GLabel 1800 2100 0    50   Input ~ 0
3V3
Wire Wire Line
	1800 3200 1300 3200
Connection ~ 1800 3200
Text GLabel 1300 3200 0    50   Input ~ 0
I027
Text GLabel 3900 3300 0    50   Input ~ 0
I027
Wire Wire Line
	1800 2850 1800 3200
Text GLabel 1800 4300 0    50   Input ~ 0
GND
Wire Wire Line
	1800 4100 1800 4300
Wire Wire Line
	1800 3200 1800 3700
$Comp
L fab:RES-US1206FAB R5
U 1 1 5E6E1ACE
P 1800 3900
F 0 "R5" V 1758 3968 45  0000 L CNN
F 1 "2.2k" V 1842 3968 45  0000 L CNN
F 2 "fab-R1206FAB" H 1830 4050 20  0001 C CNN
F 3 "" H 1800 3900 50  0001 C CNN
	1    1800 3900
	0    1    1    0   
$EndComp
Text GLabel 6700 2450 0    50   Input ~ 0
RXD
Text GLabel 7800 1200 3    50   Input ~ 0
RXD
Wire Wire Line
	7900 1200 7900 1100
Text GLabel 7000 2350 0    50   Input ~ 0
TXD
Text GLabel 7900 1200 3    50   Input ~ 0
TXD
Wire Wire Line
	7800 1200 7800 1100
Text GLabel 6950 4550 0    50   Input ~ 0
1O0
Text GLabel 7700 4650 2    50   Input ~ 0
GND
Text GLabel 6300 3350 2    50   Input ~ 0
1O0
$Comp
L Connector:Conn_01x11_Female J1
U 1 1 5E7605AA
P 3050 3000
F 0 "J1" H 2942 2275 50  0000 C CNN
F 1 "Conn_01x11_Female" H 2942 2366 50  0000 C CNN
F 2 "Connector_PinHeader_2.54mm:PinHeader_1x11_P2.54mm_Vertical" H 3050 3000 50  0001 C CNN
F 3 "~" H 3050 3000 50  0001 C CNN
	1    3050 3000
	-1   0    0    1   
$EndComp
Wire Wire Line
	3250 2300 4350 2300
Wire Wire Line
	3600 2400 4350 2400
Text GLabel 3250 2300 0    50   Input ~ 0
3V3
$Comp
L fab:SLIDE-SWITCH S2
U 1 1 5E772C4E
P 7350 4550
F 0 "S2" H 7350 4829 45  0000 C CNN
F 1 "SLIDE-SWITCH" H 7350 4745 45  0000 C CNN
F 2 "fab:fab-AYZ0102AGRLC" H 7380 4700 20  0001 C CNN
F 3 "" H 7350 4550 50  0001 C CNN
	1    7350 4550
	1    0    0    -1  
$EndComp
Wire Wire Line
	6950 4550 7150 4550
Wire Wire Line
	7550 4650 7700 4650
Wire Wire Line
	6200 3450 6350 3450
Wire Wire Line
	6350 3450 6350 3550
Connection ~ 6350 3550
Wire Wire Line
	6350 3550 6850 3550
Wire Wire Line
	6200 3350 6300 3350
Wire Wire Line
	6200 3250 7150 3250
Wire Wire Line
	7150 3250 7150 3150
Wire Wire Line
	7150 3150 7350 3150
Wire Wire Line
	6200 3150 7000 3150
Wire Wire Line
	7000 3150 7000 3050
Wire Wire Line
	7000 3050 7350 3050
Wire Wire Line
	6200 3050 6900 3050
Wire Wire Line
	6900 3050 6900 2950
Wire Wire Line
	6900 2950 7350 2950
Wire Wire Line
	6200 2950 6800 2950
Wire Wire Line
	6800 2950 6800 2850
Wire Wire Line
	6800 2850 7350 2850
Wire Wire Line
	6200 2850 6650 2850
Wire Wire Line
	6650 2850 6650 2750
Wire Wire Line
	6650 2750 7350 2750
Wire Wire Line
	6200 2750 6550 2750
Wire Wire Line
	6550 2750 6550 2650
Wire Wire Line
	6550 2650 7350 2650
Text GLabel 7200 1950 0    50   Input ~ 0
3V3
Wire Wire Line
	7200 1950 7350 1950
Text GLabel 6900 2050 0    50   Input ~ 0
GND
Wire Wire Line
	6900 2050 7350 2050
Wire Wire Line
	3250 2800 4350 2800
Wire Wire Line
	3250 2900 4350 2900
Text Label 9300 2150 0    50   ~ 0
I04
Text Label 6950 3250 0    50   ~ 0
I04
Text Label 6700 3150 0    50   ~ 0
I016
Text Label 9950 2150 0    50   ~ 0
I016
Text GLabel 9200 3300 0    50   Input ~ 0
GND
Text GLabel 9950 3300 0    50   Input ~ 0
GND
Entry Wire Line
	6900 4400 7000 4500
$Comp
L Connector:Conn_01x13_Female J3
U 1 1 5E78B59C
P 7550 2550
F 0 "J3" H 7578 2576 50  0000 L CNN
F 1 "Conn_01x13_Female" H 7578 2485 50  0000 L CNN
F 2 "Connector_PinHeader_2.54mm:PinHeader_1x13_P2.54mm_Vertical" H 7550 2550 50  0001 C CNN
F 3 "~" H 7550 2550 50  0001 C CNN
	1    7550 2550
	1    0    0    -1  
$EndComp
$EndSCHEMATC
