0
SECTION
2
HEADER
9
$INSUNITS
70
4
9
$ACADVER
1
AC1014
9
$HANDSEED
5
FFFF
0
ENDSEC
0
SECTION
2
TABLES
0
TABLE
2
VPORT
5
8
100
AcDbSymbolTable
0
ENDTAB
0
TABLE
2
LTYPE
5
5
100
AcDbSymbolTable
0
LTYPE
5
14
100
AcDbSymbolTableRecord
100
AcDbLinetypeTableRecord
2
BYBLOCK
70
0
0
LTYPE
5
15
100
AcDbSymbolTableRecord
100
AcDbLinetypeTableRecord
2
BYLAYER
70
0
0
ENDTAB
0
TABLE
2
LAYER
5
2
100
AcDbSymbolTable
70
2
0
LAYER
5
50
100
AcDbSymbolTableRecord
100
AcDbLayerTableRecord
2
0
70
0
6
CONTINUOUS
0
ENDTAB
0
TABLE
2
STYLE
5
3
100
AcDbSymbolTable
70
1
0
STYLE
5
11
100
AcDbSymbolTableRecord
100
AcDbTextStyleTableRecord
2
STANDARD
70
0
0
ENDTAB
0
TABLE
2
VIEW
5
6
100
AcDbSymbolTable
70
0
0
ENDTAB
0
TABLE
2
UCS
5
7
100
AcDbSymbolTable
70
0
0
ENDTAB
0
TABLE
2
APPID
5
9
100
AcDbSymbolTable
70
2
0
APPID
5
12
100
AcDbSymbolTableRecord
100
AcDbRegAppTableRecord
2
ACAD
70
0
0
ENDTAB
0
TABLE
2
DIMSTYLE
5
A
100
AcDbSymbolTable
70
1
0
ENDTAB
0
TABLE
2
BLOCK_RECORD
5
1
100
AcDbSymbolTable
70
1
0
BLOCK_RECORD
5
1F
100
AcDbSymbolTableRecord
100
AcDbBlockTableRecord
2
*MODEL_SPACE
0
BLOCK_RECORD
5
1B
100
AcDbSymbolTableRecord
100
AcDbBlockTableRecord
2
*PAPER_SPACE
0
ENDTAB
0
ENDSEC
0
SECTION
2
BLOCKS
0
BLOCK
5
20
100
AcDbEntity
100
AcDbBlockBegin
2
*MODEL_SPACE
0
ENDBLK
5
21
100
AcDbEntity
100
AcDbBlockEnd
0
BLOCK
5
1C
100
AcDbEntity
100
AcDbBlockBegin
2
*PAPER_SPACE
0
ENDBLK
5
1D
100
AcDbEntity
100
AcDbBlockEnd
0
ENDSEC
0
SECTION
2
ENTITIES
0
LINE
5
100
100
AcDbEntity
8
0
100
AcDbLine
10
43.301270189222137
20
-25.000000000000263
30
0
11
22.600635094611139
21
10.854551732809416
31
0
0
LINE
5
101
100
AcDbEntity
8
0
100
AcDbLine
10
22.600635094611139
20
10.854551732809416
30
0
11
11.775317547305676
21
4.6045517328093988
31
0
0
LINE
5
102
100
AcDbEntity
8
0
100
AcDbLine
10
11.775317547305676
20
4.6045517328093988
30
0
11
9.8753175473056753
21
7.8954482671902664
31
0
0
LINE
5
103
100
AcDbEntity
8
0
100
AcDbLine
10
9.8753175473056753
20
7.8954482671902664
30
0
11
20.700635094611144
21
14.145448267190286
31
0
0
LINE
5
104
100
AcDbEntity
8
0
100
AcDbLine
10
20.700635094611144
20
14.145448267190286
30
0
11
1.2434497875801753e-13
21
49.999999999999964
31
0
0
LINE
5
105
100
AcDbEntity
8
0
100
AcDbLine
10
1.2434497875801753e-13
20
49.999999999999964
30
0
11
-20.700635094610917
21
14.145448267190668
31
0
0
LINE
5
106
100
AcDbEntity
8
0
100
AcDbLine
10
-20.700635094610917
20
14.145448267190668
30
0
11
-9.875317547305432
21
7.8954482671906856
31
0
0
LINE
5
107
100
AcDbEntity
8
0
100
AcDbLine
10
-9.875317547305432
20
7.8954482671906856
30
0
11
-11.775317547305431
21
4.6045517328098189
31
0
0
LINE
5
108
100
AcDbEntity
8
0
100
AcDbLine
10
-11.775317547305431
20
4.6045517328098189
30
0
11
-22.600635094610922
21
10.854551732809801
31
0
0
LINE
5
109
100
AcDbEntity
8
0
100
AcDbLine
10
-22.600635094610922
20
10.854551732809801
30
0
11
-43.301270189221981
21
-24.999999999999865
31
0
0
LINE
5
110
100
AcDbEntity
8
0
100
AcDbLine
10
-43.301270189221981
20
-24.999999999999865
30
0
11
-1.9000000000002348
21
-25.000000000000075
31
0
0
LINE
5
111
100
AcDbEntity
8
0
100
AcDbLine
10
-1.9000000000002348
20
-25.000000000000075
30
0
11
-1.9000000000002486
21
-12.50000000000008
31
0
0
LINE
5
112
100
AcDbEntity
8
0
100
AcDbLine
10
-1.9000000000002486
20
-12.50000000000008
30
0
11
1.8999999999997512
21
-12.50000000000008
31
0
0
LINE
5
113
100
AcDbEntity
8
0
100
AcDbLine
10
1.8999999999997512
20
-12.50000000000008
30
0
11
1.8999999999997694
21
-25.000000000000075
31
0
0
LINE
5
114
100
AcDbEntity
8
0
100
AcDbLine
10
1.8999999999997694
20
-25.000000000000075
30
0
11
43.301270189222137
21
-25.000000000000263
31
0
0
ENDSEC
0
SECTION
2
OBJECTS
0
DICTIONARY
5
C
100
AcDbDictionary
3
ACAD_GROUP
350
D
3
ACAD_MLINESTYLE
350
17
0
DICTIONARY
5
D
100
AcDbDictionary
0
DICTIONARY
5
1A
330
C
100
AcDbDictionary
0
DICTIONARY
5
17
100
AcDbDictionary
0
ENDSEC
0
EOF
