;Layer #
G28
G0 X344.26 Y208.19 Z80.00 F5000
G1 X344.26 Y208.19 Z8.00 F3000
G1 X332.82 Y209.36 Z8.00 F3000
G1 X323.02 Y209.91 Z8.00 F3000
G1 X314.87 Y209.81 Z8.00 F3000
G1 X311.41 Y209.53 Z8.00 F3000
G1 X308.36 Y209.08 Z8.00 F3000
G1 X305.83 Y208.76 Z8.00 F3000
G1 X303.91 Y208.82 Z8.00 F3000
G1 X302.61 Y209.28 Z8.00 F3000
G1 X301.93 Y210.13 Z8.00 F3000
G1 X301.86 Y211.37 Z8.00 F3000
G1 X302.41 Y213.01 Z8.00 F3000
G1 X303.58 Y215.04 Z8.00 F3000
G1 X305.37 Y217.46 Z8.00 F3000
G1 X307.36 Y220.25 Z8.00 F3000
G1 X309.16 Y223.37 Z8.00 F3000
G1 X310.77 Y226.83 Z8.00 F3000
G1 X312.18 Y230.62 Z8.00 F3000
G1 X313.39 Y234.76 Z8.00 F3000
G1 X314.40 Y239.23 Z8.00 F3000
G1 X315.22 Y244.03 Z8.00 F3000
G1 X315.84 Y249.17 Z8.00 F3000
G1 X316.63 Y259.10 Z8.00 F3000
G1 X316.89 Y267.65 Z8.00 F3000
G1 X316.63 Y274.81 Z8.00 F3000
G1 X315.84 Y280.59 Z8.00 F3000
G1 X315.16 Y283.11 Z8.00 F3000
G1 X314.16 Y285.58 Z8.00 F3000
G1 X312.84 Y288.01 Z8.00 F3000
G1 X311.20 Y290.39 Z8.00 F3000
G1 X309.25 Y292.72 Z8.00 F3000
G1 X306.98 Y295.01 Z8.00 F3000
G1 X304.39 Y297.25 Z8.00 F3000
G1 X301.48 Y299.44 Z8.00 F3000
G1 X298.48 Y301.40 Z8.00 F3000
G1 X295.61 Y302.93 Z8.00 F3000
G1 X292.87 Y304.05 Z8.00 F3000
G1 X290.26 Y304.75 Z8.00 F3000
G1 X287.78 Y305.02 Z8.00 F3000
G1 X285.44 Y304.88 Z8.00 F3000
G1 X283.22 Y304.31 Z8.00 F3000
G1 X281.13 Y303.33 Z8.00 F3000
G1 X279.38 Y302.13 Z8.00 F3000
G1 X278.14 Y300.93 Z8.00 F3000
G1 X277.43 Y299.74 Z8.00 F3000
G1 X277.24 Y298.54 Z8.00 F3000
G1 X277.58 Y297.34 Z8.00 F3000
G1 X278.44 Y296.15 Z8.00 F3000
G1 X279.83 Y294.95 Z8.00 F3000
G1 X281.73 Y293.75 Z8.00 F3000
G1 X284.26 Y292.73 Z8.00 F3000
G1 X287.49 Y292.05 Z8.00 F3000
G1 X291.44 Y291.72 Z8.00 F3000
G1 X296.09 Y291.73 Z8.00 F3000
G1 X301.46 Y292.09 Z8.00 F3000
G1 X307.54 Y292.80 Z8.00 F3000
G1 X314.33 Y293.85 Z8.00 F3000
G1 X321.82 Y295.25 Z8.00 F3000
G1 X329.36 Y296.62 Z8.00 F3000
G1 X336.26 Y297.61 Z8.00 F3000
G1 X342.52 Y298.19 Z8.00 F3000
G1 X348.15 Y298.39 Z8.00 F3000
G1 X353.15 Y298.19 Z8.00 F3000
G1 X357.50 Y297.61 Z8.00 F3000
G1 X361.22 Y296.62 Z8.00 F3000
G1 X364.31 Y295.25 Z8.00 F3000
G1 X366.70 Y293.74 Z8.00 F3000
G1 X368.35 Y292.35 Z8.00 F3000
G1 X369.25 Y291.08 Z8.00 F3000
G1 X369.39 Y289.94 Z8.00 F3000
G1 X368.80 Y288.91 Z8.00 F3000
G1 X367.45 Y288.01 Z8.00 F3000
G1 X365.36 Y287.23 Z8.00 F3000
G1 X362.51 Y286.57 Z8.00 F3000
G1 X359.37 Y286.16 Z8.00 F3000
G1 X356.36 Y286.12 Z8.00 F3000
G1 X353.50 Y286.46 Z8.00 F3000
G1 X350.77 Y287.17 Z8.00 F3000
G1 X348.19 Y288.26 Z8.00 F3000
G1 X345.74 Y289.71 Z8.00 F3000
G1 X343.44 Y291.55 Z8.00 F3000
G1 X341.27 Y293.75 Z8.00 F3000
G1 X339.78 Y295.97 Z8.00 F3000
G1 X339.48 Y296.94 Z8.00 F3000
G1 X339.48 Y297.83 Z8.00 F3000
G1 X339.78 Y298.63 Z8.00 F3000
G1 X340.37 Y299.34 Z8.00 F3000
G1 X341.27 Y299.95 Z8.00 F3000
G1 X342.47 Y300.49 Z8.00 F3000
G1 X345.76 Y301.28 Z8.00 F3000
G1 X350.25 Y301.72 Z8.00 F3000
G1 X355.93 Y301.80 Z8.00 F3000
G1 X362.81 Y301.53 Z8.00 F3000
G1 X377.25 Y300.32 Z8.00 F3000
G1 X390.64 Y298.47 Z8.00 F3000
G1 X396.94 Y297.30 Z8.00 F3000
G1 X402.98 Y295.98 Z8.00 F3000
G1 X408.76 Y294.50 Z8.00 F3000
G1 X414.27 Y292.86 Z8.00 F3000
G1 X416.92 Y292.20 Z8.00 F3000
G1 X419.49 Y291.94 Z8.00 F3000
G1 X421.97 Y292.08 Z8.00 F3000
G1 X424.37 Y292.63 Z8.00 F3000
G1 X426.68 Y293.58 Z8.00 F3000
G1 X428.91 Y294.93 Z8.00 F3000
G1 X431.06 Y296.68 Z8.00 F3000
G1 X433.12 Y298.84 Z8.00 F3000
G1 X435.10 Y301.40 Z8.00 F3000
G1 X436.99 Y304.36 Z8.00 F3000
G1 X438.80 Y307.72 Z8.00 F3000
G1 X440.53 Y311.48 Z8.00 F3000
G1 X442.17 Y315.65 Z8.00 F3000
G1 X443.72 Y320.21 Z8.00 F3000
G1 X446.59 Y330.55 Z8.00 F3000
G1 X448.80 Y341.08 Z8.00 F3000
G1 X450.04 Y350.36 Z8.00 F3000
G1 X450.31 Y354.54 Z8.00 F3000
G1 X450.33 Y358.40 Z8.00 F3000
G1 X450.11 Y361.95 Z8.00 F3000
G1 X449.65 Y365.20 Z8.00 F3000
G1 X448.95 Y368.13 Z8.00 F3000
G1 X448.01 Y370.76 Z8.00 F3000
G1 X446.82 Y373.07 Z8.00 F3000
G1 X445.40 Y375.07 Z8.00 F3000
G1 X443.74 Y376.76 Z8.00 F3000
G1 X441.83 Y378.15 Z8.00 F3000
G1 X439.68 Y379.22 Z8.00 F3000
G1 X437.30 Y379.98 Z8.00 F3000
G1 X384.65 Y392.70 Z8.00 F3000
G1 X376.84 Y394.97 Z8.00 F3000
G1 X373.18 Y396.32 Z8.00 F3000
G1 X369.68 Y397.83 Z8.00 F3000
G1 X366.36 Y399.49 Z8.00 F3000
G1 X363.19 Y401.29 Z8.00 F3000
G1 X360.20 Y403.24 Z8.00 F3000
G1 X357.37 Y405.35 Z8.00 F3000
G1 X354.70 Y407.60 Z8.00 F3000
G1 X352.21 Y410.00 Z8.00 F3000
G1 X349.87 Y412.55 Z8.00 F3000
G1 X347.71 Y415.25 Z8.00 F3000
G1 X345.71 Y418.10 Z8.00 F3000
G1 X343.87 Y421.10 Z8.00 F3000
G1 X342.20 Y424.25 Z8.00 F3000
G1 X340.70 Y427.55 Z8.00 F3000
G1 X339.15 Y430.76 Z8.00 F3000
G1 X337.35 Y433.66 Z8.00 F3000
G1 X335.29 Y436.24 Z8.00 F3000
G1 X332.98 Y438.50 Z8.00 F3000
G1 X330.42 Y440.44 Z8.00 F3000
G1 X327.61 Y442.07 Z8.00 F3000
G1 X324.54 Y443.38 Z8.00 F3000
G1 X321.22 Y444.37 Z8.00 F3000
G1 X317.64 Y445.04 Z8.00 F3000
G1 X313.81 Y445.40 Z8.00 F3000
G1 X309.73 Y445.44 Z8.00 F3000
G1 X305.39 Y445.16 Z8.00 F3000
G1 X300.80 Y444.57 Z8.00 F3000
G1 X295.96 Y443.66 Z8.00 F3000
G1 X290.86 Y442.43 Z8.00 F3000
G1 X285.51 Y440.88 Z8.00 F3000
G1 X274.67 Y437.28 Z8.00 F3000
G1 X264.08 Y433.29 Z8.00 F3000
G1 X253.73 Y428.91 Z8.00 F3000
G1 X243.61 Y424.14 Z8.00 F3000
G1 X233.74 Y418.98 Z8.00 F3000
G1 X224.11 Y413.44 Z8.00 F3000
G1 X214.73 Y407.51 Z8.00 F3000
G1 X205.58 Y401.19 Z8.00 F3000
G1 X201.30 Y397.94 Z8.00 F3000
G1 X197.48 Y394.72 Z8.00 F3000
G1 X194.12 Y391.53 Z8.00 F3000
G1 X191.22 Y388.36 Z8.00 F3000
G1 X188.78 Y385.21 Z8.00 F3000
G1 X186.80 Y382.10 Z8.00 F3000
G1 X185.29 Y379.00 Z8.00 F3000
G1 X184.23 Y375.93 Z8.00 F3000
G1 X183.64 Y372.89 Z8.00 F3000
G1 X183.51 Y369.87 Z8.00 F3000
G1 X183.84 Y366.87 Z8.00 F3000
G1 X184.63 Y363.90 Z8.00 F3000
G1 X185.88 Y360.96 Z8.00 F3000
G1 X187.60 Y358.04 Z8.00 F3000
G1 X189.77 Y355.14 Z8.00 F3000
G1 X192.41 Y352.27 Z8.00 F3000
G1 X198.27 Y346.92 Z8.00 F3000
G1 X204.40 Y342.29 Z8.00 F3000
G1 X210.79 Y338.37 Z8.00 F3000
G1 X217.43 Y335.18 Z8.00 F3000
G1 X224.34 Y332.70 Z8.00 F3000
G1 X231.51 Y330.95 Z8.00 F3000
G1 X238.94 Y329.92 Z8.00 F3000
G1 X246.63 Y329.60 Z8.00 F3000
G0 X246.63 Y329.60 Z80.00 F5000
G0 X271.32 Y188.11 Z80.00 F5000
G1 X271.32 Y188.11 Z8.00 F3000
G1 X267.96 Y191.90 Z8.00 F3000
G1 X264.84 Y195.73 Z8.00 F3000
G1 X261.95 Y199.62 Z8.00 F3000
G1 X259.29 Y203.56 Z8.00 F3000
G1 X256.88 Y207.54 Z8.00 F3000
G1 X254.69 Y211.58 Z8.00 F3000
G1 X252.74 Y215.67 Z8.00 F3000
G1 X251.03 Y219.80 Z8.00 F3000
G1 X249.55 Y223.99 Z8.00 F3000
G1 X248.31 Y228.23 Z8.00 F3000
G1 X247.30 Y232.51 Z8.00 F3000
G1 X246.53 Y236.85 Z8.00 F3000
G1 X245.99 Y241.23 Z8.00 F3000
G1 X245.69 Y245.67 Z8.00 F3000
G1 X245.62 Y250.15 Z8.00 F3000
G1 X245.79 Y254.69 Z8.00 F3000
G1 X246.70 Y272.87 Z8.00 F3000
G1 X247.15 Y290.94 Z8.00 F3000
G1 X247.15 Y308.90 Z8.00 F3000
G1 X246.70 Y326.74 Z8.00 F3000
G1 X246.64 Y331.04 Z8.00 F3000
G1 X246.80 Y335.06 Z8.00 F3000
G1 X247.18 Y338.79 Z8.00 F3000
G1 X247.78 Y342.24 Z8.00 F3000
G1 X248.60 Y345.41 Z8.00 F3000
G1 X249.65 Y348.28 Z8.00 F3000
G1 X250.91 Y350.88 Z8.00 F3000
G1 X252.40 Y353.19 Z8.00 F3000
G1 X254.10 Y355.21 Z8.00 F3000
G1 X256.03 Y356.95 Z8.00 F3000
G1 X258.18 Y358.40 Z8.00 F3000
G1 X260.55 Y359.57 Z8.00 F3000
G1 X263.14 Y360.45 Z8.00 F3000
G1 X265.95 Y361.05 Z8.00 F3000
G1 X268.98 Y361.37 Z8.00 F3000
G1 X272.23 Y361.39 Z8.00 F3000
G1 X286.63 Y360.48 Z8.00 F3000
G1 X302.90 Y358.66 Z8.00 F3000
G1 X321.06 Y355.92 Z8.00 F3000
G1 X341.09 Y352.27 Z8.00 F3000
G1 X351.14 Y350.19 Z8.00 F3000
G1 X360.30 Y348.03 Z8.00 F3000
G1 X368.58 Y345.80 Z8.00 F3000
G1 X375.98 Y343.50 Z8.00 F3000
G1 X382.49 Y341.12 Z8.00 F3000
G1 X388.12 Y338.68 Z8.00 F3000
G1 X392.86 Y336.16 Z8.00 F3000
G1 X396.72 Y333.58 Z8.00 F3000
G1 X398.35 Y332.12 Z8.00 F3000
G1 X399.82 Y330.36 Z8.00 F3000
G1 X401.13 Y328.30 Z8.00 F3000
G1 X402.28 Y325.94 Z8.00 F3000
G1 X403.27 Y323.28 Z8.00 F3000
G1 X404.10 Y320.32 Z8.00 F3000
G1 X404.77 Y317.07 Z8.00 F3000
G1 X405.27 Y313.51 Z8.00 F3000
G1 X405.81 Y305.50 Z8.00 F3000
G1 X405.70 Y296.30 Z8.00 F3000
G1 X404.95 Y285.90 Z8.00 F3000
G1 X403.56 Y274.30 Z8.00 F3000
G1 X402.61 Y268.26 Z8.00 F3000
G1 X401.46 Y262.33 Z8.00 F3000
G1 X400.10 Y256.53 Z8.00 F3000
G1 X398.55 Y250.84 Z8.00 F3000
G1 X396.80 Y245.27 Z8.00 F3000
G1 X394.84 Y239.82 Z8.00 F3000
G1 X392.69 Y234.48 Z8.00 F3000
G1 X390.34 Y229.27 Z8.00 F3000
G1 X387.79 Y224.17 Z8.00 F3000
G1 X385.04 Y219.18 Z8.00 F3000
G1 X382.09 Y214.32 Z8.00 F3000
G1 X378.94 Y209.57 Z8.00 F3000
G1 X375.59 Y204.94 Z8.00 F3000
G1 X372.04 Y200.43 Z8.00 F3000
G1 X368.30 Y196.04 Z8.00 F3000
G1 X364.35 Y191.76 Z8.00 F3000
G1 X356.50 Y183.85 Z8.00 F3000
G1 X349.16 Y177.00 Z8.00 F3000
G1 X342.31 Y171.20 Z8.00 F3000
G1 X335.96 Y166.45 Z8.00 F3000
G1 X330.11 Y162.76 Z8.00 F3000
G1 X324.76 Y160.12 Z8.00 F3000
G1 X322.27 Y159.20 Z8.00 F3000
G1 X319.91 Y158.54 Z8.00 F3000
G1 X317.67 Y158.15 Z8.00 F3000
G1 X315.55 Y158.01 Z8.00 F3000
G1 X313.46 Y158.13 Z8.00 F3000
G1 X311.27 Y158.48 Z8.00 F3000
G1 X306.63 Y159.90 Z8.00 F3000
G1 X301.64 Y162.25 Z8.00 F3000
G1 X296.29 Y165.54 Z8.00 F3000
G1 X290.58 Y169.77 Z8.00 F3000
G1 X284.52 Y174.94 Z8.00 F3000
G1 X278.10 Y181.06 Z8.00 F3000
G1 X271.32 Y188.11 Z8.00 F3000
G0 X271.32 Y188.11 Z80.00 F5000
