(kicad_pcb (version 20171130) (host pcbnew "(5.1.5-0-10_14)")

  (general
    (thickness 1.6)
    (drawings 12)
    (tracks 234)
    (zones 0)
    (modules 20)
    (nets 44)
  )

  (page A4)
  (layers
    (0 F.Cu signal)
    (31 B.Cu signal)
    (32 B.Adhes user)
    (33 F.Adhes user)
    (34 B.Paste user)
    (35 F.Paste user)
    (36 B.SilkS user)
    (37 F.SilkS user)
    (38 B.Mask user)
    (39 F.Mask user)
    (40 Dwgs.User user)
    (41 Cmts.User user)
    (42 Eco1.User user)
    (43 Eco2.User user)
    (44 Edge.Cuts user)
    (45 Margin user)
    (46 B.CrtYd user)
    (47 F.CrtYd user)
    (48 B.Fab user)
    (49 F.Fab user)
  )

  (setup
    (last_trace_width 0.4)
    (trace_clearance 0.4)
    (zone_clearance 0.508)
    (zone_45_only no)
    (trace_min 0.2)
    (via_size 0.8)
    (via_drill 0.4)
    (via_min_size 0.4)
    (via_min_drill 0.3)
    (uvia_size 0.3)
    (uvia_drill 0.1)
    (uvias_allowed no)
    (uvia_min_size 0.2)
    (uvia_min_drill 0.1)
    (edge_width 0.05)
    (segment_width 0.2)
    (pcb_text_width 0.3)
    (pcb_text_size 1.5 1.5)
    (mod_edge_width 0.12)
    (mod_text_size 1 1)
    (mod_text_width 0.15)
    (pad_size 1.524 1.524)
    (pad_drill 0.762)
    (pad_to_mask_clearance 0.051)
    (solder_mask_min_width 0.25)
    (aux_axis_origin 222.25 127)
    (visible_elements FFFFFF7F)
    (pcbplotparams
      (layerselection 0x010fc_ffffffff)
      (usegerberextensions false)
      (usegerberattributes false)
      (usegerberadvancedattributes false)
      (creategerberjobfile false)
      (excludeedgelayer true)
      (linewidth 0.100000)
      (plotframeref false)
      (viasonmask false)
      (mode 1)
      (useauxorigin false)
      (hpglpennumber 1)
      (hpglpenspeed 20)
      (hpglpendiameter 15.000000)
      (psnegative false)
      (psa4output false)
      (plotreference true)
      (plotvalue true)
      (plotinvisibletext false)
      (padsonsilk false)
      (subtractmaskfromsilk false)
      (outputformat 1)
      (mirror false)
      (drillshape 1)
      (scaleselection 1)
      (outputdirectory ""))
  )

  (net 0 "")
  (net 1 3V3)
  (net 2 GND)
  (net 3 "Net-(C2-Pad1)")
  (net 4 "Net-(J1-Pad1)")
  (net 5 "Net-(J1-Pad2)")
  (net 6 "Net-(J1-Pad3)")
  (net 7 "Net-(J1-Pad4)")
  (net 8 "Net-(J1-Pad5)")
  (net 9 "Net-(J1-Pad6)")
  (net 10 "Net-(J1-Pad7)")
  (net 11 "Net-(J1-Pad8)")
  (net 12 "Net-(J1-Pad9)")
  (net 13 "Net-(J1-Pad10)")
  (net 14 "Net-(J2-Pad1)")
  (net 15 "Net-(J2-Pad2)")
  (net 16 "Net-(J2-Pad3)")
  (net 17 "Net-(J2-Pad4)")
  (net 18 "Net-(J2-Pad5)")
  (net 19 "Net-(J2-Pad6)")
  (net 20 "Net-(J2-Pad7)")
  (net 21 "Net-(J2-Pad8)")
  (net 22 "Net-(J2-Pad9)")
  (net 23 BTN)
  (net 24 "Net-(J3-Pad4)")
  (net 25 "Net-(J3-Pad7)")
  (net 26 "Net-(J3-Pad8)")
  (net 27 "Net-(J3-Pad9)")
  (net 28 "Net-(J3-Pad10)")
  (net 29 "Net-(J3-Pad11)")
  (net 30 "Net-(J3-Pad12)")
  (net 31 "Net-(J3-Pad13)")
  (net 32 "Net-(M1-Pad1)")
  (net 33 "Net-(M2-Pad2)")
  (net 34 "Net-(M3-Pad2)")
  (net 35 TX)
  (net 36 RX)
  (net 37 "Net-(M3-Pad6)")
  (net 38 "Net-(M4-Pad2)")
  (net 39 RESET)
  (net 40 "Net-(S2-Pad1)")
  (net 41 PROG)
  (net 42 "Net-(U2-Pad32)")
  (net 43 "Net-(J3-Pad3)")

  (net_class Default "This is the default net class."
    (clearance 0.4)
    (trace_width 0.4)
    (via_dia 0.8)
    (via_drill 0.4)
    (uvia_dia 0.3)
    (uvia_drill 0.1)
    (add_net 3V3)
    (add_net BTN)
    (add_net GND)
    (add_net "Net-(C2-Pad1)")
    (add_net "Net-(J1-Pad1)")
    (add_net "Net-(J1-Pad10)")
    (add_net "Net-(J1-Pad2)")
    (add_net "Net-(J1-Pad3)")
    (add_net "Net-(J1-Pad4)")
    (add_net "Net-(J1-Pad5)")
    (add_net "Net-(J1-Pad6)")
    (add_net "Net-(J1-Pad7)")
    (add_net "Net-(J1-Pad8)")
    (add_net "Net-(J1-Pad9)")
    (add_net "Net-(J2-Pad1)")
    (add_net "Net-(J2-Pad2)")
    (add_net "Net-(J2-Pad3)")
    (add_net "Net-(J2-Pad4)")
    (add_net "Net-(J2-Pad5)")
    (add_net "Net-(J2-Pad6)")
    (add_net "Net-(J2-Pad7)")
    (add_net "Net-(J2-Pad8)")
    (add_net "Net-(J2-Pad9)")
    (add_net "Net-(J3-Pad10)")
    (add_net "Net-(J3-Pad11)")
    (add_net "Net-(J3-Pad12)")
    (add_net "Net-(J3-Pad13)")
    (add_net "Net-(J3-Pad3)")
    (add_net "Net-(J3-Pad4)")
    (add_net "Net-(J3-Pad7)")
    (add_net "Net-(J3-Pad8)")
    (add_net "Net-(J3-Pad9)")
    (add_net "Net-(M1-Pad1)")
    (add_net "Net-(M2-Pad2)")
    (add_net "Net-(M3-Pad2)")
    (add_net "Net-(M3-Pad6)")
    (add_net "Net-(M4-Pad2)")
    (add_net "Net-(S2-Pad1)")
    (add_net "Net-(U2-Pad32)")
    (add_net PROG)
    (add_net RESET)
    (add_net RX)
    (add_net TX)
  )

  (module fab-C1206FAB (layer F.Cu) (tedit 200000) (tstamp 5E68A92A)
    (at 201.168 97.028 180)
    (path /5E61F9CE)
    (attr smd)
    (fp_text reference C1 (at 0.762 -1.778) (layer F.SilkS)
      (effects (font (size 1.016 1.016) (thickness 0.1524)))
    )
    (fp_text value 0.1uf (at 1.27 1.778) (layer F.SilkS)
      (effects (font (size 1.016 1.016) (thickness 0.1524)))
    )
    (fp_line (start -2.032 -1.016) (end 2.032 -1.016) (layer B.SilkS) (width 0.127))
    (fp_line (start 2.032 -1.016) (end 2.032 1.016) (layer B.SilkS) (width 0.127))
    (fp_line (start 2.032 1.016) (end -2.032 1.016) (layer B.SilkS) (width 0.127))
    (fp_line (start -2.032 1.016) (end -2.032 -1.016) (layer B.SilkS) (width 0.127))
    (pad 1 smd rect (at -1.651 0 180) (size 1.27 1.905) (layers F.Cu F.Paste F.Mask)
      (net 1 3V3))
    (pad 2 smd rect (at 1.651 0 180) (size 1.27 1.905) (layers F.Cu F.Paste F.Mask)
      (net 2 GND))
  )

  (module fab-C1206FAB (layer F.Cu) (tedit 200000) (tstamp 5E689AE9)
    (at 209.296 88.392 90)
    (path /5E6206D6)
    (attr smd)
    (fp_text reference C2 (at -3.556 0) (layer F.SilkS)
      (effects (font (size 1.016 1.016) (thickness 0.1524)))
    )
    (fp_text value 10uf (at -5.08 0 180) (layer F.SilkS)
      (effects (font (size 1.016 1.016) (thickness 0.1524)))
    )
    (fp_line (start -2.032 -1.016) (end 2.032 -1.016) (layer B.SilkS) (width 0.127))
    (fp_line (start 2.032 -1.016) (end 2.032 1.016) (layer B.SilkS) (width 0.127))
    (fp_line (start 2.032 1.016) (end -2.032 1.016) (layer B.SilkS) (width 0.127))
    (fp_line (start -2.032 1.016) (end -2.032 -1.016) (layer B.SilkS) (width 0.127))
    (pad 1 smd rect (at -1.651 0 90) (size 1.27 1.905) (layers F.Cu F.Paste F.Mask)
      (net 3 "Net-(C2-Pad1)"))
    (pad 2 smd rect (at 1.651 0 90) (size 1.27 1.905) (layers F.Cu F.Paste F.Mask)
      (net 2 GND))
  )

  (module fab-C1206FAB (layer F.Cu) (tedit 200000) (tstamp 5E689AF3)
    (at 201.676 81.28)
    (path /5E62017C)
    (attr smd)
    (fp_text reference C3 (at -1.524 -2.032) (layer F.SilkS)
      (effects (font (size 1.016 1.016) (thickness 0.1524)))
    )
    (fp_text value 10uf (at -4.572 -2.032) (layer F.SilkS)
      (effects (font (size 1.016 1.016) (thickness 0.1524)))
    )
    (fp_line (start -2.032 1.016) (end -2.032 -1.016) (layer B.SilkS) (width 0.127))
    (fp_line (start 2.032 1.016) (end -2.032 1.016) (layer B.SilkS) (width 0.127))
    (fp_line (start 2.032 -1.016) (end 2.032 1.016) (layer B.SilkS) (width 0.127))
    (fp_line (start -2.032 -1.016) (end 2.032 -1.016) (layer B.SilkS) (width 0.127))
    (pad 2 smd rect (at 1.651 0) (size 1.27 1.905) (layers F.Cu F.Paste F.Mask)
      (net 2 GND))
    (pad 1 smd rect (at -1.651 0) (size 1.27 1.905) (layers F.Cu F.Paste F.Mask)
      (net 1 3V3))
  )

  (module Connector_PinHeader_2.54mm:PinHeader_1x11_P2.54mm_Vertical (layer F.Cu) (tedit 59FED5CC) (tstamp 5E68A1A8)
    (at 151.13 119.38 180)
    (descr "Through hole straight pin header, 1x11, 2.54mm pitch, single row")
    (tags "Through hole pin header THT 1x11 2.54mm single row")
    (path /5E628B0D)
    (fp_text reference J1 (at 0 -3.048) (layer F.SilkS)
      (effects (font (size 1 1) (thickness 0.15)))
    )
    (fp_text value Conn_01x11_Female (at 0 27.73) (layer F.Fab)
      (effects (font (size 1 1) (thickness 0.15)))
    )
    (fp_line (start -0.635 -1.27) (end 1.27 -1.27) (layer F.Fab) (width 0.1))
    (fp_line (start 1.27 -1.27) (end 1.27 26.67) (layer F.Fab) (width 0.1))
    (fp_line (start 1.27 26.67) (end -1.27 26.67) (layer F.Fab) (width 0.1))
    (fp_line (start -1.27 26.67) (end -1.27 -0.635) (layer F.Fab) (width 0.1))
    (fp_line (start -1.27 -0.635) (end -0.635 -1.27) (layer F.Fab) (width 0.1))
    (fp_line (start -1.33 26.73) (end 1.33 26.73) (layer F.SilkS) (width 0.12))
    (fp_line (start -1.33 1.27) (end -1.33 26.73) (layer F.SilkS) (width 0.12))
    (fp_line (start 1.33 1.27) (end 1.33 26.73) (layer F.SilkS) (width 0.12))
    (fp_line (start -1.33 1.27) (end 1.33 1.27) (layer F.SilkS) (width 0.12))
    (fp_line (start -1.33 0) (end -1.33 -1.33) (layer F.SilkS) (width 0.12))
    (fp_line (start -1.33 -1.33) (end 0 -1.33) (layer F.SilkS) (width 0.12))
    (fp_line (start -1.8 -1.8) (end -1.8 27.2) (layer F.CrtYd) (width 0.05))
    (fp_line (start -1.8 27.2) (end 1.8 27.2) (layer F.CrtYd) (width 0.05))
    (fp_line (start 1.8 27.2) (end 1.8 -1.8) (layer F.CrtYd) (width 0.05))
    (fp_line (start 1.8 -1.8) (end -1.8 -1.8) (layer F.CrtYd) (width 0.05))
    (fp_text user %R (at 0 12.7 90) (layer F.Fab)
      (effects (font (size 1 1) (thickness 0.15)))
    )
    (pad 1 thru_hole rect (at 0 0 180) (size 1.7 1.7) (drill 1) (layers *.Cu *.Mask)
      (net 4 "Net-(J1-Pad1)"))
    (pad 2 thru_hole oval (at 0 2.54 180) (size 1.7 1.7) (drill 1) (layers *.Cu *.Mask)
      (net 5 "Net-(J1-Pad2)"))
    (pad 3 thru_hole oval (at 0 5.08 180) (size 1.7 1.7) (drill 1) (layers *.Cu *.Mask)
      (net 6 "Net-(J1-Pad3)"))
    (pad 4 thru_hole oval (at 0 7.62 180) (size 1.7 1.7) (drill 1) (layers *.Cu *.Mask)
      (net 7 "Net-(J1-Pad4)"))
    (pad 5 thru_hole oval (at 0 10.16 180) (size 1.7 1.7) (drill 1) (layers *.Cu *.Mask)
      (net 8 "Net-(J1-Pad5)"))
    (pad 6 thru_hole oval (at 0 12.7 180) (size 1.7 1.7) (drill 1) (layers *.Cu *.Mask)
      (net 9 "Net-(J1-Pad6)"))
    (pad 7 thru_hole oval (at 0 15.24 180) (size 1.7 1.7) (drill 1) (layers *.Cu *.Mask)
      (net 10 "Net-(J1-Pad7)"))
    (pad 8 thru_hole oval (at 0 17.78 180) (size 1.7 1.7) (drill 1) (layers *.Cu *.Mask)
      (net 11 "Net-(J1-Pad8)"))
    (pad 9 thru_hole oval (at 0 20.32 180) (size 1.7 1.7) (drill 1) (layers *.Cu *.Mask)
      (net 12 "Net-(J1-Pad9)"))
    (pad 10 thru_hole oval (at 0 22.86 180) (size 1.7 1.7) (drill 1) (layers *.Cu *.Mask)
      (net 13 "Net-(J1-Pad10)"))
    (pad 11 thru_hole oval (at 0 25.4 180) (size 1.7 1.7) (drill 1) (layers *.Cu *.Mask)
      (net 23 BTN))
    (model ${KISYS3DMOD}/Connector_PinHeader_2.54mm.3dshapes/PinHeader_1x11_P2.54mm_Vertical.wrl
      (at (xyz 0 0 0))
      (scale (xyz 1 1 1))
      (rotate (xyz 0 0 0))
    )
  )

  (module Connector_PinHeader_2.54mm:PinHeader_1x09_P2.54mm_Vertical (layer F.Cu) (tedit 59FED5CC) (tstamp 5E689B2F)
    (at 193.675 124.46 270)
    (descr "Through hole straight pin header, 1x09, 2.54mm pitch, single row")
    (tags "Through hole pin header THT 1x09 2.54mm single row")
    (path /5E6261A6)
    (fp_text reference J2 (at 0 -2.33 90) (layer F.SilkS)
      (effects (font (size 1 1) (thickness 0.15)))
    )
    (fp_text value Conn_01x09_Female (at 4.445 10.795 180) (layer F.Fab)
      (effects (font (size 1 1) (thickness 0.15)))
    )
    (fp_line (start -0.635 -1.27) (end 1.27 -1.27) (layer F.Fab) (width 0.1))
    (fp_line (start 1.27 -1.27) (end 1.27 21.59) (layer F.Fab) (width 0.1))
    (fp_line (start 1.27 21.59) (end -1.27 21.59) (layer F.Fab) (width 0.1))
    (fp_line (start -1.27 21.59) (end -1.27 -0.635) (layer F.Fab) (width 0.1))
    (fp_line (start -1.27 -0.635) (end -0.635 -1.27) (layer F.Fab) (width 0.1))
    (fp_line (start -1.33 21.65) (end 1.33 21.65) (layer F.SilkS) (width 0.12))
    (fp_line (start -1.33 1.27) (end -1.33 21.65) (layer F.SilkS) (width 0.12))
    (fp_line (start 1.33 1.27) (end 1.33 21.65) (layer F.SilkS) (width 0.12))
    (fp_line (start -1.33 1.27) (end 1.33 1.27) (layer F.SilkS) (width 0.12))
    (fp_line (start -1.33 0) (end -1.33 -1.33) (layer F.SilkS) (width 0.12))
    (fp_line (start -1.33 -1.33) (end 0 -1.33) (layer F.SilkS) (width 0.12))
    (fp_line (start -1.8 -1.8) (end -1.8 22.1) (layer F.CrtYd) (width 0.05))
    (fp_line (start -1.8 22.1) (end 1.8 22.1) (layer F.CrtYd) (width 0.05))
    (fp_line (start 1.8 22.1) (end 1.8 -1.8) (layer F.CrtYd) (width 0.05))
    (fp_line (start 1.8 -1.8) (end -1.8 -1.8) (layer F.CrtYd) (width 0.05))
    (fp_text user %R (at 0 10.16) (layer F.Fab)
      (effects (font (size 1 1) (thickness 0.15)))
    )
    (pad 1 thru_hole rect (at 0 0 270) (size 1.7 1.7) (drill 1) (layers *.Cu *.Mask)
      (net 14 "Net-(J2-Pad1)"))
    (pad 2 thru_hole oval (at 0 2.54 270) (size 1.7 1.7) (drill 1) (layers *.Cu *.Mask)
      (net 15 "Net-(J2-Pad2)"))
    (pad 3 thru_hole oval (at 0 5.08 270) (size 1.7 1.7) (drill 1) (layers *.Cu *.Mask)
      (net 16 "Net-(J2-Pad3)"))
    (pad 4 thru_hole oval (at 0 7.62 270) (size 1.7 1.7) (drill 1) (layers *.Cu *.Mask)
      (net 17 "Net-(J2-Pad4)"))
    (pad 5 thru_hole oval (at 0 10.16 270) (size 1.7 1.7) (drill 1) (layers *.Cu *.Mask)
      (net 18 "Net-(J2-Pad5)"))
    (pad 6 thru_hole oval (at 0 12.7 270) (size 1.7 1.7) (drill 1) (layers *.Cu *.Mask)
      (net 19 "Net-(J2-Pad6)"))
    (pad 7 thru_hole oval (at 0 15.24 270) (size 1.7 1.7) (drill 1) (layers *.Cu *.Mask)
      (net 20 "Net-(J2-Pad7)"))
    (pad 8 thru_hole oval (at 0 17.78 270) (size 1.7 1.7) (drill 1) (layers *.Cu *.Mask)
      (net 21 "Net-(J2-Pad8)"))
    (pad 9 thru_hole oval (at 0 20.32 270) (size 1.7 1.7) (drill 1) (layers *.Cu *.Mask)
      (net 22 "Net-(J2-Pad9)"))
    (model ${KISYS3DMOD}/Connector_PinHeader_2.54mm.3dshapes/PinHeader_1x09_P2.54mm_Vertical.wrl
      (at (xyz 0 0 0))
      (scale (xyz 1 1 1))
      (rotate (xyz 0 0 0))
    )
  )

  (module Connector_PinHeader_2.54mm:PinHeader_1x13_P2.54mm_Vertical (layer F.Cu) (tedit 59FED5CC) (tstamp 5E689B50)
    (at 216.408 93.472)
    (descr "Through hole straight pin header, 1x13, 2.54mm pitch, single row")
    (tags "Through hole pin header THT 1x13 2.54mm single row")
    (path /5E62B9CE)
    (fp_text reference J3 (at -3.048 0) (layer F.SilkS)
      (effects (font (size 1 1) (thickness 0.15)))
    )
    (fp_text value Conn_01x13_Female (at 0 35.56) (layer F.Fab)
      (effects (font (size 1 1) (thickness 0.15)))
    )
    (fp_line (start -0.635 -1.27) (end 1.27 -1.27) (layer F.Fab) (width 0.1))
    (fp_line (start 1.27 -1.27) (end 1.27 31.75) (layer F.Fab) (width 0.1))
    (fp_line (start 1.27 31.75) (end -1.27 31.75) (layer F.Fab) (width 0.1))
    (fp_line (start -1.27 31.75) (end -1.27 -0.635) (layer F.Fab) (width 0.1))
    (fp_line (start -1.27 -0.635) (end -0.635 -1.27) (layer F.Fab) (width 0.1))
    (fp_line (start -1.33 31.81) (end 1.33 31.81) (layer F.SilkS) (width 0.12))
    (fp_line (start -1.33 1.27) (end -1.33 31.81) (layer F.SilkS) (width 0.12))
    (fp_line (start 1.33 1.27) (end 1.33 31.81) (layer F.SilkS) (width 0.12))
    (fp_line (start -1.33 1.27) (end 1.33 1.27) (layer F.SilkS) (width 0.12))
    (fp_line (start -1.33 0) (end -1.33 -1.33) (layer F.SilkS) (width 0.12))
    (fp_line (start -1.33 -1.33) (end 0 -1.33) (layer F.SilkS) (width 0.12))
    (fp_line (start -1.8 -1.8) (end -1.8 32.25) (layer F.CrtYd) (width 0.05))
    (fp_line (start -1.8 32.25) (end 1.8 32.25) (layer F.CrtYd) (width 0.05))
    (fp_line (start 1.8 32.25) (end 1.8 -1.8) (layer F.CrtYd) (width 0.05))
    (fp_line (start 1.8 -1.8) (end -1.8 -1.8) (layer F.CrtYd) (width 0.05))
    (fp_text user %R (at 0 15.24 90) (layer F.Fab)
      (effects (font (size 1 1) (thickness 0.15)))
    )
    (pad 1 thru_hole rect (at 0 0) (size 1.7 1.7) (drill 1) (layers *.Cu *.Mask)
      (net 1 3V3))
    (pad 2 thru_hole oval (at 0 2.54) (size 1.7 1.7) (drill 1) (layers *.Cu *.Mask)
      (net 2 GND))
    (pad 3 thru_hole oval (at 0 5.08) (size 1.7 1.7) (drill 1) (layers *.Cu *.Mask)
      (net 43 "Net-(J3-Pad3)"))
    (pad 4 thru_hole oval (at 0 7.62) (size 1.7 1.7) (drill 1) (layers *.Cu *.Mask)
      (net 24 "Net-(J3-Pad4)"))
    (pad 5 thru_hole oval (at 0 10.16) (size 1.7 1.7) (drill 1) (layers *.Cu *.Mask)
      (net 36 RX))
    (pad 6 thru_hole oval (at 0 12.7) (size 1.7 1.7) (drill 1) (layers *.Cu *.Mask)
      (net 35 TX))
    (pad 7 thru_hole oval (at 0 15.24) (size 1.7 1.7) (drill 1) (layers *.Cu *.Mask)
      (net 25 "Net-(J3-Pad7)"))
    (pad 8 thru_hole oval (at 0 17.78) (size 1.7 1.7) (drill 1) (layers *.Cu *.Mask)
      (net 26 "Net-(J3-Pad8)"))
    (pad 9 thru_hole oval (at 0 20.32) (size 1.7 1.7) (drill 1) (layers *.Cu *.Mask)
      (net 27 "Net-(J3-Pad9)"))
    (pad 10 thru_hole oval (at 0 22.86) (size 1.7 1.7) (drill 1) (layers *.Cu *.Mask)
      (net 28 "Net-(J3-Pad10)"))
    (pad 11 thru_hole oval (at 0 25.4) (size 1.7 1.7) (drill 1) (layers *.Cu *.Mask)
      (net 29 "Net-(J3-Pad11)"))
    (pad 12 thru_hole oval (at 0 27.94) (size 1.7 1.7) (drill 1) (layers *.Cu *.Mask)
      (net 30 "Net-(J3-Pad12)"))
    (pad 13 thru_hole oval (at 0 30.48) (size 1.7 1.7) (drill 1) (layers *.Cu *.Mask)
      (net 31 "Net-(J3-Pad13)"))
    (model ${KISYS3DMOD}/Connector_PinHeader_2.54mm.3dshapes/PinHeader_1x13_P2.54mm_Vertical.wrl
      (at (xyz 0 0 0))
      (scale (xyz 1 1 1))
      (rotate (xyz 0 0 0))
    )
  )

  (module fab-LED1206FAB (layer F.Cu) (tedit 200000) (tstamp 5E68ABBB)
    (at 187.452 86.868 270)
    (descr "LED1206 FAB STYLE (SMALLER PADS TO ALLOW TRACE BETWEEN)")
    (tags "LED1206 FAB STYLE (SMALLER PADS TO ALLOW TRACE BETWEEN)")
    (path /5E691A3B)
    (attr smd)
    (fp_text reference M1 (at 0 -2.032 90) (layer F.SilkS)
      (effects (font (size 1.016 1.016) (thickness 0.1524)))
    )
    (fp_text value LedFAB1206 (at -1.016 2.54 90) (layer F.SilkS)
      (effects (font (size 1.016 1.016) (thickness 0.1524)))
    )
    (fp_line (start -2.032 -1.016) (end 2.032 -1.016) (layer B.SilkS) (width 0.127))
    (fp_line (start 2.032 -1.016) (end 2.032 1.016) (layer B.SilkS) (width 0.127))
    (fp_line (start 2.032 1.016) (end -2.032 1.016) (layer B.SilkS) (width 0.127))
    (fp_line (start -2.032 1.016) (end -2.032 -1.016) (layer B.SilkS) (width 0.127))
    (pad 1 smd rect (at -1.651 0 270) (size 1.27 1.905) (layers F.Cu F.Paste F.Mask)
      (net 32 "Net-(M1-Pad1)"))
    (pad 2 smd rect (at 1.651 0 270) (size 1.27 1.905) (layers F.Cu F.Paste F.Mask)
      (net 2 GND))
  )

  (module fab-LED1206FAB (layer F.Cu) (tedit 200000) (tstamp 5E689B64)
    (at 158.75 120.015 180)
    (descr "LED1206 FAB STYLE (SMALLER PADS TO ALLOW TRACE BETWEEN)")
    (tags "LED1206 FAB STYLE (SMALLER PADS TO ALLOW TRACE BETWEEN)")
    (path /5E61DAD7)
    (attr smd)
    (fp_text reference M2 (at 3.81 0) (layer F.SilkS)
      (effects (font (size 1.016 1.016) (thickness 0.1524)))
    )
    (fp_text value Green (at 2.794 2.032) (layer F.SilkS)
      (effects (font (size 1.016 1.016) (thickness 0.1524)))
    )
    (fp_line (start -2.032 1.016) (end -2.032 -1.016) (layer B.SilkS) (width 0.127))
    (fp_line (start 2.032 1.016) (end -2.032 1.016) (layer B.SilkS) (width 0.127))
    (fp_line (start 2.032 -1.016) (end 2.032 1.016) (layer B.SilkS) (width 0.127))
    (fp_line (start -2.032 -1.016) (end 2.032 -1.016) (layer B.SilkS) (width 0.127))
    (pad 2 smd rect (at 1.651 0 180) (size 1.27 1.905) (layers F.Cu F.Paste F.Mask)
      (net 33 "Net-(M2-Pad2)"))
    (pad 1 smd rect (at -1.651 0 180) (size 1.27 1.905) (layers F.Cu F.Paste F.Mask)
      (net 22 "Net-(J2-Pad9)"))
  )

  (module fab-1X06SMD (layer F.Cu) (tedit 200000) (tstamp 5E68F87B)
    (at 214.122 81.28 90)
    (path /5E623FE7)
    (attr smd)
    (fp_text reference M3 (at 8.255 -0.127) (layer F.SilkS)
      (effects (font (size 1.27 1.27) (thickness 0.1016)))
    )
    (fp_text value FTDI-SMD-HEADER (at 6.096 0.762) (layer F.SilkS)
      (effects (font (size 1.27 1.27) (thickness 0.15)))
    )
    (pad 1 smd rect (at 0 -6.35 90) (size 2.54 1.27) (layers F.Cu F.Paste F.Mask)
      (net 2 GND))
    (pad 2 smd rect (at 0 -3.81 90) (size 2.54 1.27) (layers F.Cu F.Paste F.Mask)
      (net 34 "Net-(M3-Pad2)"))
    (pad 3 smd rect (at 0 -1.27 90) (size 2.54 1.27) (layers F.Cu F.Paste F.Mask)
      (net 3 "Net-(C2-Pad1)"))
    (pad 4 smd rect (at 0 1.27 90) (size 2.54 1.27) (layers F.Cu F.Paste F.Mask)
      (net 35 TX))
    (pad 5 smd rect (at 0 3.81 90) (size 2.54 1.27) (layers F.Cu F.Paste F.Mask)
      (net 36 RX))
    (pad 6 smd rect (at 0 6.35 90) (size 2.54 1.27) (layers F.Cu F.Paste F.Mask)
      (net 37 "Net-(M3-Pad6)"))
  )

  (module fab-LED1206FAB (layer F.Cu) (tedit 200000) (tstamp 5E68AAF6)
    (at 167.64 117.475 180)
    (descr "LED1206 FAB STYLE (SMALLER PADS TO ALLOW TRACE BETWEEN)")
    (tags "LED1206 FAB STYLE (SMALLER PADS TO ALLOW TRACE BETWEEN)")
    (path /5E61C8F0)
    (attr smd)
    (fp_text reference M4 (at 0.254 -1.778) (layer F.SilkS)
      (effects (font (size 1.016 1.016) (thickness 0.1524)))
    )
    (fp_text value Red (at 0.254 2.794) (layer F.SilkS)
      (effects (font (size 1.016 1.016) (thickness 0.1524)))
    )
    (fp_line (start -2.032 -1.016) (end 2.032 -1.016) (layer B.SilkS) (width 0.127))
    (fp_line (start 2.032 -1.016) (end 2.032 1.016) (layer B.SilkS) (width 0.127))
    (fp_line (start 2.032 1.016) (end -2.032 1.016) (layer B.SilkS) (width 0.127))
    (fp_line (start -2.032 1.016) (end -2.032 -1.016) (layer B.SilkS) (width 0.127))
    (pad 1 smd rect (at -1.651 0 180) (size 1.27 1.905) (layers F.Cu F.Paste F.Mask)
      (net 4 "Net-(J1-Pad1)"))
    (pad 2 smd rect (at 1.651 0 180) (size 1.27 1.905) (layers F.Cu F.Paste F.Mask)
      (net 38 "Net-(M4-Pad2)"))
  )

  (module fab-R1206FAB (layer F.Cu) (tedit 200000) (tstamp 5E689B82)
    (at 193.04 85.344 90)
    (path /5E69123A)
    (attr smd)
    (fp_text reference R1 (at 0.508 3.556 90) (layer F.SilkS)
      (effects (font (size 1.016 1.016) (thickness 0.1524)))
    )
    (fp_text value 100 (at 0.508 2.032 90) (layer F.SilkS)
      (effects (font (size 1.016 1.016) (thickness 0.1524)))
    )
    (fp_line (start -2.032 -1.016) (end 2.032 -1.016) (layer B.SilkS) (width 0.127))
    (fp_line (start 2.032 -1.016) (end 2.032 1.016) (layer B.SilkS) (width 0.127))
    (fp_line (start 2.032 1.016) (end -2.032 1.016) (layer B.SilkS) (width 0.127))
    (fp_line (start -2.032 1.016) (end -2.032 -1.016) (layer B.SilkS) (width 0.127))
    (pad 1 smd rect (at -1.651 0 90) (size 1.27 1.905) (layers F.Cu F.Paste F.Mask)
      (net 1 3V3))
    (pad 2 smd rect (at 1.651 0 90) (size 1.27 1.905) (layers F.Cu F.Paste F.Mask)
      (net 32 "Net-(M1-Pad1)"))
  )

  (module fab-R1206FAB (layer F.Cu) (tedit 200000) (tstamp 5E689B8C)
    (at 165.1 97.155 270)
    (path /5E616EF7)
    (attr smd)
    (fp_text reference R2 (at 0.762 -1.778 90) (layer F.SilkS)
      (effects (font (size 1.016 1.016) (thickness 0.1524)))
    )
    (fp_text value 10000Ohm (at -0.635 2.54 90) (layer F.SilkS)
      (effects (font (size 1.016 1.016) (thickness 0.1524)))
    )
    (fp_line (start -2.032 -1.016) (end 2.032 -1.016) (layer B.SilkS) (width 0.127))
    (fp_line (start 2.032 -1.016) (end 2.032 1.016) (layer B.SilkS) (width 0.127))
    (fp_line (start 2.032 1.016) (end -2.032 1.016) (layer B.SilkS) (width 0.127))
    (fp_line (start -2.032 1.016) (end -2.032 -1.016) (layer B.SilkS) (width 0.127))
    (pad 1 smd rect (at -1.651 0 270) (size 1.27 1.905) (layers F.Cu F.Paste F.Mask)
      (net 39 RESET))
    (pad 2 smd rect (at 1.651 0 270) (size 1.27 1.905) (layers F.Cu F.Paste F.Mask)
      (net 1 3V3))
  )

  (module fab-R1206FAB (layer F.Cu) (tedit 200000) (tstamp 5E689B96)
    (at 160.655 123.825)
    (path /5E622A36)
    (attr smd)
    (fp_text reference R3 (at -3.81 0) (layer F.SilkS)
      (effects (font (size 1.016 1.016) (thickness 0.1524)))
    )
    (fp_text value 100Ohm (at -1.778 1.778) (layer F.SilkS)
      (effects (font (size 1.016 1.016) (thickness 0.1524)))
    )
    (fp_line (start -2.032 1.016) (end -2.032 -1.016) (layer B.SilkS) (width 0.127))
    (fp_line (start 2.032 1.016) (end -2.032 1.016) (layer B.SilkS) (width 0.127))
    (fp_line (start 2.032 -1.016) (end 2.032 1.016) (layer B.SilkS) (width 0.127))
    (fp_line (start -2.032 -1.016) (end 2.032 -1.016) (layer B.SilkS) (width 0.127))
    (pad 2 smd rect (at 1.651 0) (size 1.27 1.905) (layers F.Cu F.Paste F.Mask)
      (net 2 GND))
    (pad 1 smd rect (at -1.651 0) (size 1.27 1.905) (layers F.Cu F.Paste F.Mask)
      (net 33 "Net-(M2-Pad2)"))
  )

  (module fab-R1206FAB (layer F.Cu) (tedit 200000) (tstamp 5E689BA0)
    (at 164.084 81.28 270)
    (path /5E865D9B)
    (attr smd)
    (fp_text reference R4 (at 0.762 -1.778 90) (layer F.SilkS)
      (effects (font (size 1.016 1.016) (thickness 0.1524)))
    )
    (fp_text value 10000Ohm (at 1.27 1.778 90) (layer F.SilkS)
      (effects (font (size 1.016 1.016) (thickness 0.1524)))
    )
    (fp_line (start -2.032 -1.016) (end 2.032 -1.016) (layer B.SilkS) (width 0.127))
    (fp_line (start 2.032 -1.016) (end 2.032 1.016) (layer B.SilkS) (width 0.127))
    (fp_line (start 2.032 1.016) (end -2.032 1.016) (layer B.SilkS) (width 0.127))
    (fp_line (start -2.032 1.016) (end -2.032 -1.016) (layer B.SilkS) (width 0.127))
    (pad 1 smd rect (at -1.651 0 270) (size 1.27 1.905) (layers F.Cu F.Paste F.Mask)
      (net 23 BTN))
    (pad 2 smd rect (at 1.651 0 270) (size 1.27 1.905) (layers F.Cu F.Paste F.Mask)
      (net 1 3V3))
  )

  (module fab-R1206FAB (layer F.Cu) (tedit 200000) (tstamp 5E68AC6C)
    (at 167.64 122.555)
    (path /5E6232E8)
    (attr smd)
    (fp_text reference R5 (at -0.762 -2.032 270) (layer F.SilkS)
      (effects (font (size 1.016 1.016) (thickness 0.1524)))
    )
    (fp_text value 100Ohm (at -2.286 2.032) (layer F.SilkS)
      (effects (font (size 1.016 1.016) (thickness 0.1524)))
    )
    (fp_line (start -2.032 1.016) (end -2.032 -1.016) (layer B.SilkS) (width 0.127))
    (fp_line (start 2.032 1.016) (end -2.032 1.016) (layer B.SilkS) (width 0.127))
    (fp_line (start 2.032 -1.016) (end 2.032 1.016) (layer B.SilkS) (width 0.127))
    (fp_line (start -2.032 -1.016) (end 2.032 -1.016) (layer B.SilkS) (width 0.127))
    (pad 2 smd rect (at 1.651 0) (size 1.27 1.905) (layers F.Cu F.Paste F.Mask)
      (net 2 GND))
    (pad 1 smd rect (at -1.651 0) (size 1.27 1.905) (layers F.Cu F.Paste F.Mask)
      (net 38 "Net-(M4-Pad2)"))
  )

  (module fab-6MM_SWITCH (layer F.Cu) (tedit 200000) (tstamp 5E689BE8)
    (at 164.084 88.9 180)
    (descr "OMRON SWITCH")
    (tags "OMRON SWITCH")
    (path /5E620F86)
    (attr smd)
    (fp_text reference S1 (at -1.016 -4.318) (layer F.SilkS)
      (effects (font (size 1.27 1.27) (thickness 0.127)))
    )
    (fp_text value 6MM_SWITCH6MM_SWITCH (at 4.572 13.716) (layer F.SilkS)
      (effects (font (size 1.27 1.27) (thickness 0.127)))
    )
    (fp_line (start 3.302 0.762) (end 3.048 0.762) (layer B.SilkS) (width 0.1524))
    (fp_line (start 3.302 0.762) (end 3.302 -0.762) (layer B.SilkS) (width 0.1524))
    (fp_line (start 3.048 -0.762) (end 3.302 -0.762) (layer B.SilkS) (width 0.1524))
    (fp_line (start 3.048 -1.016) (end 3.048 -2.54) (layer F.SilkS) (width 0.1524))
    (fp_line (start -3.302 -0.762) (end -3.048 -0.762) (layer B.SilkS) (width 0.1524))
    (fp_line (start -3.302 -0.762) (end -3.302 0.762) (layer B.SilkS) (width 0.1524))
    (fp_line (start -3.048 0.762) (end -3.302 0.762) (layer B.SilkS) (width 0.1524))
    (fp_line (start 3.048 -2.54) (end 2.54 -3.048) (layer F.SilkS) (width 0.1524))
    (fp_line (start 2.54 3.048) (end 3.048 2.54) (layer F.SilkS) (width 0.1524))
    (fp_line (start 3.048 2.54) (end 3.048 1.016) (layer F.SilkS) (width 0.1524))
    (fp_line (start -2.54 -3.048) (end -3.048 -2.54) (layer F.SilkS) (width 0.1524))
    (fp_line (start -3.048 -2.54) (end -3.048 -1.016) (layer F.SilkS) (width 0.1524))
    (fp_line (start -2.54 3.048) (end -3.048 2.54) (layer F.SilkS) (width 0.1524))
    (fp_line (start -3.048 2.54) (end -3.048 1.016) (layer F.SilkS) (width 0.1524))
    (fp_line (start -1.27 -1.27) (end -1.27 1.27) (layer F.SilkS) (width 0.0508))
    (fp_line (start 1.27 1.27) (end -1.27 1.27) (layer F.SilkS) (width 0.0508))
    (fp_line (start 1.27 1.27) (end 1.27 -1.27) (layer F.SilkS) (width 0.0508))
    (fp_line (start -1.27 -1.27) (end 1.27 -1.27) (layer F.SilkS) (width 0.0508))
    (fp_line (start -1.27 -3.048) (end -1.27 -2.794) (layer B.SilkS) (width 0.0508))
    (fp_line (start 1.27 -2.794) (end -1.27 -2.794) (layer B.SilkS) (width 0.0508))
    (fp_line (start 1.27 -2.794) (end 1.27 -3.048) (layer B.SilkS) (width 0.0508))
    (fp_line (start 1.143 2.794) (end -1.27 2.794) (layer B.SilkS) (width 0.0508))
    (fp_line (start 1.143 2.794) (end 1.143 3.048) (layer B.SilkS) (width 0.0508))
    (fp_line (start -1.27 2.794) (end -1.27 3.048) (layer B.SilkS) (width 0.0508))
    (fp_line (start 2.54 3.048) (end 2.159 3.048) (layer F.SilkS) (width 0.1524))
    (fp_line (start -2.54 3.048) (end -2.159 3.048) (layer F.SilkS) (width 0.1524))
    (fp_line (start -2.159 3.048) (end -1.27 3.048) (layer B.SilkS) (width 0.1524))
    (fp_line (start -2.54 -3.048) (end -2.159 -3.048) (layer F.SilkS) (width 0.1524))
    (fp_line (start 2.54 -3.048) (end 2.159 -3.048) (layer F.SilkS) (width 0.1524))
    (fp_line (start 2.159 -3.048) (end 1.27 -3.048) (layer B.SilkS) (width 0.1524))
    (fp_line (start 1.27 -3.048) (end -1.27 -3.048) (layer B.SilkS) (width 0.1524))
    (fp_line (start -1.27 -3.048) (end -2.159 -3.048) (layer B.SilkS) (width 0.1524))
    (fp_line (start -1.27 3.048) (end 1.143 3.048) (layer B.SilkS) (width 0.1524))
    (fp_line (start 1.143 3.048) (end 2.159 3.048) (layer B.SilkS) (width 0.1524))
    (fp_line (start 3.048 0.762) (end 3.048 1.016) (layer B.SilkS) (width 0.1524))
    (fp_line (start 3.048 -0.762) (end 3.048 -1.016) (layer B.SilkS) (width 0.1524))
    (fp_line (start -3.048 0.762) (end -3.048 1.016) (layer B.SilkS) (width 0.1524))
    (fp_line (start -3.048 -0.762) (end -3.048 -1.016) (layer B.SilkS) (width 0.1524))
    (fp_line (start -1.27 2.159) (end 1.27 2.159) (layer F.SilkS) (width 0.1524))
    (fp_line (start 1.27 -2.286) (end -1.27 -2.286) (layer F.SilkS) (width 0.1524))
    (fp_line (start -2.413 -1.27) (end -2.413 -0.508) (layer F.SilkS) (width 0.1524))
    (fp_line (start -2.413 0.508) (end -2.413 1.27) (layer F.SilkS) (width 0.1524))
    (fp_line (start -2.413 -0.508) (end -2.159 0.381) (layer F.SilkS) (width 0.1524))
    (fp_circle (center 0 0) (end -0.889 0.889) (layer B.SilkS) (width 0.0762))
    (fp_circle (center -2.159 2.159) (end -2.413 2.413) (layer F.SilkS) (width 0.0762))
    (fp_circle (center 2.159 2.032) (end 2.413 2.286) (layer F.SilkS) (width 0.0762))
    (fp_circle (center 2.159 -2.159) (end 2.413 -2.413) (layer F.SilkS) (width 0.0762))
    (fp_circle (center -2.159 -2.159) (end -2.413 -2.413) (layer F.SilkS) (width 0.0762))
    (fp_circle (center 0 0) (end -0.3175 0.3175) (layer F.SilkS) (width 0.0254))
    (fp_circle (center 0 0) (end -0.127 0.127) (layer B.SilkS) (width 0.0762))
    (fp_text user 1 (at -3.683 -2.286) (layer B.SilkS)
      (effects (font (size 1.27 1.27) (thickness 0.127)))
    )
    (fp_text user 2 (at 4.191 -2.159) (layer B.SilkS)
      (effects (font (size 1.27 1.27) (thickness 0.127)))
    )
    (fp_text user 3 (at -3.937 2.159) (layer B.SilkS)
      (effects (font (size 1.27 1.27) (thickness 0.127)))
    )
    (fp_text user 4 (at 4.191 2.159) (layer B.SilkS)
      (effects (font (size 1.27 1.27) (thickness 0.127)))
    )
    (pad 1 smd rect (at -3.302 -2.286 180) (size 2.286 1.524) (layers F.Cu F.Paste F.Mask)
      (net 39 RESET))
    (pad 2 smd rect (at 3.302 -2.286 180) (size 2.286 1.524) (layers F.Cu F.Paste F.Mask)
      (net 39 RESET))
    (pad 3 smd rect (at -3.302 2.286 180) (size 2.286 1.524) (layers F.Cu F.Paste F.Mask)
      (net 2 GND))
    (pad 4 smd rect (at 3.302 2.286 180) (size 2.286 1.524) (layers F.Cu F.Paste F.Mask)
      (net 2 GND))
  )

  (module fab-AYZ0102AGRLC (layer F.Cu) (tedit 200000) (tstamp 5E689BFE)
    (at 202.692 123.444 180)
    (path /5E6D17E8)
    (attr smd)
    (fp_text reference S2 (at -5.588 0) (layer F.SilkS)
      (effects (font (size 1.27 1.27) (thickness 0.1016)))
    )
    (fp_text value SLIDE-SWITCH (at 0.508 5.08) (layer F.SilkS)
      (effects (font (size 1.27 1.27) (thickness 0.1016)))
    )
    (fp_line (start -3.59918 1.4986) (end 3.59918 1.4986) (layer B.SilkS) (width 0.127))
    (fp_line (start 3.59918 1.4986) (end 3.59918 -1.4986) (layer B.SilkS) (width 0.127))
    (fp_line (start 3.59918 -1.4986) (end 1.4986 -1.4986) (layer B.SilkS) (width 0.127))
    (fp_line (start 1.4986 -1.4986) (end -1.4986 -1.4986) (layer B.SilkS) (width 0.127))
    (fp_line (start -1.4986 -1.4986) (end -3.59918 -1.4986) (layer B.SilkS) (width 0.127))
    (fp_line (start -3.59918 -1.4986) (end -3.59918 1.4986) (layer B.SilkS) (width 0.127))
    (fp_line (start 0 -1.59766) (end 0 -2.49936) (layer B.SilkS) (width 0.127))
    (fp_line (start 0 -2.49936) (end 1.4986 -2.49936) (layer B.SilkS) (width 0.127))
    (fp_line (start 1.4986 -2.49936) (end 1.4986 -1.4986) (layer B.SilkS) (width 0.127))
    (fp_circle (center -1.4986 -0.39878) (end -1.70942 -0.6096) (layer F.SilkS) (width 0.127))
    (fp_line (start -1.92278 -0.39878) (end -1.07442 -0.39878) (layer F.SilkS) (width 0.127))
    (fp_line (start -1.4986 0.02286) (end -1.4986 -0.82296) (layer F.SilkS) (width 0.127))
    (fp_circle (center 1.4986 -0.39878) (end 1.70942 -0.6096) (layer F.SilkS) (width 0.127))
    (fp_line (start 1.07442 -0.39878) (end 1.92278 -0.39878) (layer F.SilkS) (width 0.127))
    (fp_line (start 1.4986 0.02286) (end 1.4986 -0.82296) (layer F.SilkS) (width 0.127))
    (pad 1 smd rect (at 2.49936 2.2987 180) (size 0.99822 1.19888) (layers F.Cu F.Paste F.Mask)
      (net 40 "Net-(S2-Pad1)"))
    (pad 2 smd rect (at 0 2.2987 180) (size 0.99822 1.19888) (layers F.Cu F.Paste F.Mask)
      (net 41 PROG))
    (pad 3 smd rect (at -2.49936 2.2987 180) (size 0.99822 1.19888) (layers F.Cu F.Paste F.Mask)
      (net 2 GND))
  )

  (module fab-6MM_SWITCH (layer F.Cu) (tedit 200000) (tstamp 5E67E774)
    (at 153.416 85.09 90)
    (descr "OMRON SWITCH")
    (tags "OMRON SWITCH")
    (path /5E863EFD)
    (attr smd)
    (fp_text reference S3 (at 0.127 -4.318 90) (layer F.SilkS)
      (effects (font (size 1.27 1.27) (thickness 0.127)))
    )
    (fp_text value 6MM_SWITCH6MM_SWITCH (at -3.302 -13.208 90) (layer F.SilkS)
      (effects (font (size 1.27 1.27) (thickness 0.127)))
    )
    (fp_text user 4 (at 4.191 2.159 90) (layer B.SilkS)
      (effects (font (size 1.27 1.27) (thickness 0.127)))
    )
    (fp_text user 3 (at -3.937 2.159 90) (layer B.SilkS)
      (effects (font (size 1.27 1.27) (thickness 0.127)))
    )
    (fp_text user 2 (at 4.191 -2.159 90) (layer B.SilkS)
      (effects (font (size 1.27 1.27) (thickness 0.127)))
    )
    (fp_text user 1 (at -3.683 -2.286 90) (layer B.SilkS)
      (effects (font (size 1.27 1.27) (thickness 0.127)))
    )
    (fp_circle (center 0 0) (end -0.127 0.127) (layer B.SilkS) (width 0.0762))
    (fp_circle (center 0 0) (end -0.3175 0.3175) (layer F.SilkS) (width 0.0254))
    (fp_circle (center -2.159 -2.159) (end -2.413 -2.413) (layer F.SilkS) (width 0.0762))
    (fp_circle (center 2.159 -2.159) (end 2.413 -2.413) (layer F.SilkS) (width 0.0762))
    (fp_circle (center 2.159 2.032) (end 2.413 2.286) (layer F.SilkS) (width 0.0762))
    (fp_circle (center -2.159 2.159) (end -2.413 2.413) (layer F.SilkS) (width 0.0762))
    (fp_circle (center 0 0) (end -0.889 0.889) (layer B.SilkS) (width 0.0762))
    (fp_line (start -2.413 -0.508) (end -2.159 0.381) (layer F.SilkS) (width 0.1524))
    (fp_line (start -2.413 0.508) (end -2.413 1.27) (layer F.SilkS) (width 0.1524))
    (fp_line (start -2.413 -1.27) (end -2.413 -0.508) (layer F.SilkS) (width 0.1524))
    (fp_line (start 1.27 -2.286) (end -1.27 -2.286) (layer F.SilkS) (width 0.1524))
    (fp_line (start -1.27 2.159) (end 1.27 2.159) (layer F.SilkS) (width 0.1524))
    (fp_line (start -3.048 -0.762) (end -3.048 -1.016) (layer B.SilkS) (width 0.1524))
    (fp_line (start -3.048 0.762) (end -3.048 1.016) (layer B.SilkS) (width 0.1524))
    (fp_line (start 3.048 -0.762) (end 3.048 -1.016) (layer B.SilkS) (width 0.1524))
    (fp_line (start 3.048 0.762) (end 3.048 1.016) (layer B.SilkS) (width 0.1524))
    (fp_line (start 1.143 3.048) (end 2.159 3.048) (layer B.SilkS) (width 0.1524))
    (fp_line (start -1.27 3.048) (end 1.143 3.048) (layer B.SilkS) (width 0.1524))
    (fp_line (start -1.27 -3.048) (end -2.159 -3.048) (layer B.SilkS) (width 0.1524))
    (fp_line (start 1.27 -3.048) (end -1.27 -3.048) (layer B.SilkS) (width 0.1524))
    (fp_line (start 2.159 -3.048) (end 1.27 -3.048) (layer B.SilkS) (width 0.1524))
    (fp_line (start 2.54 -3.048) (end 2.159 -3.048) (layer F.SilkS) (width 0.1524))
    (fp_line (start -2.54 -3.048) (end -2.159 -3.048) (layer F.SilkS) (width 0.1524))
    (fp_line (start -2.159 3.048) (end -1.27 3.048) (layer B.SilkS) (width 0.1524))
    (fp_line (start -2.54 3.048) (end -2.159 3.048) (layer F.SilkS) (width 0.1524))
    (fp_line (start 2.54 3.048) (end 2.159 3.048) (layer F.SilkS) (width 0.1524))
    (fp_line (start -1.27 2.794) (end -1.27 3.048) (layer B.SilkS) (width 0.0508))
    (fp_line (start 1.143 2.794) (end 1.143 3.048) (layer B.SilkS) (width 0.0508))
    (fp_line (start 1.143 2.794) (end -1.27 2.794) (layer B.SilkS) (width 0.0508))
    (fp_line (start 1.27 -2.794) (end 1.27 -3.048) (layer B.SilkS) (width 0.0508))
    (fp_line (start 1.27 -2.794) (end -1.27 -2.794) (layer B.SilkS) (width 0.0508))
    (fp_line (start -1.27 -3.048) (end -1.27 -2.794) (layer B.SilkS) (width 0.0508))
    (fp_line (start -1.27 -1.27) (end 1.27 -1.27) (layer F.SilkS) (width 0.0508))
    (fp_line (start 1.27 1.27) (end 1.27 -1.27) (layer F.SilkS) (width 0.0508))
    (fp_line (start 1.27 1.27) (end -1.27 1.27) (layer F.SilkS) (width 0.0508))
    (fp_line (start -1.27 -1.27) (end -1.27 1.27) (layer F.SilkS) (width 0.0508))
    (fp_line (start -3.048 2.54) (end -3.048 1.016) (layer F.SilkS) (width 0.1524))
    (fp_line (start -2.54 3.048) (end -3.048 2.54) (layer F.SilkS) (width 0.1524))
    (fp_line (start -3.048 -2.54) (end -3.048 -1.016) (layer F.SilkS) (width 0.1524))
    (fp_line (start -2.54 -3.048) (end -3.048 -2.54) (layer F.SilkS) (width 0.1524))
    (fp_line (start 3.048 2.54) (end 3.048 1.016) (layer F.SilkS) (width 0.1524))
    (fp_line (start 2.54 3.048) (end 3.048 2.54) (layer F.SilkS) (width 0.1524))
    (fp_line (start 3.048 -2.54) (end 2.54 -3.048) (layer F.SilkS) (width 0.1524))
    (fp_line (start -3.048 0.762) (end -3.302 0.762) (layer B.SilkS) (width 0.1524))
    (fp_line (start -3.302 -0.762) (end -3.302 0.762) (layer B.SilkS) (width 0.1524))
    (fp_line (start -3.302 -0.762) (end -3.048 -0.762) (layer B.SilkS) (width 0.1524))
    (fp_line (start 3.048 -1.016) (end 3.048 -2.54) (layer F.SilkS) (width 0.1524))
    (fp_line (start 3.048 -0.762) (end 3.302 -0.762) (layer B.SilkS) (width 0.1524))
    (fp_line (start 3.302 0.762) (end 3.302 -0.762) (layer B.SilkS) (width 0.1524))
    (fp_line (start 3.302 0.762) (end 3.048 0.762) (layer B.SilkS) (width 0.1524))
    (pad 4 smd rect (at 3.302 2.286 90) (size 2.286 1.524) (layers F.Cu F.Paste F.Mask)
      (net 2 GND))
    (pad 3 smd rect (at -3.302 2.286 90) (size 2.286 1.524) (layers F.Cu F.Paste F.Mask)
      (net 2 GND))
    (pad 2 smd rect (at 3.302 -2.286 90) (size 2.286 1.524) (layers F.Cu F.Paste F.Mask)
      (net 23 BTN))
    (pad 1 smd rect (at -3.302 -2.286 90) (size 2.286 1.524) (layers F.Cu F.Paste F.Mask)
      (net 23 BTN))
  )

  (module Package_TO_SOT_SMD:SOT-223-3_TabPin2 (layer F.Cu) (tedit 5A02FF57) (tstamp 5E68CB3C)
    (at 201.676 89.002 90)
    (descr "module CMS SOT223 4 pins")
    (tags "CMS SOT")
    (path /5E7A3273)
    (attr smd)
    (fp_text reference U1 (at 0.102 -5.08 180) (layer F.SilkS)
      (effects (font (size 1 1) (thickness 0.15)))
    )
    (fp_text value LT1129-3.3_SOT223_copy (at 24.384 -11.176 90) (layer F.Fab)
      (effects (font (size 1 1) (thickness 0.15)))
    )
    (fp_text user %R (at 0 0) (layer F.Fab)
      (effects (font (size 0.8 0.8) (thickness 0.12)))
    )
    (fp_line (start 1.91 3.41) (end 1.91 2.15) (layer F.SilkS) (width 0.12))
    (fp_line (start 1.91 -3.41) (end 1.91 -2.15) (layer F.SilkS) (width 0.12))
    (fp_line (start 4.4 -3.6) (end -4.4 -3.6) (layer F.CrtYd) (width 0.05))
    (fp_line (start 4.4 3.6) (end 4.4 -3.6) (layer F.CrtYd) (width 0.05))
    (fp_line (start -4.4 3.6) (end 4.4 3.6) (layer F.CrtYd) (width 0.05))
    (fp_line (start -4.4 -3.6) (end -4.4 3.6) (layer F.CrtYd) (width 0.05))
    (fp_line (start -1.85 -2.35) (end -0.85 -3.35) (layer F.Fab) (width 0.1))
    (fp_line (start -1.85 -2.35) (end -1.85 3.35) (layer F.Fab) (width 0.1))
    (fp_line (start -1.85 3.41) (end 1.91 3.41) (layer F.SilkS) (width 0.12))
    (fp_line (start -0.85 -3.35) (end 1.85 -3.35) (layer F.Fab) (width 0.1))
    (fp_line (start -4.1 -3.41) (end 1.91 -3.41) (layer F.SilkS) (width 0.12))
    (fp_line (start -1.85 3.35) (end 1.85 3.35) (layer F.Fab) (width 0.1))
    (fp_line (start 1.85 -3.35) (end 1.85 3.35) (layer F.Fab) (width 0.1))
    (pad 2 smd rect (at 3.15 0 90) (size 2 3.8) (layers F.Cu F.Paste F.Mask)
      (net 1 3V3))
    (pad 2 smd rect (at -3.15 0 90) (size 2 1.5) (layers F.Cu F.Paste F.Mask)
      (net 1 3V3))
    (pad 3 smd rect (at -3.15 2.3 90) (size 2 1.5) (layers F.Cu F.Paste F.Mask)
      (net 3 "Net-(C2-Pad1)"))
    (pad 1 smd rect (at -3.15 -2.3 90) (size 2 1.5) (layers F.Cu F.Paste F.Mask)
      (net 2 GND))
    (model ${KISYS3DMOD}/Package_TO_SOT_SMD.3dshapes/SOT-223.wrl
      (at (xyz 0 0 0))
      (scale (xyz 1 1 1))
      (rotate (xyz 0 0 0))
    )
  )

  (module ESP32-footprints-Lib:ESP32-WROOM_FAB (layer F.Cu) (tedit 5E60E014) (tstamp 5E689C85)
    (at 183.65 104.11 180)
    (path /5E60F570)
    (fp_text reference U2 (at 1.786 15.718) (layer F.SilkS)
      (effects (font (size 1 1) (thickness 0.15)))
    )
    (fp_text value ESP32-WROOM (at 5.715 14.224) (layer F.Fab)
      (effects (font (size 1 1) (thickness 0.15)))
    )
    (fp_line (start -9 12.75) (end 9 12.75) (layer F.SilkS) (width 0.15))
    (fp_line (start -9 -12.75) (end 9 -12.75) (layer F.SilkS) (width 0.15))
    (fp_line (start -9 12.75) (end -9 -12.75) (layer F.SilkS) (width 0.15))
    (fp_line (start 9 12.75) (end 9 -12.75) (layer F.SilkS) (width 0.15))
    (fp_line (start -9 6.75) (end 9 6.75) (layer F.SilkS) (width 0.15))
    (fp_text user ESP32-WROOM (at -5.207 0.254 90) (layer F.SilkS)
      (effects (font (size 1 1) (thickness 0.15)))
    )
    (fp_circle (center 9.906 6.604) (end 10.033 6.858) (layer F.SilkS) (width 0.5))
    (fp_text user "Espressif Systems" (at -6.858 -0.889 90) (layer F.SilkS)
      (effects (font (size 1 1) (thickness 0.15)))
    )
    (pad 39 smd rect (at 0.3 -2.45 180) (size 6 6) (layers F.Cu F.Paste F.Mask)
      (net 2 GND))
    (pad 1 smd rect (at 9 5.25 180) (size 2.5 0.7) (layers F.Cu F.Paste F.Mask)
      (net 2 GND))
    (pad 2 smd rect (at 9 3.98 180) (size 2.5 0.7) (layers F.Cu F.Paste F.Mask)
      (net 1 3V3))
    (pad 3 smd rect (at 9 2.71 180) (size 2.5 0.7) (layers F.Cu F.Paste F.Mask)
      (net 39 RESET))
    (pad 4 smd rect (at 9 1.44 180) (size 2.5 0.7) (layers F.Cu F.Paste F.Mask)
      (net 23 BTN))
    (pad 5 smd rect (at 9 0.17 180) (size 2.5 0.7) (layers F.Cu F.Paste F.Mask)
      (net 13 "Net-(J1-Pad10)"))
    (pad 6 smd rect (at 9 -1.1 180) (size 2.5 0.7) (layers F.Cu F.Paste F.Mask)
      (net 12 "Net-(J1-Pad9)"))
    (pad 7 smd rect (at 9 -2.37 180) (size 2.5 0.7) (layers F.Cu F.Paste F.Mask)
      (net 11 "Net-(J1-Pad8)"))
    (pad 8 smd rect (at 9 -3.64 180) (size 2.5 0.7) (layers F.Cu F.Paste F.Mask)
      (net 10 "Net-(J1-Pad7)"))
    (pad 9 smd rect (at 9 -4.91 180) (size 2.5 0.7) (layers F.Cu F.Paste F.Mask)
      (net 9 "Net-(J1-Pad6)"))
    (pad 10 smd rect (at 9 -6.18 180) (size 2.5 0.7) (layers F.Cu F.Paste F.Mask)
      (net 8 "Net-(J1-Pad5)"))
    (pad 11 smd rect (at 9 -7.45 180) (size 2.5 0.7) (layers F.Cu F.Paste F.Mask)
      (net 7 "Net-(J1-Pad4)"))
    (pad 12 smd rect (at 9 -8.72 180) (size 2.5 0.7) (layers F.Cu F.Paste F.Mask)
      (net 6 "Net-(J1-Pad3)"))
    (pad 13 smd rect (at 9 -9.99 180) (size 2.5 0.7) (layers F.Cu F.Paste F.Mask)
      (net 5 "Net-(J1-Pad2)"))
    (pad 14 smd rect (at 9 -11.26 180) (size 2.5 0.7) (layers F.Cu F.Paste F.Mask)
      (net 4 "Net-(J1-Pad1)"))
    (pad 15 smd rect (at 5.715 -12.75 180) (size 0.7 2.5) (layers F.Cu F.Paste F.Mask)
      (net 2 GND))
    (pad 16 smd rect (at 4.445 -12.75 180) (size 0.7 2.5) (layers F.Cu F.Paste F.Mask)
      (net 22 "Net-(J2-Pad9)"))
    (pad 17 smd rect (at 3.175 -12.75 180) (size 0.7 2.5) (layers F.Cu F.Paste F.Mask)
      (net 21 "Net-(J2-Pad8)"))
    (pad 18 smd rect (at 1.905 -12.75 180) (size 0.7 2.5) (layers F.Cu F.Paste F.Mask)
      (net 20 "Net-(J2-Pad7)"))
    (pad 19 smd rect (at 0.635 -12.75 180) (size 0.7 2.5) (layers F.Cu F.Paste F.Mask)
      (net 19 "Net-(J2-Pad6)"))
    (pad 20 smd rect (at -0.635 -12.75 180) (size 0.7 2.5) (layers F.Cu F.Paste F.Mask)
      (net 18 "Net-(J2-Pad5)"))
    (pad 21 smd rect (at -1.905 -12.75 180) (size 0.7 2.5) (layers F.Cu F.Paste F.Mask)
      (net 17 "Net-(J2-Pad4)"))
    (pad 22 smd rect (at -3.175 -12.75 180) (size 0.7 2.5) (layers F.Cu F.Paste F.Mask)
      (net 16 "Net-(J2-Pad3)"))
    (pad 23 smd rect (at -4.445 -12.75 180) (size 0.7 2.5) (layers F.Cu F.Paste F.Mask)
      (net 15 "Net-(J2-Pad2)"))
    (pad 24 smd rect (at -5.715 -12.75 180) (size 0.7 2.5) (layers F.Cu F.Paste F.Mask)
      (net 14 "Net-(J2-Pad1)"))
    (pad 25 smd rect (at -9 -11.26 180) (size 2.5 0.7) (layers F.Cu F.Paste F.Mask)
      (net 41 PROG))
    (pad 26 smd rect (at -9 -9.99 180) (size 2.5 0.7) (layers F.Cu F.Paste F.Mask)
      (net 31 "Net-(J3-Pad13)"))
    (pad 27 smd rect (at -9 -8.72 180) (size 2.5 0.7) (layers F.Cu F.Paste F.Mask)
      (net 30 "Net-(J3-Pad12)"))
    (pad 28 smd rect (at -9 -7.45 180) (size 2.5 0.7) (layers F.Cu F.Paste F.Mask)
      (net 29 "Net-(J3-Pad11)"))
    (pad 29 smd rect (at -9 -6.18 180) (size 2.5 0.7) (layers F.Cu F.Paste F.Mask)
      (net 28 "Net-(J3-Pad10)"))
    (pad 30 smd rect (at -9 -4.91 180) (size 2.5 0.7) (layers F.Cu F.Paste F.Mask)
      (net 27 "Net-(J3-Pad9)"))
    (pad 31 smd rect (at -9 -3.64 180) (size 2.5 0.7) (layers F.Cu F.Paste F.Mask)
      (net 26 "Net-(J3-Pad8)"))
    (pad 32 smd rect (at -9 -2.37 180) (size 2.5 0.7) (layers F.Cu F.Paste F.Mask)
      (net 42 "Net-(U2-Pad32)"))
    (pad 33 smd rect (at -9 -1.1 180) (size 2.5 0.7) (layers F.Cu F.Paste F.Mask)
      (net 25 "Net-(J3-Pad7)"))
    (pad 34 smd rect (at -9 0.17 180) (size 2.5 0.7) (layers F.Cu F.Paste F.Mask)
      (net 35 TX))
    (pad 35 smd rect (at -9 1.44 180) (size 2.5 0.7) (layers F.Cu F.Paste F.Mask)
      (net 36 RX))
    (pad 36 smd rect (at -9 2.71 180) (size 2.5 0.7) (layers F.Cu F.Paste F.Mask)
      (net 24 "Net-(J3-Pad4)"))
    (pad 37 smd rect (at -9 3.98 180) (size 2.5 0.7) (layers F.Cu F.Paste F.Mask)
      (net 43 "Net-(J3-Pad3)"))
    (pad 38 smd rect (at -9 5.25 180) (size 2.5 0.7) (layers F.Cu F.Paste F.Mask)
      (net 2 GND))
  )

  (gr_line (start 192.6586 97.36) (end 192.6586 91.36) (layer Edge.Cuts) (width 0.12) (tstamp 5E6A1F76))
  (gr_line (start 192.65 97.36) (end 174.65 97.36) (layer Edge.Cuts) (width 0.12) (tstamp 5E6A111C))
  (gr_line (start 174.65 91.36) (end 192.65 91.36) (layer Edge.Cuts) (width 0.12))
  (gr_line (start 174.65 97.36) (end 174.65 91.36) (layer Edge.Cuts) (width 0.12))
  (gr_line (start 147.32 127) (end 147.32 77.47) (layer Edge.Cuts) (width 0.05) (tstamp 5E68E7EE))
  (gr_line (start 222.25 127) (end 147.32 127) (layer Edge.Cuts) (width 0.05))
  (gr_line (start 222.25 77.47) (end 222.25 127) (layer Edge.Cuts) (width 0.05))
  (gr_line (start 147.32 77.47) (end 222.25 77.47) (layer Edge.Cuts) (width 0.05))
  (gr_line (start 147.32 127) (end 147.32 77.47) (layer F.SilkS) (width 0.12) (tstamp 5E67DF5A))
  (gr_line (start 222.25 127) (end 147.32 127) (layer F.SilkS) (width 0.12) (tstamp 5E67DF63))
  (gr_line (start 222.25 77.47) (end 222.25 127) (layer F.SilkS) (width 0.12) (tstamp 5E67DF60))
  (gr_line (start 147.32 77.47) (end 222.25 77.47) (layer F.SilkS) (width 0.12) (tstamp 5E67DF5D))

  (segment (start 200.025 84.201) (end 201.676 85.852) (width 0.4) (layer F.Cu) (net 1))
  (segment (start 200.025 81.28) (end 200.025 84.201) (width 0.4) (layer F.Cu) (net 1))
  (segment (start 210.728501 87.976001) (end 210.848501 87.856001) (width 0.4) (layer F.Cu) (net 1))
  (segment (start 166.116 89.408) (end 169.164 89.408) (width 0.4) (layer F.Cu) (net 1))
  (segment (start 164.084 87.376) (end 166.116 89.408) (width 0.4) (layer F.Cu) (net 1))
  (segment (start 170.18 90.424) (end 170.18 100.076) (width 0.4) (layer F.Cu) (net 1))
  (segment (start 164.084 82.931) (end 164.084 87.376) (width 0.4) (layer F.Cu) (net 1))
  (segment (start 169.164 89.408) (end 170.18 90.424) (width 0.4) (layer F.Cu) (net 1))
  (segment (start 164.084 81.896) (end 164.084 82.931) (width 0.4) (layer F.Cu) (net 1))
  (segment (start 164.7 81.28) (end 164.084 81.896) (width 0.4) (layer F.Cu) (net 1))
  (segment (start 200.025 81.28) (end 164.7 81.28) (width 0.4) (layer F.Cu) (net 1))
  (segment (start 200.533 86.995) (end 201.676 85.852) (width 0.4) (layer F.Cu) (net 1))
  (segment (start 193.04 86.995) (end 200.533 86.995) (width 0.4) (layer F.Cu) (net 1))
  (segment (start 202.819 97.028) (end 202.819 95.631) (width 0.4) (layer F.Cu) (net 1))
  (segment (start 201.676 94.488) (end 201.676 92.152) (width 0.4) (layer F.Cu) (net 1))
  (segment (start 202.819 95.631) (end 201.676 94.488) (width 0.4) (layer F.Cu) (net 1))
  (segment (start 173 100.13) (end 174.65 100.13) (width 0.4) (layer F.Cu) (net 1))
  (segment (start 167.7765 100.13) (end 173 100.13) (width 0.4) (layer F.Cu) (net 1))
  (segment (start 166.4525 98.806) (end 167.7765 100.13) (width 0.4) (layer F.Cu) (net 1))
  (segment (start 165.1 98.806) (end 166.4525 98.806) (width 0.4) (layer F.Cu) (net 1))
  (segment (start 201.676 92.152) (end 201.676 89.789) (width 0.4) (layer F.Cu) (net 1))
  (segment (start 201.676 89.789) (end 202.565 88.9) (width 0.4) (layer F.Cu) (net 1))
  (segment (start 202.565 88.9) (end 207.645 88.9) (width 0.4) (layer F.Cu) (net 1))
  (segment (start 207.645 88.9) (end 207.645 88.265) (width 0.4) (layer F.Cu) (net 1))
  (segment (start 210.439502 88.265) (end 210.848501 87.856001) (width 0.4) (layer F.Cu) (net 1))
  (segment (start 207.645 88.265) (end 210.439502 88.265) (width 0.4) (layer F.Cu) (net 1))
  (segment (start 209.902499 83.855501) (end 210.848501 83.855501) (width 0.4) (layer F.Cu) (net 1))
  (segment (start 209.007001 82.960003) (end 209.902499 83.855501) (width 0.4) (layer F.Cu) (net 1))
  (segment (start 208.887001 78.393999) (end 209.007001 78.513999) (width 0.4) (layer F.Cu) (net 1))
  (segment (start 203.545499 78.393999) (end 208.887001 78.393999) (width 0.4) (layer F.Cu) (net 1))
  (segment (start 209.007001 78.513999) (end 209.007001 82.960003) (width 0.4) (layer F.Cu) (net 1))
  (segment (start 210.848501 83.855501) (end 210.848501 87.856001) (width 0.4) (layer F.Cu) (net 1))
  (segment (start 201.676 80.263498) (end 203.545499 78.393999) (width 0.4) (layer F.Cu) (net 1))
  (segment (start 201.676 85.852) (end 201.676 80.263498) (width 0.4) (layer F.Cu) (net 1))
  (segment (start 214.503 93.472) (end 216.408 93.472) (width 0.4) (layer F.Cu) (net 1))
  (segment (start 210.947 97.028) (end 214.503 93.472) (width 0.4) (layer F.Cu) (net 1))
  (segment (start 202.819 97.028) (end 210.947 97.028) (width 0.4) (layer F.Cu) (net 1))
  (segment (start 177.935 115.21) (end 177.935 116.86) (width 0.4) (layer F.Cu) (net 2))
  (segment (start 177.935 108.575) (end 177.935 115.21) (width 0.4) (layer F.Cu) (net 2))
  (segment (start 179.95 106.56) (end 177.935 108.575) (width 0.4) (layer F.Cu) (net 2))
  (segment (start 183.35 106.56) (end 179.95 106.56) (width 0.4) (layer F.Cu) (net 2))
  (segment (start 176.3 98.86) (end 174.65 98.86) (width 0.4) (layer F.Cu) (net 2))
  (segment (start 179.05 98.86) (end 176.3 98.86) (width 0.4) (layer F.Cu) (net 2))
  (segment (start 183.35 103.16) (end 179.05 98.86) (width 0.4) (layer F.Cu) (net 2))
  (segment (start 191 98.86) (end 192.65 98.86) (width 0.4) (layer F.Cu) (net 2))
  (segment (start 183.35 103.16) (end 187.65 98.86) (width 0.4) (layer F.Cu) (net 2))
  (segment (start 187.65 98.86) (end 191 98.86) (width 0.4) (layer F.Cu) (net 2))
  (segment (start 183.35 106.56) (end 183.35 103.16) (width 0.4) (layer F.Cu) (net 2))
  (segment (start 194.545857 119.945859) (end 201.171751 119.945859) (width 0.4) (layer F.Cu) (net 2))
  (segment (start 183.35 108.164998) (end 190.799999 115.614997) (width 0.4) (layer F.Cu) (net 2))
  (segment (start 183.35 106.56) (end 183.35 108.164998) (width 0.4) (layer F.Cu) (net 2))
  (segment (start 194.487998 119.888) (end 194.564 119.888) (width 0.4) (layer F.Cu) (net 2))
  (segment (start 190.799999 116.200001) (end 194.487998 119.888) (width 0.4) (layer F.Cu) (net 2))
  (segment (start 190.799999 115.614997) (end 190.799999 116.200001) (width 0.4) (layer F.Cu) (net 2))
  (segment (start 194.564 119.888) (end 194.545857 119.945859) (width 0.4) (layer F.Cu) (net 2))
  (segment (start 192.65 98.11) (end 192.65 98.86) (width 0.4) (layer F.Cu) (net 2))
  (segment (start 193.732 97.028) (end 192.65 98.11) (width 0.4) (layer F.Cu) (net 2))
  (segment (start 199.517 97.028) (end 193.732 97.028) (width 0.4) (layer F.Cu) (net 2))
  (segment (start 209.296 85.260002) (end 209.296 86.741) (width 0.4) (layer F.Cu) (net 2))
  (segment (start 207.772 83.736002) (end 209.296 85.260002) (width 0.4) (layer F.Cu) (net 2))
  (segment (start 155.702 81.788) (end 155.702 88.392) (width 0.4) (layer F.Cu) (net 2))
  (segment (start 173 98.86) (end 174.65 98.86) (width 0.4) (layer F.Cu) (net 2))
  (segment (start 172.212 89.897) (end 172.212 98.072) (width 0.4) (layer F.Cu) (net 2))
  (segment (start 172.212 98.072) (end 173 98.86) (width 0.4) (layer F.Cu) (net 2))
  (segment (start 168.929 86.614) (end 172.212 89.897) (width 0.4) (layer F.Cu) (net 2))
  (segment (start 167.386 86.614) (end 168.929 86.614) (width 0.4) (layer F.Cu) (net 2))
  (segment (start 188.8045 88.519) (end 189.6935 89.408) (width 0.4) (layer F.Cu) (net 2))
  (segment (start 187.452 88.519) (end 188.8045 88.519) (width 0.4) (layer F.Cu) (net 2))
  (segment (start 189.6935 89.408) (end 194.564 89.408) (width 0.4) (layer F.Cu) (net 2))
  (segment (start 197.308 92.152) (end 199.376 92.152) (width 0.4) (layer F.Cu) (net 2))
  (segment (start 194.564 89.408) (end 197.308 92.152) (width 0.4) (layer F.Cu) (net 2))
  (segment (start 199.376 96.887) (end 199.517 97.028) (width 0.4) (layer F.Cu) (net 2))
  (segment (start 199.376 92.152) (end 199.376 96.887) (width 0.4) (layer F.Cu) (net 2))
  (segment (start 199.376 92.152) (end 199.376 89.549) (width 0.4) (layer F.Cu) (net 2))
  (segment (start 199.376 89.549) (end 201.295 87.63) (width 0.4) (layer F.Cu) (net 2))
  (segment (start 207.9435 86.741) (end 209.296 86.741) (width 0.4) (layer F.Cu) (net 2))
  (segment (start 203.878002 87.63) (end 204.767002 86.741) (width 0.4) (layer F.Cu) (net 2))
  (segment (start 204.767002 86.741) (end 207.9435 86.741) (width 0.4) (layer F.Cu) (net 2))
  (segment (start 201.295 87.63) (end 203.878002 87.63) (width 0.4) (layer F.Cu) (net 2))
  (segment (start 207.772 83.736002) (end 207.772 81.28) (width 0.4) (layer F.Cu) (net 2))
  (segment (start 201.291751 120.065859) (end 201.291751 125.091751) (width 0.4) (layer F.Cu) (net 2))
  (segment (start 201.171751 119.945859) (end 201.291751 120.065859) (width 0.4) (layer F.Cu) (net 2))
  (segment (start 201.291751 125.091751) (end 201.93 125.73) (width 0.4) (layer F.Cu) (net 2))
  (segment (start 201.93 125.73) (end 205.105 125.73) (width 0.4) (layer F.Cu) (net 2))
  (segment (start 205.19136 125.64364) (end 205.19136 121.1453) (width 0.4) (layer F.Cu) (net 2))
  (segment (start 205.105 125.73) (end 205.19136 125.64364) (width 0.4) (layer F.Cu) (net 2))
  (segment (start 176.53 119.38) (end 171.1135 119.38) (width 0.4) (layer F.Cu) (net 2))
  (segment (start 177.935 117.975) (end 176.53 119.38) (width 0.4) (layer F.Cu) (net 2))
  (segment (start 177.935 116.86) (end 177.935 117.975) (width 0.4) (layer F.Cu) (net 2))
  (segment (start 171.1135 119.38) (end 171.1135 122.2565) (width 0.4) (layer F.Cu) (net 2))
  (segment (start 170.815 122.555) (end 169.291 122.555) (width 0.4) (layer F.Cu) (net 2))
  (segment (start 171.1135 122.2565) (end 170.815 122.555) (width 0.4) (layer F.Cu) (net 2))
  (segment (start 163.341 123.825) (end 164.611 125.095) (width 0.4) (layer F.Cu) (net 2))
  (segment (start 162.306 123.825) (end 163.341 123.825) (width 0.4) (layer F.Cu) (net 2))
  (segment (start 168.1035 125.095) (end 169.291 123.9075) (width 0.4) (layer F.Cu) (net 2))
  (segment (start 169.291 123.9075) (end 169.291 122.555) (width 0.4) (layer F.Cu) (net 2))
  (segment (start 164.611 125.095) (end 168.1035 125.095) (width 0.4) (layer F.Cu) (net 2))
  (segment (start 207.772 81.28) (end 203.327 81.28) (width 0.4) (layer F.Cu) (net 2))
  (segment (start 160.782 86.614) (end 158.496 86.614) (width 0.4) (layer F.Cu) (net 2))
  (segment (start 158.496 86.614) (end 158.496 87.884) (width 0.4) (layer F.Cu) (net 2))
  (segment (start 157.988 88.392) (end 155.702 88.392) (width 0.4) (layer F.Cu) (net 2))
  (segment (start 158.496 87.884) (end 157.988 88.392) (width 0.4) (layer F.Cu) (net 2))
  (segment (start 214.503 96.012) (end 216.408 96.012) (width 0.4) (layer F.Cu) (net 2))
  (segment (start 211.934499 98.580501) (end 214.503 96.012) (width 0.4) (layer F.Cu) (net 2))
  (segment (start 201.703999 98.580501) (end 211.934499 98.580501) (width 0.4) (layer F.Cu) (net 2))
  (segment (start 200.151498 97.028) (end 201.703999 98.580501) (width 0.4) (layer F.Cu) (net 2))
  (segment (start 199.517 97.028) (end 200.151498 97.028) (width 0.4) (layer F.Cu) (net 2))
  (segment (start 210.6485 90.043) (end 212.852 87.8395) (width 0.4) (layer F.Cu) (net 3))
  (segment (start 209.296 90.043) (end 210.6485 90.043) (width 0.4) (layer F.Cu) (net 3))
  (segment (start 203.976 90.752) (end 203.976 92.152) (width 0.4) (layer F.Cu) (net 3))
  (segment (start 204.685 90.043) (end 203.976 90.752) (width 0.4) (layer F.Cu) (net 3))
  (segment (start 209.296 90.043) (end 204.685 90.043) (width 0.4) (layer F.Cu) (net 3))
  (segment (start 212.852 87.503) (end 212.852 81.28) (width 0.4) (layer F.Cu) (net 3))
  (segment (start 212.852 87.8395) (end 212.852 87.503) (width 0.4) (layer F.Cu) (net 3))
  (segment (start 170.326 117.475) (end 169.291 117.475) (width 0.4) (layer F.Cu) (net 4))
  (segment (start 173.295 117.475) (end 170.326 117.475) (width 0.4) (layer F.Cu) (net 4))
  (segment (start 174.65 116.12) (end 173.295 117.475) (width 0.4) (layer F.Cu) (net 4))
  (segment (start 174.65 115.37) (end 174.65 116.12) (width 0.4) (layer F.Cu) (net 4))
  (segment (start 153.67 119.38) (end 151.13 119.38) (width 0.4) (layer F.Cu) (net 4))
  (segment (start 169.090999 115.922499) (end 157.127501 115.922499) (width 0.4) (layer F.Cu) (net 4))
  (segment (start 169.291 116.1225) (end 169.090999 115.922499) (width 0.4) (layer F.Cu) (net 4))
  (segment (start 157.127501 115.922499) (end 153.67 119.38) (width 0.4) (layer F.Cu) (net 4))
  (segment (start 169.291 117.475) (end 169.291 116.1225) (width 0.4) (layer F.Cu) (net 4))
  (segment (start 153.87 114.1) (end 174.65 114.1) (width 0.4) (layer F.Cu) (net 5))
  (segment (start 151.13 116.84) (end 153.87 114.1) (width 0.4) (layer F.Cu) (net 5))
  (segment (start 152.6 112.83) (end 151.13 114.3) (width 0.4) (layer F.Cu) (net 6))
  (segment (start 174.65 112.83) (end 152.6 112.83) (width 0.4) (layer F.Cu) (net 6))
  (segment (start 151.33 111.56) (end 151.13 111.76) (width 0.4) (layer F.Cu) (net 7))
  (segment (start 174.65 111.56) (end 151.33 111.56) (width 0.4) (layer F.Cu) (net 7))
  (segment (start 152.2 110.29) (end 151.13 109.22) (width 0.4) (layer F.Cu) (net 8))
  (segment (start 174.65 110.29) (end 152.2 110.29) (width 0.4) (layer F.Cu) (net 8))
  (segment (start 153.47 109.02) (end 151.13 106.68) (width 0.4) (layer F.Cu) (net 9))
  (segment (start 174.65 109.02) (end 153.47 109.02) (width 0.4) (layer F.Cu) (net 9))
  (segment (start 154.74 107.75) (end 151.13 104.14) (width 0.4) (layer F.Cu) (net 10))
  (segment (start 174.65 107.75) (end 154.74 107.75) (width 0.4) (layer F.Cu) (net 10))
  (segment (start 156.01 106.48) (end 151.13 101.6) (width 0.4) (layer F.Cu) (net 11))
  (segment (start 174.65 106.48) (end 156.01 106.48) (width 0.4) (layer F.Cu) (net 11))
  (segment (start 157.28 105.21) (end 151.13 99.06) (width 0.4) (layer F.Cu) (net 12))
  (segment (start 174.65 105.21) (end 157.28 105.21) (width 0.4) (layer F.Cu) (net 12))
  (segment (start 158.55 103.94) (end 151.13 96.52) (width 0.4) (layer F.Cu) (net 13))
  (segment (start 174.65 103.94) (end 158.55 103.94) (width 0.4) (layer F.Cu) (net 13))
  (segment (start 189.365 120.15) (end 193.675 124.46) (width 0.4) (layer F.Cu) (net 14))
  (segment (start 189.365 116.86) (end 189.365 120.15) (width 0.4) (layer F.Cu) (net 14))
  (segment (start 188.095 121.42) (end 191.135 124.46) (width 0.4) (layer F.Cu) (net 15))
  (segment (start 188.095 116.86) (end 188.095 121.42) (width 0.4) (layer F.Cu) (net 15))
  (segment (start 186.825 122.69) (end 188.595 124.46) (width 0.4) (layer F.Cu) (net 16))
  (segment (start 186.825 116.86) (end 186.825 122.69) (width 0.4) (layer F.Cu) (net 16))
  (segment (start 185.555 123.96) (end 186.055 124.46) (width 0.4) (layer F.Cu) (net 17))
  (segment (start 185.555 116.86) (end 185.555 123.96) (width 0.4) (layer F.Cu) (net 17))
  (segment (start 184.364999 123.610001) (end 183.515 124.46) (width 0.4) (layer F.Cu) (net 18))
  (segment (start 184.364999 118.589999) (end 184.364999 123.610001) (width 0.4) (layer F.Cu) (net 18))
  (segment (start 184.285 118.51) (end 184.364999 118.589999) (width 0.4) (layer F.Cu) (net 18))
  (segment (start 184.285 116.86) (end 184.285 118.51) (width 0.4) (layer F.Cu) (net 18))
  (segment (start 183.015 122.42) (end 180.975 124.46) (width 0.4) (layer F.Cu) (net 19))
  (segment (start 183.015 116.86) (end 183.015 122.42) (width 0.4) (layer F.Cu) (net 19))
  (segment (start 181.745 121.15) (end 178.435 124.46) (width 0.4) (layer F.Cu) (net 20))
  (segment (start 181.745 116.86) (end 181.745 121.15) (width 0.4) (layer F.Cu) (net 20))
  (segment (start 180.475 119.88) (end 180.475 116.86) (width 0.4) (layer F.Cu) (net 21))
  (segment (start 175.895 124.46) (end 180.475 119.88) (width 0.4) (layer F.Cu) (net 21))
  (segment (start 179.205 118.61) (end 179.205 116.86) (width 0.4) (layer F.Cu) (net 22))
  (segment (start 173.355 124.46) (end 179.205 118.61) (width 0.4) (layer F.Cu) (net 22))
  (segment (start 172.505001 125.309999) (end 173.355 124.46) (width 0.4) (layer F.Cu) (net 22))
  (segment (start 171.91999 125.89501) (end 172.505001 125.309999) (width 0.4) (layer F.Cu) (net 22))
  (segment (start 161.708508 125.89501) (end 171.91999 125.89501) (width 0.4) (layer F.Cu) (net 22))
  (segment (start 160.401 124.587502) (end 161.708508 125.89501) (width 0.4) (layer F.Cu) (net 22))
  (segment (start 160.401 120.015) (end 160.401 124.587502) (width 0.4) (layer F.Cu) (net 22))
  (segment (start 159.82 102.67) (end 151.13 93.98) (width 0.4) (layer F.Cu) (net 23))
  (segment (start 174.65 102.67) (end 159.82 102.67) (width 0.4) (layer F.Cu) (net 23))
  (segment (start 151.13 93.98) (end 151.13 88.392) (width 0.4) (layer F.Cu) (net 23))
  (segment (start 151.13 81.788) (end 151.13 88.392) (width 0.4) (layer F.Cu) (net 23))
  (segment (start 151.13 81.788) (end 151.13 78.74) (width 0.4) (layer F.Cu) (net 23))
  (segment (start 151.13 78.74) (end 158.75 78.74) (width 0.4) (layer F.Cu) (net 23))
  (segment (start 159.639 79.629) (end 164.084 79.629) (width 0.4) (layer F.Cu) (net 23))
  (segment (start 158.75 78.74) (end 159.639 79.629) (width 0.4) (layer F.Cu) (net 23))
  (segment (start 216.1 101.4) (end 216.408 101.092) (width 0.4) (layer F.Cu) (net 24))
  (segment (start 192.65 101.4) (end 216.1 101.4) (width 0.4) (layer F.Cu) (net 24))
  (segment (start 212.906 105.21) (end 216.408 108.712) (width 0.4) (layer F.Cu) (net 25))
  (segment (start 192.65 105.21) (end 212.906 105.21) (width 0.4) (layer F.Cu) (net 25))
  (segment (start 212.906 107.75) (end 216.408 111.252) (width 0.4) (layer F.Cu) (net 26))
  (segment (start 192.65 107.75) (end 212.906 107.75) (width 0.4) (layer F.Cu) (net 26))
  (segment (start 215.558001 112.942001) (end 216.408 113.792) (width 0.4) (layer F.Cu) (net 27))
  (segment (start 211.636 109.02) (end 215.558001 112.942001) (width 0.4) (layer F.Cu) (net 27))
  (segment (start 192.65 109.02) (end 211.636 109.02) (width 0.4) (layer F.Cu) (net 27))
  (segment (start 210.366 110.29) (end 216.408 116.332) (width 0.4) (layer F.Cu) (net 28))
  (segment (start 192.65 110.29) (end 210.366 110.29) (width 0.4) (layer F.Cu) (net 28))
  (segment (start 209.096 111.56) (end 216.408 118.872) (width 0.4) (layer F.Cu) (net 29))
  (segment (start 192.65 111.56) (end 209.096 111.56) (width 0.4) (layer F.Cu) (net 29))
  (segment (start 192.65 112.83) (end 208.915999 112.83) (width 0.4) (layer F.Cu) (net 30))
  (segment (start 215.558001 120.562001) (end 216.408 121.412) (width 0.4) (layer F.Cu) (net 30))
  (segment (start 214.957999 119.961999) (end 215.558001 120.562001) (width 0.4) (layer F.Cu) (net 30))
  (segment (start 214.957999 118.872) (end 214.957999 119.961999) (width 0.4) (layer F.Cu) (net 30))
  (segment (start 208.915999 112.83) (end 214.957999 118.872) (width 0.4) (layer F.Cu) (net 30))
  (segment (start 206.556 114.1) (end 216.408 123.952) (width 0.4) (layer F.Cu) (net 31))
  (segment (start 192.65 114.1) (end 206.556 114.1) (width 0.4) (layer F.Cu) (net 31))
  (segment (start 187.452 84.182) (end 187.452 85.217) (width 0.4) (layer F.Cu) (net 32))
  (segment (start 187.941 83.693) (end 187.452 84.182) (width 0.4) (layer F.Cu) (net 32))
  (segment (start 193.04 83.693) (end 187.941 83.693) (width 0.4) (layer F.Cu) (net 32))
  (segment (start 157.969 123.825) (end 159.004 123.825) (width 0.4) (layer F.Cu) (net 33))
  (segment (start 157.099 122.955) (end 157.969 123.825) (width 0.4) (layer F.Cu) (net 33))
  (segment (start 157.099 120.015) (end 157.099 122.955) (width 0.4) (layer F.Cu) (net 33))
  (segment (start 214.176 103.94) (end 216.408 106.172) (width 0.4) (layer F.Cu) (net 35))
  (segment (start 192.65 103.94) (end 214.176 103.94) (width 0.4) (layer F.Cu) (net 35))
  (segment (start 219.167001 79.529999) (end 219.167001 87.722001) (width 0.4) (layer F.Cu) (net 35))
  (segment (start 215.392 81.28) (end 215.392 80.834998) (width 0.4) (layer F.Cu) (net 35))
  (segment (start 219.167001 87.722001) (end 220.345 88.9) (width 0.4) (layer F.Cu) (net 35))
  (segment (start 220.345 88.9) (end 220.345 106.045) (width 0.4) (layer F.Cu) (net 35))
  (segment (start 220.218 106.172) (end 216.408 106.172) (width 0.4) (layer F.Cu) (net 35))
  (segment (start 220.345 106.045) (end 220.218 106.172) (width 0.4) (layer F.Cu) (net 35))
  (segment (start 215.392 79.61) (end 216.262 78.74) (width 0.4) (layer F.Cu) (net 35))
  (segment (start 215.392 81.28) (end 215.392 79.61) (width 0.4) (layer F.Cu) (net 35))
  (segment (start 218.377002 78.74) (end 219.167001 79.529999) (width 0.4) (layer F.Cu) (net 35))
  (segment (start 216.262 78.74) (end 218.377002 78.74) (width 0.4) (layer F.Cu) (net 35))
  (segment (start 215.446 102.67) (end 216.408 103.632) (width 0.4) (layer F.Cu) (net 36))
  (segment (start 192.65 102.67) (end 215.446 102.67) (width 0.4) (layer F.Cu) (net 36))
  (segment (start 217.932 81.28) (end 217.932 89.408) (width 0.4) (layer F.Cu) (net 36))
  (segment (start 217.932 89.408) (end 219.075 90.551) (width 0.4) (layer F.Cu) (net 36))
  (segment (start 219.075 90.551) (end 219.075 103.505) (width 0.4) (layer F.Cu) (net 36))
  (segment (start 218.948 103.632) (end 216.408 103.632) (width 0.4) (layer F.Cu) (net 36))
  (segment (start 219.075 103.505) (end 218.948 103.632) (width 0.4) (layer F.Cu) (net 36))
  (segment (start 165.989 117.475) (end 165.989 122.555) (width 0.4) (layer F.Cu) (net 38))
  (segment (start 160.782 92.348) (end 160.782 91.186) (width 0.4) (layer F.Cu) (net 39))
  (segment (start 160.782 100.076502) (end 160.782 92.348) (width 0.4) (layer F.Cu) (net 39))
  (segment (start 162.105498 101.4) (end 160.782 100.076502) (width 0.4) (layer F.Cu) (net 39))
  (segment (start 174.65 101.4) (end 162.105498 101.4) (width 0.4) (layer F.Cu) (net 39))
  (segment (start 162.325 91.186) (end 160.782 91.186) (width 0.4) (layer F.Cu) (net 39))
  (segment (start 165.1 91.44) (end 165.1 95.504) (width 0.4) (layer F.Cu) (net 39))
  (segment (start 165.354 91.186) (end 165.1 91.44) (width 0.4) (layer F.Cu) (net 39))
  (segment (start 167.386 91.186) (end 165.354 91.186) (width 0.4) (layer F.Cu) (net 39))
  (segment (start 165.354 91.186) (end 160.782 91.186) (width 0.4) (layer F.Cu) (net 39))
  (segment (start 202.692 118.237) (end 202.692 121.1453) (width 0.4) (layer F.Cu) (net 41))
  (segment (start 199.825 115.37) (end 202.692 118.237) (width 0.4) (layer F.Cu) (net 41))
  (segment (start 192.65 115.37) (end 199.825 115.37) (width 0.4) (layer F.Cu) (net 41))
  (segment (start 214.83 100.13) (end 216.408 98.552) (width 0.4) (layer F.Cu) (net 43))
  (segment (start 192.65 100.13) (end 214.83 100.13) (width 0.4) (layer F.Cu) (net 43))

)
