;HEADER
;Start_gcode
G21                     ; Set to metric [change to G20 if you want Imperial]
G90                     ; Force coordinates to be absolute relative to the origin
G28                     ; Home X/Y/Z axis
M117 Printing...
;ENDHEADER
;Layer # 
G0 X419.27 Y301.36 Z50.00 F2500 
G1 X419.27 Y301.36 Z1.00 F3000 
G1 X397.01 Y315.57 Z1.00 F3000 
G1 X406.66 Y340.15 Z1.00 F3000 
G1 X380.30 Y338.57 Z1.00 F3000 
G1 X373.66 Y364.13 Z1.00 F3000 
G1 X353.27 Y347.36 Z1.00 F3000 
G1 X332.87 Y364.13 Z1.00 F3000 
G1 X326.23 Y338.57 Z1.00 F3000 
G1 X299.87 Y340.15 Z1.00 F3000 
G1 X309.52 Y315.57 Z1.00 F3000 
G1 X287.27 Y301.36 Z1.00 F3000 
G1 X309.52 Y287.14 Z1.00 F3000 
G1 X299.87 Y262.56 Z1.00 F3000 
G1 X326.23 Y264.14 Z1.00 F3000 
G1 X332.87 Y238.59 Z1.00 F3000 
G1 X353.27 Y255.36 Z1.00 F3000 
G1 X373.66 Y238.59 Z1.00 F3000 
G1 X380.30 Y264.14 Z1.00 F3000 
G1 X406.66 Y262.56 Z1.00 F3000 
G1 X397.01 Y287.14 Z1.00 F3000 
G1 X419.27 Y301.36 Z1.00 F3000 
G0 X419.27 Y301.36 Z50.00 F2500 
G0 X419.27 Y301.36 Z50.00 F2500 
G1 X419.27 Y301.36 Z1.00 F3000 
G1 X470.25 Y339.37 Z1.00 F3000 
G1 X406.66 Y340.15 Z1.00 F3000 
G1 X425.56 Y400.87 Z1.00 F3000 
G1 X373.66 Y364.13 Z1.00 F3000 
G1 X353.27 Y424.36 Z1.00 F3000 
G1 X332.87 Y364.13 Z1.00 F3000 
G1 X280.97 Y400.87 Z1.00 F3000 
G1 X299.87 Y340.15 Z1.00 F3000 
G1 X236.29 Y339.37 Z1.00 F3000 
G1 X287.27 Y301.36 Z1.00 F3000 
G1 X236.29 Y263.35 Z1.00 F3000 
G1 X299.87 Y262.56 Z1.00 F3000 
G1 X280.97 Y201.85 Z1.00 F3000 
G1 X332.87 Y238.59 Z1.00 F3000 
G1 X353.27 Y178.36 Z1.00 F3000 
G1 X373.66 Y238.59 Z1.00 F3000 
G1 X425.56 Y201.85 Z1.00 F3000 
G1 X406.66 Y262.56 Z1.00 F3000 
G1 X470.25 Y263.35 Z1.00 F3000 
G1 X419.27 Y301.36 Z1.00 F3000 
G0 X419.27 Y301.36 Z50.00 F2500 
G0 X532.27 Y301.36 Z50.00 F2500 
G1 X532.27 Y301.36 Z1.00 F3000 
G1 X519.55 Y336.70 Z1.00 F3000 
G1 X470.25 Y339.37 Z1.00 F3000 
G1 X508.57 Y370.50 Z1.00 F3000 
G1 X498.08 Y406.57 Z1.00 F3000 
G1 X467.02 Y427.69 Z1.00 F3000 
G1 X425.56 Y400.87 Z1.00 F3000 
G1 X438.27 Y448.58 Z1.00 F3000 
G1 X408.58 Y471.60 Z1.00 F3000 
G1 X371.03 Y470.43 Z1.00 F3000 
G1 X353.27 Y424.36 Z1.00 F3000 
G1 X335.50 Y470.43 Z1.00 F3000 
G1 X297.95 Y471.60 Z1.00 F3000 
G1 X268.27 Y448.58 Z1.00 F3000 
G1 X280.97 Y400.87 Z1.00 F3000 
G1 X239.51 Y427.69 Z1.00 F3000 
G1 X208.45 Y406.57 Z1.00 F3000 
G1 X197.96 Y370.50 Z1.00 F3000 
G1 X236.29 Y339.37 Z1.00 F3000 
G1 X186.98 Y336.70 Z1.00 F3000 
G1 X174.27 Y301.36 Z1.00 F3000 
G1 X186.98 Y266.01 Z1.00 F3000 
G1 X236.29 Y263.35 Z1.00 F3000 
G1 X197.96 Y232.21 Z1.00 F3000 
G1 X208.45 Y196.14 Z1.00 F3000 
G1 X239.51 Y175.02 Z1.00 F3000 
G1 X280.97 Y201.85 Z1.00 F3000 
G1 X268.27 Y154.13 Z1.00 F3000 
G1 X297.95 Y131.12 Z1.00 F3000 
G1 X335.50 Y132.29 Z1.00 F3000 
G1 X353.27 Y178.36 Z1.00 F3000 
G1 X371.03 Y132.29 Z1.00 F3000 
G1 X408.58 Y131.12 Z1.00 F3000 
G1 X438.27 Y154.13 Z1.00 F3000 
G1 X425.56 Y201.85 Z1.00 F3000 
G1 X467.02 Y175.02 Z1.00 F3000 
G1 X498.08 Y196.14 Z1.00 F3000 
G1 X508.57 Y232.21 Z1.00 F3000 
G1 X470.25 Y263.35 Z1.00 F3000 
G1 X519.55 Y266.01 Z1.00 F3000 
G1 X532.27 Y301.36 Z1.00 F3000 
G0 X532.27 Y301.36 Z50.00 F2500 
G0 X532.27 Y301.36 Z50.00 F2500 
G1 X532.27 Y301.36 Z1.00 F3000 
G1 X543.48 Y363.16 Z1.00 F3000 
G1 X498.08 Y406.57 Z1.00 F3000 
G1 X470.82 Y463.16 Z1.00 F3000 
G1 X408.58 Y471.60 Z1.00 F3000 
G1 X353.27 Y501.36 Z1.00 F3000 
G1 X297.95 Y471.60 Z1.00 F3000 
G1 X235.71 Y463.16 Z1.00 F3000 
G1 X208.45 Y406.57 Z1.00 F3000 
G1 X163.05 Y363.16 Z1.00 F3000 
G1 X174.27 Y301.36 Z1.00 F3000 
G1 X163.05 Y239.55 Z1.00 F3000 
G1 X208.45 Y196.14 Z1.00 F3000 
G1 X235.71 Y139.55 Z1.00 F3000 
G1 X297.95 Y131.12 Z1.00 F3000 
G1 X353.27 Y101.36 Z1.00 F3000 
G1 X408.58 Y131.12 Z1.00 F3000 
G1 X470.82 Y139.55 Z1.00 F3000 
G1 X498.08 Y196.14 Z1.00 F3000 
G1 X543.48 Y239.55 Z1.00 F3000 
G1 X532.27 Y301.36 Z1.00 F3000 
G0 X532.27 Y301.36 Z50.00 F2500 
G0 X603.27 Y301.36 Z50.00 F2500 
G1 X603.27 Y301.36 Z1.00 F3000 
G1 X543.48 Y363.16 Z1.00 F3000 
G1 X555.52 Y448.30 Z1.00 F3000 
G1 X470.82 Y463.16 Z1.00 F3000 
G1 X430.52 Y539.12 Z1.00 F3000 
G1 X353.27 Y501.36 Z1.00 F3000 
G1 X276.01 Y539.12 Z1.00 F3000 
G1 X235.71 Y463.16 Z1.00 F3000 
G1 X151.01 Y448.30 Z1.00 F3000 
G1 X163.05 Y363.16 Z1.00 F3000 
G1 X103.27 Y301.36 Z1.00 F3000 
G1 X163.05 Y239.55 Z1.00 F3000 
G1 X151.01 Y154.41 Z1.00 F3000 
G1 X235.71 Y139.55 Z1.00 F3000 
G1 X276.01 Y63.59 Z1.00 F3000 
G1 X353.27 Y101.36 Z1.00 F3000 
G1 X430.52 Y63.59 Z1.00 F3000 
G1 X470.82 Y139.55 Z1.00 F3000 
G1 X555.52 Y154.41 Z1.00 F3000 
G1 X543.48 Y239.55 Z1.00 F3000 
G1 X603.27 Y301.36 Z1.00 F3000 
G0 X603.27 Y301.36 Z50.00 F2500 
;FOOTER
; end_gcode
G28 X Y
G0 Z100 				; HOME
G90                             ; absolute positioning
;ENDFOOTER
