%!PS-Adobe-3.0
%%Creator: Rhinoceros
%%Title: (origamiSructure.AI)
%%BoundingBox: 22 245 542 515
%%DocumentProcessColors: Black
%%DocumentNeededResources: procset Adobe_packedarray 2.0 0
%%+ procset Adobe_cmykcolor 1.1 0
%%+ procset Adobe_cshow 1.1 0
%%+ procset Adobe_customcolor 1.0 0
%%+ procset Adobe_typography_AI3 1.0 0
%%+ procset Adobe_IllustratorA_AI3 1.0 0
%AI3_ColorUsage: Color
%AI3_TemplateBox: 288 384 288 384
%AI3_TileBox: 0 0 576 768
%AI3_DocumentPreview: None
%%Template:
%%PageOrigin:0 0
%%EndComments
%%BeginProlog
%%IncludeResource: procset Adobe_packedarray 2.0 0
Adobe_packedarray /initialize get exec
%%IncludeResource: procset Adobe_cmykcolor 1.1 0
%%IncludeResource: procset Adobe_cshow 1.1 0
%%IncludeResource: procset Adobe_customcolor 1.0 0
%%IncludeResource: procset Adobe_typography_AI3 1.0 0
%%IncludeResource: procset Adobe_IllustratorA_AI3 1.0 0
%%EndProlog
%%BeginSetup
Adobe_cmykcolor /initialize get exec
Adobe_cshow /initialize get exec
Adobe_customcolor /initialize get exec
Adobe_typography_AI3 /initialize get exec
Adobe_IllustratorA_AI3 /initialize get exec
%%EndSetup
%AI5_BeginLayer
1 1 1 1 0 0 -1 0 0 0 Lb
(Default) Ln
0 A
0 R
0.0000 0.0000 0.0000 XA
0.0000 0.0000 0.0000 Xa
0 i 1 J 1 j 1.0000 w 4 M []0 d
0 D
108.7770 472.4983 m
115.8465 466.9033 122.9160 466.9033 129.9855 472.4983 c
124.3905 465.4288 124.3905 458.3593 129.9855 451.2898 C
S
0.0000 0.0000 0.0000 XA
0.0000 0.0000 0.0000 Xa
0 i 1 J 1 j 1.0000 w 4 M []0 d
0 D
87.5685 493.7068 m
94.6380 499.3018 101.7075 499.3018 108.7770 493.7068 c
108.7770 500.7763 108.7770 507.8458 108.7770 514.9153 c
103.1820 507.8458 103.1820 500.7763 108.7770 493.7068 C
S
0.0000 0.0000 0.0000 XA
0.0000 0.0000 0.0000 Xa
0 i 1 J 1 j 1.0000 w 4 M []0 d
0 D
112.9732 514.9153 m
112.9732 511.3805 111.5745 507.8458 108.7770 504.3110 c
115.8465 504.3110 122.9160 504.3110 129.9855 504.3110 C
S
0.0000 0.0000 0.0000 XA
0.0000 0.0000 0.0000 Xa
0 i 1 J 1 j 1.0000 w 4 M []0 d
0 D
76.9642 461.8940 m
84.0337 467.4890 91.1032 467.4890 98.1727 461.8940 c
98.1727 472.4983 98.1727 483.1025 98.1727 493.7068 c
103.7677 486.6373 103.7677 479.5678 98.1727 472.4983 c
108.7770 472.4983 119.3812 472.4983 129.9855 472.4983 c
129.9855 458.3593 129.9855 444.2203 129.9855 430.0813 c
126.4507 430.0813 122.9160 430.0813 119.3812 430.0813 c
124.9762 437.1508 124.9762 444.2203 119.3812 451.2898 C
S
0.0000 0.0000 0.0000 XA
0.0000 0.0000 0.0000 Xa
0 i 1 J 1 j 1.0000 w 4 M []0 d
0 D
34.5472 493.7068 m
41.6167 499.3018 48.6862 499.3018 55.7557 493.7068 c
55.7557 500.7763 55.7557 507.8458 55.7557 514.9153 c
50.1607 507.8458 50.1607 500.7763 55.7557 493.7068 C
S
0.0000 0.0000 0.0000 XA
0.0000 0.0000 0.0000 Xa
0 i 1 J 1 j 1.0000 w 4 M []0 d
0 D
59.9520 514.9153 m
59.9520 511.3805 58.5532 507.8458 55.7557 504.3110 c
66.3600 504.3110 76.9642 504.3110 87.5685 504.3110 c
81.9735 497.2415 81.9735 490.1720 87.5685 483.1025 C
S
0.0000 0.0000 0.0000 XA
0.0000 0.0000 0.0000 Xa
0 i 1 J 1 j 1.0000 w 4 M []0 d
0 D
34.5472 483.1025 m
28.9522 490.1720 28.9522 497.2415 34.5472 504.3110 c
31.0125 504.3110 27.4777 504.3110 23.9430 504.3110 c
23.9430 490.1720 23.9430 476.0330 23.9430 461.8940 c
34.5472 461.8940 45.1515 461.8940 55.7557 461.8940 c
50.1607 454.8245 50.1607 447.7550 55.7557 440.6855 C
S
0.0000 0.0000 0.0000 XA
0.0000 0.0000 0.0000 Xa
0 i 1 J 1 j 1.0000 w 4 M []0 d
0 D
66.3600 472.4983 m
60.7650 479.5678 60.7650 486.6373 66.3600 493.7068 c
55.7557 493.7068 45.1515 493.7068 34.5472 493.7068 c
40.1422 500.7763 40.1422 507.8458 34.5472 514.9153 c
41.6167 509.3203 48.6862 509.3203 55.7557 514.9153 C
S
0.0000 0.0000 0.0000 XA
0.0000 0.0000 0.0000 Xa
0 i 1 J 1 j 1.0000 w 4 M []0 d
0 D
55.7557 504.3110 m
62.8252 509.9060 69.8947 509.9060 76.9642 504.3110 c
76.9642 507.8458 76.9642 511.3805 76.9642 514.9153 c
62.8252 514.9153 48.6862 514.9153 34.5472 514.9153 c
34.5472 504.3110 34.5472 493.7068 34.5472 483.1025 c
31.0125 485.9000 27.4777 487.2988 23.9430 487.2988 C
S
0.0000 0.0000 0.0000 XA
0.0000 0.0000 0.0000 Xa
0 i 1 J 1 j 1.0000 w 4 M []0 d
0 D
45.1515 472.4983 m
50.7465 479.5678 50.7465 486.6373 45.1515 493.7068 c
45.1515 483.1025 45.1515 472.4983 45.1515 461.8940 c
38.0820 467.4890 31.0125 467.4890 23.9430 461.8940 c
29.5380 468.9635 29.5380 476.0330 23.9430 483.1025 c
31.0125 483.1025 38.0820 483.1025 45.1515 483.1025 c
39.5565 476.0330 39.5565 468.9635 45.1515 461.8940 C
S
0.0000 0.0000 0.0000 XA
0.0000 0.0000 0.0000 Xa
0 i 1 J 1 j 1.0000 w 4 M []0 d
0 D
66.3600 483.1025 m
73.4295 488.6975 80.4990 488.6975 87.5685 483.1025 c
87.5685 493.7068 87.5685 504.3110 87.5685 514.9153 c
93.1635 507.8458 93.1635 500.7763 87.5685 493.7068 c
98.1727 493.7068 108.7770 493.7068 119.3812 493.7068 C
S
0.0000 0.0000 0.0000 XA
0.0000 0.0000 0.0000 Xa
0 i 1 J 1 j 1.0000 w 4 M []0 d
0 D
98.1727 461.8940 m
92.5777 468.9635 92.5777 476.0330 98.1727 483.1025 c
87.5685 483.1025 76.9642 483.1025 66.3600 483.1025 c
71.9550 490.1720 71.9550 497.2415 66.3600 504.3110 c
66.3600 493.7068 66.3600 483.1025 66.3600 472.4983 c
59.2905 478.0933 52.2210 478.0933 45.1515 472.4983 c
55.7557 472.4983 66.3600 472.4983 76.9642 472.4983 c
71.3692 465.4288 71.3692 458.3593 76.9642 451.2898 C
S
0.0000 0.0000 0.0000 XA
0.0000 0.0000 0.0000 Xa
0 i 1 J 1 j 1.0000 w 4 M []0 d
0 D
269.3222 419.4770 m
258.7179 408.8728 L
248.1137 419.4770 L
248.1137 408.8728 L
269.3222 408.8728 L
269.3222 419.4770 L
237.5094 419.4770 L
258.7179 440.6855 L
226.9052 440.6855 L
248.1137 461.8940 L
216.3009 461.8940 L
237.5094 483.1025 L
205.6967 483.1025 L
226.9052 504.3110 L
195.0924 504.3110 L
205.6967 514.9153 L
216.3009 504.3110 L
216.3009 514.9153 L
173.8839 514.9153 L
173.8839 483.1025 L
163.2797 493.7068 L
173.8839 504.3110 L
163.2797 504.3110 L
163.2797 461.8940 L
195.0924 461.8940 L
173.8839 440.6855 L
205.6967 440.6855 L
184.4882 419.4770 L
216.3009 419.4770 L
205.6967 408.8728 L
195.0924 419.4770 L
195.0924 408.8728 L
237.5094 408.8728 L
237.5094 440.6855 L
258.7179 419.4770 L
258.7179 451.2898 L
269.3222 440.6855 L
258.7179 430.0813 L
269.3222 430.0813 L
269.3222 472.4983 L
S
0.0000 0.0000 0.0000 XA
0.0000 0.0000 0.0000 Xa
0 i 1 J 1 j 1.0000 w 4 M []0 d
0 D
98.1727 493.7068 m
105.2422 488.1118 112.3117 488.1118 119.3812 493.7068 c
113.7862 486.6373 113.7862 479.5678 119.3812 472.4983 C
S
0.0000 0.0000 0.0000 XA
0.0000 0.0000 0.0000 Xa
0 i 1 J 1 j 1.0000 w 4 M []0 d
0 D
173.8839 430.0813 m
173.8839 461.8940 L
195.0924 440.6855 L
195.0924 472.4983 L
216.3009 451.2898 L
216.3009 483.1025 L
237.5094 461.8940 L
237.5094 493.7068 L
258.7179 472.4983 L
258.7179 504.3110 L
269.3222 493.7068 L
258.7179 483.1025 L
269.3222 483.1025 L
269.3222 514.9153 L
226.9052 514.9153 L
248.1137 493.7068 L
248.1137 514.9153 L
226.9052 493.7068 L
258.7179 493.7068 L
237.5094 472.4983 L
269.3222 472.4983 L
248.1137 451.2898 L
269.3222 451.2898 L
248.1137 472.4983 L
248.1137 440.6855 L
226.9052 461.8940 L
226.9052 430.0813 L
205.6967 451.2898 L
205.6967 419.4770 L
184.4882 440.6855 L
184.4882 408.8728 L
163.2797 408.8728 L
163.2797 451.2898 L
173.8839 451.2898 L
163.2797 440.6855 L
173.8839 430.0813 L
s
0.0000 0.0000 0.0000 XA
0.0000 0.0000 0.0000 Xa
0 i 1 J 1 j 1.0000 w 4 M []0 d
0 D
173.8839 514.9153 m
195.0924 493.7068 L
195.0924 514.9153 L
173.8839 493.7068 L
205.6967 493.7068 L
184.4882 472.4983 L
216.3009 472.4983 L
195.0924 451.2898 L
226.9052 451.2898 L
205.6967 430.0813 L
237.5094 430.0813 L
216.3009 408.8728 L
216.3009 430.0813 L
237.5094 408.8728 L
S
0.0000 0.0000 0.0000 XA
0.0000 0.0000 0.0000 Xa
0 i 1 J 1 j 1.0000 w 4 M []0 d
0 D
248.1137 504.3110 m
258.7179 514.9153 L
269.3222 504.3110 L
248.1137 504.3110 L
s
0.0000 0.0000 0.0000 XA
0.0000 0.0000 0.0000 Xa
0 i 1 J 1 j 1.0000 w 4 M []0 d
0 D
98.1727 472.4983 m
105.2422 478.0933 112.3117 478.0933 119.3812 472.4983 c
119.3812 483.1025 119.3812 493.7068 119.3812 504.3110 c
122.9160 501.5135 126.4507 500.1148 129.9855 500.1148 C
S
0.0000 0.0000 0.0000 XA
0.0000 0.0000 0.0000 Xa
0 i 1 J 1 j 1.0000 w 4 M []0 d
0 D
98.1727 419.4770 m
105.2422 425.0720 112.3117 425.0720 119.3812 419.4770 c
119.3812 430.0813 119.3812 440.6855 119.3812 451.2898 c
122.9160 448.4923 126.4507 447.0935 129.9855 447.0935 C
S
0.0000 0.0000 0.0000 XA
0.0000 0.0000 0.0000 Xa
0 i 1 J 1 j 1.0000 w 4 M []0 d
0 D
163.2797 408.8728 m
184.4882 430.0813 L
163.2797 430.0813 L
184.4882 408.8728 L
S
0.0000 0.0000 0.0000 XA
0.0000 0.0000 0.0000 Xa
0 i 1 J 1 j 1.0000 w 4 M []0 d
0 D
125.7892 514.9153 m
125.7892 511.3805 127.1880 507.8458 129.9855 504.3110 c
122.9160 509.9060 115.8465 509.9060 108.7770 504.3110 C
S
0.0000 0.0000 0.0000 XA
0.0000 0.0000 0.0000 Xa
0 i 1 J 1 j 1.0000 w 4 M []0 d
0 D
163.2797 461.8940 m
184.4882 483.1025 L
163.2797 483.1025 L
184.4882 461.8940 L
184.4882 493.7068 L
205.6967 472.4983 L
205.6967 504.3110 L
226.9052 483.1025 L
226.9052 514.9153 L
S
0.0000 0.0000 0.0000 XA
0.0000 0.0000 0.0000 Xa
0 i 1 J 1 j 1.0000 w 4 M []0 d
0 D
119.3812 504.3110 m
124.9762 497.2415 124.9762 490.1720 119.3812 483.1025 c
122.9160 483.1025 126.4507 483.1025 129.9855 483.1025 c
129.9855 493.7068 129.9855 504.3110 129.9855 514.9153 c
115.8465 514.9153 101.7075 514.9153 87.5685 514.9153 c
94.6380 509.3203 101.7075 509.3203 108.7770 514.9153 C
S
0.0000 0.0000 0.0000 XA
0.0000 0.0000 0.0000 Xa
0 i 1 J 1 j 1.0000 w 4 M []0 d
0 D
23.9430 434.2775 m
27.4777 434.2775 31.0125 432.8788 34.5472 430.0813 c
34.5472 440.6855 34.5472 451.2898 34.5472 461.8940 c
40.1422 454.8245 40.1422 447.7550 34.5472 440.6855 c
45.1515 440.6855 55.7557 440.6855 66.3600 440.6855 c
60.7650 433.6160 60.7650 426.5465 66.3600 419.4770 C
S
0.0000 0.0000 0.0000 XA
0.0000 0.0000 0.0000 Xa
0 i 1 J 1 j 1.0000 w 4 M []0 d
0 D
55.7557 451.2898 m
62.8252 456.8848 69.8947 456.8848 76.9642 451.2898 c
76.9642 461.8940 76.9642 472.4983 76.9642 483.1025 c
82.5592 476.0330 82.5592 468.9635 76.9642 461.8940 c
87.5685 461.8940 98.1727 461.8940 108.7770 461.8940 c
103.1820 454.8245 103.1820 447.7550 108.7770 440.6855 C
S
0.0000 0.0000 0.0000 XA
0.0000 0.0000 0.0000 Xa
0 i 1 J 1 j 1.0000 w 4 M []0 d
0 D
34.5472 440.6855 m
41.6167 446.2805 48.6862 446.2805 55.7557 440.6855 c
55.7557 451.2898 55.7557 461.8940 55.7557 472.4983 c
61.3507 465.4288 61.3507 458.3593 55.7557 451.2898 c
66.3600 451.2898 76.9642 451.2898 87.5685 451.2898 c
81.9735 444.2203 81.9735 437.1508 87.5685 430.0813 C
S
0.0000 0.0000 0.0000 XA
0.0000 0.0000 0.0000 Xa
0 i 1 J 1 j 1.0000 w 4 M []0 d
0 D
45.1515 419.4770 m
52.2210 425.0720 59.2905 425.0720 66.3600 419.4770 c
66.3600 430.0813 66.3600 440.6855 66.3600 451.2898 c
71.9550 444.2203 71.9550 437.1508 66.3600 430.0813 c
76.9642 430.0813 87.5685 430.0813 98.1727 430.0813 c
92.5777 423.0118 92.5777 415.9423 98.1727 408.8728 c
91.1032 414.4678 84.0337 414.4678 76.9642 408.8728 C
S
0.0000 0.0000 0.0000 XA
0.0000 0.0000 0.0000 Xa
0 i 1 J 1 j 1.0000 w 4 M []0 d
0 D
66.3600 430.0813 m
73.4295 435.6763 80.4990 435.6763 87.5685 430.0813 c
87.5685 440.6855 87.5685 451.2898 87.5685 461.8940 c
93.1635 454.8245 93.1635 447.7550 87.5685 440.6855 c
98.1727 440.6855 108.7770 440.6855 119.3812 440.6855 c
113.7862 433.6160 113.7862 426.5465 119.3812 419.4770 C
S
0.0000 0.0000 0.0000 XA
0.0000 0.0000 0.0000 Xa
0 i 1 J 1 j 1.0000 w 4 M []0 d
0 D
87.5685 440.6855 m
94.6380 446.2805 101.7075 446.2805 108.7770 440.6855 c
108.7770 451.2898 108.7770 461.8940 108.7770 472.4983 c
114.3720 465.4288 114.3720 458.3593 108.7770 451.2898 c
115.8465 451.2898 122.9160 451.2898 129.9855 451.2898 c
122.9160 456.8848 115.8465 456.8848 108.7770 451.2898 C
S
0.0000 0.0000 0.0000 XA
0.0000 0.0000 0.0000 Xa
0 i 1 J 1 j 1.0000 w 4 M []0 d
0 D
76.9642 430.0813 m
76.9642 423.0118 76.9642 415.9423 76.9642 408.8728 c
82.5592 415.9423 82.5592 423.0118 76.9642 430.0813 C
s
0.0000 0.0000 0.0000 XA
0.0000 0.0000 0.0000 Xa
0 i 1 J 1 j 1.0000 w 4 M []0 d
0 D
76.9642 419.4770 m
69.8947 413.8821 62.8252 413.8821 55.7557 419.4770 c
55.7557 415.9423 55.7557 412.4075 55.7557 408.8728 c
69.8947 408.8728 84.0337 408.8728 98.1727 408.8728 c
98.1727 419.4770 98.1727 430.0813 98.1727 440.6855 c
103.7677 433.6160 103.7677 426.5465 98.1727 419.4770 c
108.7770 419.4770 119.3812 419.4770 129.9855 419.4770 c
129.9855 415.9423 129.9855 412.4075 129.9855 408.8728 c
122.9160 408.8728 115.8465 408.8728 108.7770 408.8728 c
108.7770 412.4075 108.7770 415.9423 108.7770 419.4770 c
115.8465 413.8821 122.9160 413.8821 129.9855 419.4770 c
127.1880 415.9423 125.7892 412.4075 125.7892 408.8728 C
S
0.0000 0.0000 0.0000 XA
0.0000 0.0000 0.0000 Xa
0 i 1 J 1 j 1.0000 w 4 M []0 d
0 D
23.9430 430.0813 m
31.0125 430.0813 38.0820 430.0813 45.1515 430.0813 c
39.5565 423.0118 39.5565 415.9423 45.1515 408.8728 c
38.0820 414.4678 31.0125 414.4678 23.9430 408.8728 c
29.5380 415.9423 29.5380 423.0118 23.9430 430.0813 C
s
0.0000 0.0000 0.0000 XA
0.0000 0.0000 0.0000 Xa
0 i 1 J 1 j 1.0000 w 4 M []0 d
0 D
34.5472 430.0813 m
28.9522 437.1508 28.9522 444.2203 34.5472 451.2898 c
31.0125 451.2898 27.4777 451.2898 23.9430 451.2898 c
23.9430 437.1508 23.9430 423.0118 23.9430 408.8728 c
31.0125 408.8728 38.0820 408.8728 45.1515 408.8728 c
45.1515 419.4770 45.1515 430.0813 45.1515 440.6855 c
50.7465 433.6160 50.7465 426.5465 45.1515 419.4770 c
55.7557 419.4770 66.3600 419.4770 76.9642 419.4770 c
74.1667 415.9423 72.7680 412.4075 72.7680 408.8728 C
S
0.0000 0.0000 0.0000 XA
0.0000 0.0000 0.0000 Xa
0 i 1 J 1 j 1.0000 w 4 M []0 d
0 D
129.9855 434.2775 m
126.4507 434.2775 122.9160 432.8788 119.3812 430.0813 C
S
0.0000 0.0000 0.0000 XA
0.0000 0.0000 0.0000 Xa
0 i 1 J 1 j 1.0000 w 4 M []0 d
0 D
59.9520 408.8728 m
59.9520 412.4075 58.5532 415.9423 55.7557 419.4770 C
S
0.0000 0.0000 0.0000 XA
0.0000 0.0000 0.0000 Xa
0 i 1 J 1 j 1.0000 w 4 M []0 d
0 D
112.9732 408.8728 m
112.9732 412.4075 111.5745 415.9423 108.7770 419.4770 C
S
0.0000 0.0000 0.0000 XA
0.0000 0.0000 0.0000 Xa
0 i 1 J 1 j 1.0000 w 4 M []0 d
0 D
23.9430 447.0935 m
27.4777 447.0935 31.0125 448.4923 34.5472 451.2898 C
S
0.0000 0.0000 0.0000 XA
0.0000 0.0000 0.0000 Xa
0 i 1 J 1 j 1.0000 w 4 M []0 d
0 D
23.9430 500.1148 m
27.4777 500.1148 31.0125 501.5135 34.5472 504.3110 C
S
0.0000 0.0000 0.0000 XA
0.0000 0.0000 0.0000 Xa
0 i 1 J 1 j 1.0000 w 4 M []0 d
0 D
129.9855 487.2988 m
126.4507 487.2988 122.9160 485.9000 119.3812 483.1025 C
S
0.0000 0.0000 0.0000 XA
0.0000 0.0000 0.0000 Xa
0 i 1 J 1 j 1.0000 w 4 M []0 d
0 D
72.7680 514.9153 m
72.7680 511.3805 74.1667 507.8458 76.9642 504.3110 C
S
0.0000 0.0000 0.0000 XA
0.0000 0.0000 0.0000 Xa
0 i 1 J 1 j 1.0000 w 4 M []0 d
0 D
23.9430 430.0813 m
31.0125 424.4863 38.0820 424.4863 45.1515 430.0813 C
S
0.0000 0.0000 0.0000 XA
0.0000 0.0000 0.0000 Xa
0 i 1 J 1 j 1.0000 w 4 M []0 d
0 D
98.1727 440.6855 m
105.2422 435.0906 112.3117 435.0906 119.3812 440.6855 C
S
0.0000 0.0000 0.0000 XA
0.0000 0.0000 0.0000 Xa
0 i 1 J 1 j 1.0000 w 4 M []0 d
0 D
76.9642 430.0813 m
84.0337 424.4863 91.1032 424.4863 98.1727 430.0813 C
S
0.0000 0.0000 0.0000 XA
0.0000 0.0000 0.0000 Xa
0 i 1 J 1 j 1.0000 w 4 M []0 d
0 D
45.1515 440.6855 m
52.2210 435.0906 59.2905 435.0906 66.3600 440.6855 C
S
0.0000 0.0000 0.0000 XA
0.0000 0.0000 0.0000 Xa
0 i 1 J 1 j 1.0000 w 4 M []0 d
0 D
23.9430 483.1025 m
31.0125 477.5076 38.0820 477.5076 45.1515 483.1025 C
S
0.0000 0.0000 0.0000 XA
0.0000 0.0000 0.0000 Xa
0 i 1 J 1 j 1.0000 w 4 M []0 d
0 D
34.5472 461.8940 m
41.6167 456.2991 48.6862 456.2991 55.7557 461.8940 C
S
0.0000 0.0000 0.0000 XA
0.0000 0.0000 0.0000 Xa
0 i 1 J 1 j 1.0000 w 4 M []0 d
0 D
87.5685 461.8940 m
94.6380 456.2991 101.7075 456.2991 108.7770 461.8940 C
S
0.0000 0.0000 0.0000 XA
0.0000 0.0000 0.0000 Xa
0 i 1 J 1 j 1.0000 w 4 M []0 d
0 D
66.3600 451.2898 m
73.4295 445.6948 80.4990 445.6948 87.5685 451.2898 C
S
0.0000 0.0000 0.0000 XA
0.0000 0.0000 0.0000 Xa
0 i 1 J 1 j 1.0000 w 4 M []0 d
0 D
76.9642 483.1025 m
84.0337 477.5076 91.1032 477.5076 98.1727 483.1025 C
S
0.0000 0.0000 0.0000 XA
0.0000 0.0000 0.0000 Xa
0 i 1 J 1 j 1.0000 w 4 M []0 d
0 D
55.7557 472.4983 m
62.8252 466.9033 69.8947 466.9033 76.9642 472.4983 C
S
0.0000 0.0000 0.0000 XA
0.0000 0.0000 0.0000 Xa
0 i 1 J 1 j 1.0000 w 4 M []0 d
0 D
66.3600 504.3110 m
73.4295 498.7161 80.4990 498.7161 87.5685 504.3110 C
S
0.0000 0.0000 0.0000 XA
0.0000 0.0000 0.0000 Xa
0 i 1 J 1 j 1.0000 w 4 M []0 d
0 D
45.1515 493.7068 m
52.2210 488.1118 59.2905 488.1118 66.3600 493.7068 C
S
0.0000 0.0000 0.0000 XA
0.0000 0.0000 0.0000 Xa
0 i 1 J 1 j 1.0000 w 4 M []0 d
0 D
531.3349 514.9153 m
531.3349 408.8728 L
S
0.0000 0.0000 0.0000 XA
0.0000 0.0000 0.0000 Xa
0 i 1 J 1 j 1.0000 w 4 M []0 d
0 D
510.1264 514.9153 m
510.1264 408.8728 L
S
0.0000 0.0000 0.0000 XA
0.0000 0.0000 0.0000 Xa
0 i 1 J 1 j 1.0000 w 4 M []0 d
0 D
488.9179 514.9153 m
488.9179 408.8728 L
S
0.0000 0.0000 0.0000 XA
0.0000 0.0000 0.0000 Xa
0 i 1 J 1 j 1.0000 w 4 M []0 d
0 D
467.7094 514.9153 m
467.7094 408.8728 L
S
0.0000 0.0000 0.0000 XA
0.0000 0.0000 0.0000 Xa
0 i 1 J 1 j 1.0000 w 4 M []0 d
0 D
446.5009 514.9153 m
446.5009 408.8728 L
S
0.0000 0.0000 0.0000 XA
0.0000 0.0000 0.0000 Xa
0 i 1 J 1 j 1.0000 w 4 M []0 d
0 D
531.3349 451.2898 m
520.7307 440.6855 L
531.3349 430.0813 L
541.9392 440.6855 L
531.3349 451.2898 L
s
0.0000 0.0000 0.0000 XA
0.0000 0.0000 0.0000 Xa
0 i 1 J 1 j 1.0000 w 4 M []0 d
0 D
510.1264 451.2898 m
499.5222 440.6855 L
510.1264 430.0813 L
520.7307 440.6855 L
510.1264 451.2898 L
s
0.0000 0.0000 0.0000 XA
0.0000 0.0000 0.0000 Xa
0 i 1 J 1 j 1.0000 w 4 M []0 d
0 D
488.9179 451.2898 m
478.3137 440.6855 L
488.9179 430.0813 L
499.5222 440.6855 L
488.9179 451.2898 L
s
0.0000 0.0000 0.0000 XA
0.0000 0.0000 0.0000 Xa
0 i 1 J 1 j 1.0000 w 4 M []0 d
0 D
467.7094 451.2898 m
457.1052 440.6855 L
467.7094 430.0813 L
478.3137 440.6855 L
467.7094 451.2898 L
s
0.0000 0.0000 0.0000 XA
0.0000 0.0000 0.0000 Xa
0 i 1 J 1 j 1.0000 w 4 M []0 d
0 D
446.5009 451.2898 m
435.8967 440.6855 L
446.5009 430.0813 L
457.1052 440.6855 L
446.5009 451.2898 L
s
0.0000 0.0000 0.0000 XA
0.0000 0.0000 0.0000 Xa
0 i 1 J 1 j 1.0000 w 4 M []0 d
0 D
531.3349 493.7068 m
520.7307 483.1025 L
531.3349 472.4983 L
541.9392 483.1025 L
531.3349 493.7068 L
s
0.0000 0.0000 0.0000 XA
0.0000 0.0000 0.0000 Xa
0 i 1 J 1 j 1.0000 w 4 M []0 d
0 D
510.1264 493.7068 m
499.5222 483.1025 L
510.1264 472.4983 L
520.7307 483.1025 L
510.1264 493.7068 L
s
0.0000 0.0000 0.0000 XA
0.0000 0.0000 0.0000 Xa
0 i 1 J 1 j 1.0000 w 4 M []0 d
0 D
488.9179 493.7068 m
478.3137 483.1025 L
488.9179 472.4983 L
499.5222 483.1025 L
488.9179 493.7068 L
s
0.0000 0.0000 0.0000 XA
0.0000 0.0000 0.0000 Xa
0 i 1 J 1 j 1.0000 w 4 M []0 d
0 D
467.7094 493.7068 m
457.1052 483.1025 L
467.7094 472.4983 L
478.3137 483.1025 L
467.7094 493.7068 L
s
0.0000 0.0000 0.0000 XA
0.0000 0.0000 0.0000 Xa
0 i 1 J 1 j 1.0000 w 4 M []0 d
0 D
435.8967 408.8728 m
457.1052 430.0813 L
S
0.0000 0.0000 0.0000 XA
0.0000 0.0000 0.0000 Xa
0 i 1 J 1 j 1.0000 w 4 M []0 d
0 D
435.8967 430.0813 m
457.1052 408.8728 L
S
0.0000 0.0000 0.0000 XA
0.0000 0.0000 0.0000 Xa
0 i 1 J 1 j 1.0000 w 4 M []0 d
0 D
520.7307 408.8728 m
541.9392 430.0813 L
S
0.0000 0.0000 0.0000 XA
0.0000 0.0000 0.0000 Xa
0 i 1 J 1 j 1.0000 w 4 M []0 d
0 D
520.7307 430.0813 m
541.9392 408.8728 L
S
0.0000 0.0000 0.0000 XA
0.0000 0.0000 0.0000 Xa
0 i 1 J 1 j 1.0000 w 4 M []0 d
0 D
499.5222 408.8728 m
520.7307 430.0813 L
S
0.0000 0.0000 0.0000 XA
0.0000 0.0000 0.0000 Xa
0 i 1 J 1 j 1.0000 w 4 M []0 d
0 D
499.5222 430.0813 m
520.7307 408.8728 L
S
0.0000 0.0000 0.0000 XA
0.0000 0.0000 0.0000 Xa
0 i 1 J 1 j 1.0000 w 4 M []0 d
0 D
478.3137 408.8728 m
499.5222 430.0813 L
S
0.0000 0.0000 0.0000 XA
0.0000 0.0000 0.0000 Xa
0 i 1 J 1 j 1.0000 w 4 M []0 d
0 D
478.3137 430.0813 m
499.5222 408.8728 L
S
0.0000 0.0000 0.0000 XA
0.0000 0.0000 0.0000 Xa
0 i 1 J 1 j 1.0000 w 4 M []0 d
0 D
457.1052 408.8728 m
478.3137 430.0813 L
S
0.0000 0.0000 0.0000 XA
0.0000 0.0000 0.0000 Xa
0 i 1 J 1 j 1.0000 w 4 M []0 d
0 D
457.1052 430.0813 m
478.3137 408.8728 L
S
0.0000 0.0000 0.0000 XA
0.0000 0.0000 0.0000 Xa
0 i 1 J 1 j 1.0000 w 4 M []0 d
0 D
435.8967 451.2898 m
457.1052 472.4983 L
S
0.0000 0.0000 0.0000 XA
0.0000 0.0000 0.0000 Xa
0 i 1 J 1 j 1.0000 w 4 M []0 d
0 D
435.8967 472.4983 m
457.1052 451.2898 L
S
0.0000 0.0000 0.0000 XA
0.0000 0.0000 0.0000 Xa
0 i 1 J 1 j 1.0000 w 4 M []0 d
0 D
520.7307 451.2898 m
541.9392 472.4983 L
S
0.0000 0.0000 0.0000 XA
0.0000 0.0000 0.0000 Xa
0 i 1 J 1 j 1.0000 w 4 M []0 d
0 D
520.7307 472.4983 m
541.9392 451.2898 L
S
0.0000 0.0000 0.0000 XA
0.0000 0.0000 0.0000 Xa
0 i 1 J 1 j 1.0000 w 4 M []0 d
0 D
499.5222 451.2898 m
520.7307 472.4983 L
S
0.0000 0.0000 0.0000 XA
0.0000 0.0000 0.0000 Xa
0 i 1 J 1 j 1.0000 w 4 M []0 d
0 D
499.5222 472.4983 m
520.7307 451.2898 L
S
0.0000 0.0000 0.0000 XA
0.0000 0.0000 0.0000 Xa
0 i 1 J 1 j 1.0000 w 4 M []0 d
0 D
478.3137 451.2898 m
499.5222 472.4983 L
S
0.0000 0.0000 0.0000 XA
0.0000 0.0000 0.0000 Xa
0 i 1 J 1 j 1.0000 w 4 M []0 d
0 D
478.3137 472.4983 m
499.5222 451.2898 L
S
0.0000 0.0000 0.0000 XA
0.0000 0.0000 0.0000 Xa
0 i 1 J 1 j 1.0000 w 4 M []0 d
0 D
457.1052 451.2898 m
478.3137 472.4983 L
S
0.0000 0.0000 0.0000 XA
0.0000 0.0000 0.0000 Xa
0 i 1 J 1 j 1.0000 w 4 M []0 d
0 D
457.1052 472.4983 m
478.3137 451.2898 L
S
0.0000 0.0000 0.0000 XA
0.0000 0.0000 0.0000 Xa
0 i 1 J 1 j 1.0000 w 4 M []0 d
0 D
520.7307 493.7068 m
541.9392 514.9153 L
S
0.0000 0.0000 0.0000 XA
0.0000 0.0000 0.0000 Xa
0 i 1 J 1 j 1.0000 w 4 M []0 d
0 D
520.7307 514.9153 m
541.9392 493.7068 L
S
0.0000 0.0000 0.0000 XA
0.0000 0.0000 0.0000 Xa
0 i 1 J 1 j 1.0000 w 4 M []0 d
0 D
499.5222 493.7068 m
520.7307 514.9153 L
S
0.0000 0.0000 0.0000 XA
0.0000 0.0000 0.0000 Xa
0 i 1 J 1 j 1.0000 w 4 M []0 d
0 D
499.5222 514.9153 m
520.7307 493.7068 L
S
0.0000 0.0000 0.0000 XA
0.0000 0.0000 0.0000 Xa
0 i 1 J 1 j 1.0000 w 4 M []0 d
0 D
478.3137 493.7068 m
499.5222 514.9153 L
S
0.0000 0.0000 0.0000 XA
0.0000 0.0000 0.0000 Xa
0 i 1 J 1 j 1.0000 w 4 M []0 d
0 D
478.3137 514.9153 m
499.5222 493.7068 L
S
0.0000 0.0000 0.0000 XA
0.0000 0.0000 0.0000 Xa
0 i 1 J 1 j 1.0000 w 4 M []0 d
0 D
457.1052 493.7068 m
478.3137 514.9153 L
S
0.0000 0.0000 0.0000 XA
0.0000 0.0000 0.0000 Xa
0 i 1 J 1 j 1.0000 w 4 M []0 d
0 D
457.1052 514.9153 m
478.3137 493.7068 L
S
0.0000 0.0000 0.0000 XA
0.0000 0.0000 0.0000 Xa
0 i 1 J 1 j 1.0000 w 4 M []0 d
0 D
446.5009 493.7068 m
435.8967 483.1025 L
446.5009 472.4983 L
457.1052 483.1025 L
446.5009 493.7068 L
s
0.0000 0.0000 0.0000 XA
0.0000 0.0000 0.0000 Xa
0 i 1 J 1 j 1.0000 w 4 M []0 d
0 D
435.8967 493.7068 m
457.1052 514.9153 L
S
0.0000 0.0000 0.0000 XA
0.0000 0.0000 0.0000 Xa
0 i 1 J 1 j 1.0000 w 4 M []0 d
0 D
435.8967 514.9153 m
457.1052 493.7068 L
S
0.0000 0.0000 0.0000 XA
0.0000 0.0000 0.0000 Xa
0 i 1 J 1 j 1.0000 w 4 M []0 d
0 D
541.9392 514.9153 m
541.9392 408.8728 L
S
0.0000 0.0000 0.0000 XA
0.0000 0.0000 0.0000 Xa
0 i 1 J 1 j 1.0000 w 4 M []0 d
0 D
520.7307 514.9153 m
520.7307 408.8728 L
S
0.0000 0.0000 0.0000 XA
0.0000 0.0000 0.0000 Xa
0 i 1 J 1 j 1.0000 w 4 M []0 d
0 D
499.5222 514.9153 m
499.5222 408.8728 L
S
0.0000 0.0000 0.0000 XA
0.0000 0.0000 0.0000 Xa
0 i 1 J 1 j 1.0000 w 4 M []0 d
0 D
478.3137 514.9153 m
478.3137 408.8728 L
S
0.0000 0.0000 0.0000 XA
0.0000 0.0000 0.0000 Xa
0 i 1 J 1 j 1.0000 w 4 M []0 d
0 D
457.1052 514.9153 m
457.1052 408.8728 L
S
0.0000 0.0000 0.0000 XA
0.0000 0.0000 0.0000 Xa
0 i 1 J 1 j 1.0000 w 4 M []0 d
0 D
435.8967 408.8728 m
541.9392 408.8728 L
S
0.0000 0.0000 0.0000 XA
0.0000 0.0000 0.0000 Xa
0 i 1 J 1 j 1.0000 w 4 M []0 d
0 D
435.8967 430.0813 m
541.9392 430.0813 L
S
0.0000 0.0000 0.0000 XA
0.0000 0.0000 0.0000 Xa
0 i 1 J 1 j 1.0000 w 4 M []0 d
0 D
435.8967 451.2898 m
541.9392 451.2898 L
S
0.0000 0.0000 0.0000 XA
0.0000 0.0000 0.0000 Xa
0 i 1 J 1 j 1.0000 w 4 M []0 d
0 D
435.8967 472.4983 m
541.9392 472.4983 L
S
0.0000 0.0000 0.0000 XA
0.0000 0.0000 0.0000 Xa
0 i 1 J 1 j 1.0000 w 4 M []0 d
0 D
435.8967 493.7068 m
541.9392 493.7068 L
S
0.0000 0.0000 0.0000 XA
0.0000 0.0000 0.0000 Xa
0 i 1 J 1 j 1.0000 w 4 M []0 d
0 D
435.8967 514.9153 m
435.8967 408.8728 L
S
0.0000 0.0000 0.0000 XA
0.0000 0.0000 0.0000 Xa
0 i 1 J 1 j 1.0000 w 4 M []0 d
0 D
435.8967 514.9153 m
541.9392 514.9153 L
S
0.0000 0.0000 0.0000 XA
0.0000 0.0000 0.0000 Xa
0 i 1 J 1 j 1.0000 w 4 M []0 d
0 D
320.3631 419.4770 m
352.1759 430.0813 L
383.9886 419.4770 L
352.1759 408.8728 L
320.3631 419.4770 L
s
0.0000 0.0000 0.0000 XA
0.0000 0.0000 0.0000 Xa
0 i 1 J 1 j 1.0000 w 4 M []0 d
0 D
320.3631 440.6855 m
352.1759 451.2898 L
383.9886 440.6855 L
352.1759 430.0813 L
320.3631 440.6855 L
s
0.0000 0.0000 0.0000 XA
0.0000 0.0000 0.0000 Xa
0 i 1 J 1 j 1.0000 w 4 M []0 d
0 D
320.3631 461.8940 m
352.1759 472.4983 L
383.9886 461.8940 L
352.1759 451.2898 L
320.3631 461.8940 L
s
0.0000 0.0000 0.0000 XA
0.0000 0.0000 0.0000 Xa
0 i 1 J 1 j 1.0000 w 4 M []0 d
0 D
320.3631 483.1025 m
352.1759 493.7068 L
383.9886 483.1025 L
352.1759 472.4983 L
320.3631 483.1025 L
s
0.0000 0.0000 0.0000 XA
0.0000 0.0000 0.0000 Xa
0 i 1 J 1 j 1.0000 w 4 M []0 d
0 D
320.3631 504.3110 m
352.1759 514.9153 L
383.9886 504.3110 L
352.1759 493.7068 L
320.3631 504.3110 L
s
0.0000 0.0000 0.0000 XA
0.0000 0.0000 0.0000 Xa
0 i 1 J 1 j 1.0000 w 4 M []0 d
0 D
383.9886 419.4770 m
394.5929 430.0813 L
405.1971 419.4770 L
394.5929 408.8728 L
383.9886 419.4770 L
s
0.0000 0.0000 0.0000 XA
0.0000 0.0000 0.0000 Xa
0 i 1 J 1 j 1.0000 w 4 M []0 d
0 D
383.9886 440.6855 m
394.5929 451.2898 L
405.1971 440.6855 L
394.5929 430.0813 L
383.9886 440.6855 L
s
0.0000 0.0000 0.0000 XA
0.0000 0.0000 0.0000 Xa
0 i 1 J 1 j 1.0000 w 4 M []0 d
0 D
383.9886 461.8940 m
394.5929 472.4983 L
405.1971 461.8940 L
394.5929 451.2898 L
383.9886 461.8940 L
s
0.0000 0.0000 0.0000 XA
0.0000 0.0000 0.0000 Xa
0 i 1 J 1 j 1.0000 w 4 M []0 d
0 D
383.9886 483.1025 m
394.5929 493.7068 L
405.1971 483.1025 L
394.5929 472.4983 L
383.9886 483.1025 L
s
0.0000 0.0000 0.0000 XA
0.0000 0.0000 0.0000 Xa
0 i 1 J 1 j 1.0000 w 4 M []0 d
0 D
383.9886 504.3110 m
394.5929 514.9153 L
405.1971 504.3110 L
394.5929 493.7068 L
383.9886 504.3110 L
s
0.0000 0.0000 0.0000 XA
0.0000 0.0000 0.0000 Xa
0 i 1 J 1 j 1.0000 w 4 M []0 d
0 D
299.1546 440.6855 m
309.7589 451.2898 L
320.3631 440.6855 L
309.7589 430.0813 L
299.1546 440.6855 L
s
0.0000 0.0000 0.0000 XA
0.0000 0.0000 0.0000 Xa
0 i 1 J 1 j 1.0000 w 4 M []0 d
0 D
299.1546 419.4770 m
309.7589 430.0813 L
320.3631 419.4770 L
309.7589 408.8728 L
299.1546 419.4770 L
s
0.0000 0.0000 0.0000 XA
0.0000 0.0000 0.0000 Xa
0 i 1 J 1 j 1.0000 w 4 M []0 d
0 D
299.1546 461.8940 m
309.7589 472.4983 L
320.3631 461.8940 L
309.7589 451.2898 L
299.1546 461.8940 L
s
0.0000 0.0000 0.0000 XA
0.0000 0.0000 0.0000 Xa
0 i 1 J 1 j 1.0000 w 4 M []0 d
0 D
299.1546 504.3110 m
309.7589 514.9153 L
320.3631 504.3110 L
309.7589 493.7068 L
299.1546 504.3110 L
s
0.0000 0.0000 0.0000 XA
0.0000 0.0000 0.0000 Xa
0 i 1 J 1 j 1.0000 w 4 M []0 d
0 D
299.1546 483.1025 m
309.7589 493.7068 L
320.3631 483.1025 L
309.7589 472.4983 L
299.1546 483.1025 L
s
0.0000 0.0000 0.0000 XA
0.0000 0.0000 0.0000 Xa
0 i 1 J 1 j 1.0000 w 4 M []0 d
0 D
299.1546 419.4770 m
405.1971 419.4770 L
S
0.0000 0.0000 0.0000 XA
0.0000 0.0000 0.0000 Xa
0 i 1 J 1 j 1.0000 w 4 M []0 d
0 D
299.1546 440.6855 m
405.1971 440.6855 L
S
0.0000 0.0000 0.0000 XA
0.0000 0.0000 0.0000 Xa
0 i 1 J 1 j 1.0000 w 4 M []0 d
0 D
299.1546 461.8940 m
405.1971 461.8940 L
S
0.0000 0.0000 0.0000 XA
0.0000 0.0000 0.0000 Xa
0 i 1 J 1 j 1.0000 w 4 M []0 d
0 D
299.1546 483.1025 m
405.1971 483.1025 L
S
0.0000 0.0000 0.0000 XA
0.0000 0.0000 0.0000 Xa
0 i 1 J 1 j 1.0000 w 4 M []0 d
0 D
299.1546 504.3110 m
405.1971 504.3110 L
S
0.0000 0.0000 0.0000 XA
0.0000 0.0000 0.0000 Xa
0 i 1 J 1 j 1.0000 w 4 M []0 d
0 D
405.1971 514.9153 m
405.1971 408.8728 L
S
0.0000 0.0000 0.0000 XA
0.0000 0.0000 0.0000 Xa
0 i 1 J 1 j 1.0000 w 4 M []0 d
0 D
299.1546 514.9153 m
299.1546 408.8728 L
S
0.0000 0.0000 0.0000 XA
0.0000 0.0000 0.0000 Xa
0 i 1 J 1 j 1.0000 w 4 M []0 d
0 D
383.9886 514.9153 m
383.9886 408.8728 L
S
0.0000 0.0000 0.0000 XA
0.0000 0.0000 0.0000 Xa
0 i 1 J 1 j 1.0000 w 4 M []0 d
0 D
320.3631 514.9153 m
320.3631 408.8728 L
S
0.0000 0.0000 0.0000 XA
0.0000 0.0000 0.0000 Xa
0 i 1 J 1 j 1.0000 w 4 M []0 d
0 D
299.1546 408.8728 m
405.1971 408.8728 L
S
0.0000 0.0000 0.0000 XA
0.0000 0.0000 0.0000 Xa
0 i 1 J 1 j 1.0000 w 4 M []0 d
0 D
299.1546 430.0813 m
405.1971 430.0813 L
S
0.0000 0.0000 0.0000 XA
0.0000 0.0000 0.0000 Xa
0 i 1 J 1 j 1.0000 w 4 M []0 d
0 D
299.1546 451.2898 m
405.1971 451.2898 L
S
0.0000 0.0000 0.0000 XA
0.0000 0.0000 0.0000 Xa
0 i 1 J 1 j 1.0000 w 4 M []0 d
0 D
299.1546 472.4983 m
405.1971 472.4983 L
S
0.0000 0.0000 0.0000 XA
0.0000 0.0000 0.0000 Xa
0 i 1 J 1 j 1.0000 w 4 M []0 d
0 D
299.1546 493.7068 m
405.1971 493.7068 L
S
0.0000 0.0000 0.0000 XA
0.0000 0.0000 0.0000 Xa
0 i 1 J 1 j 1.0000 w 4 M []0 d
0 D
299.1546 514.9153 m
405.1971 514.9153 L
S
0.0000 0.0000 0.0000 XA
0.0000 0.0000 0.0000 Xa
0 i 1 J 1 j 1.0000 w 4 M []0 d
0 D
382.1718 293.8363 m
385.4779 291.9276 L
387.3867 295.2336 L
384.0806 297.1424 L
S
0.0000 0.0000 0.0000 XA
0.0000 0.0000 0.0000 Xa
0 i 1 J 1 j 1.0000 w 4 M []0 d
0 D
378.8657 288.1100 m
387.3867 302.8687 L
S
0.0000 0.0000 0.0000 XA
0.0000 0.0000 0.0000 Xa
0 i 1 J 1 j 1.0000 w 4 M []0 d
0 D
397.8163 284.8040 m
380.7745 284.8040 L
S
0.0000 0.0000 0.0000 XA
0.0000 0.0000 0.0000 Xa
0 i 1 J 1 j 1.0000 w 4 M []0 d
0 D
391.2042 302.8687 m
399.7251 288.1100 L
S
0.0000 0.0000 0.0000 XA
0.0000 0.0000 0.0000 Xa
0 i 1 J 1 j 1.0000 w 4 M []0 d
0 D
382.1718 275.7716 m
385.4779 273.8628 L
387.3867 277.1689 L
384.0806 279.0777 L
S
0.0000 0.0000 0.0000 XA
0.0000 0.0000 0.0000 Xa
0 i 1 J 1 j 1.0000 w 4 M []0 d
0 D
378.8657 270.0453 m
387.3867 284.8040 L
S
0.0000 0.0000 0.0000 XA
0.0000 0.0000 0.0000 Xa
0 i 1 J 1 j 1.0000 w 4 M []0 d
0 D
397.8163 266.7392 m
380.7745 266.7392 L
S
0.0000 0.0000 0.0000 XA
0.0000 0.0000 0.0000 Xa
0 i 1 J 1 j 1.0000 w 4 M []0 d
0 D
391.2042 284.8040 m
399.7251 270.0453 L
S
0.0000 0.0000 0.0000 XA
0.0000 0.0000 0.0000 Xa
0 i 1 J 1 j 1.0000 w 4 M []0 d
0 D
394.5103 279.0777 m
403.0312 293.8363 L
S
0.0000 0.0000 0.0000 XA
0.0000 0.0000 0.0000 Xa
0 i 1 J 1 j 1.0000 w 4 M []0 d
0 D
413.4609 275.7716 m
396.4190 275.7716 L
S
0.0000 0.0000 0.0000 XA
0.0000 0.0000 0.0000 Xa
0 i 1 J 1 j 1.0000 w 4 M []0 d
0 D
406.8487 293.8363 m
415.3696 279.0777 L
S
0.0000 0.0000 0.0000 XA
0.0000 0.0000 0.0000 Xa
0 i 1 J 1 j 1.0000 w 4 M []0 d
0 D
410.1548 270.0453 m
418.6757 284.8040 L
S
0.0000 0.0000 0.0000 XA
0.0000 0.0000 0.0000 Xa
0 i 1 J 1 j 1.0000 w 4 M []0 d
0 D
429.1054 266.7392 m
412.0636 266.7392 L
S
0.0000 0.0000 0.0000 XA
0.0000 0.0000 0.0000 Xa
0 i 1 J 1 j 1.0000 w 4 M []0 d
0 D
422.4932 284.8040 m
431.0142 270.0453 L
S
0.0000 0.0000 0.0000 XA
0.0000 0.0000 0.0000 Xa
0 i 1 J 1 j 1.0000 w 4 M []0 d
0 D
410.1548 288.1100 m
418.6757 302.8687 L
S
0.0000 0.0000 0.0000 XA
0.0000 0.0000 0.0000 Xa
0 i 1 J 1 j 1.0000 w 4 M []0 d
0 D
429.1054 284.8040 m
412.0636 284.8040 L
S
0.0000 0.0000 0.0000 XA
0.0000 0.0000 0.0000 Xa
0 i 1 J 1 j 1.0000 w 4 M []0 d
0 D
422.4932 302.8687 m
431.0142 288.1100 L
S
0.0000 0.0000 0.0000 XA
0.0000 0.0000 0.0000 Xa
0 i 1 J 1 j 1.0000 w 4 M []0 d
0 D
425.7993 279.0777 m
434.3202 293.8363 L
S
0.0000 0.0000 0.0000 XA
0.0000 0.0000 0.0000 Xa
0 i 1 J 1 j 1.0000 w 4 M []0 d
0 D
444.7499 275.7716 m
427.7081 275.7716 L
S
0.0000 0.0000 0.0000 XA
0.0000 0.0000 0.0000 Xa
0 i 1 J 1 j 1.0000 w 4 M []0 d
0 D
438.1378 293.8363 m
446.6587 279.0777 L
S
0.0000 0.0000 0.0000 XA
0.0000 0.0000 0.0000 Xa
0 i 1 J 1 j 1.0000 w 4 M []0 d
0 D
425.7993 261.0129 m
434.3202 275.7716 L
S
0.0000 0.0000 0.0000 XA
0.0000 0.0000 0.0000 Xa
0 i 1 J 1 j 1.0000 w 4 M []0 d
0 D
438.1378 257.7068 m
438.1378 261.5244 L
434.3202 261.5244 L
434.3202 257.7068 L
S
0.0000 0.0000 0.0000 XA
0.0000 0.0000 0.0000 Xa
0 i 1 J 1 j 1.0000 w 4 M []0 d
0 D
444.7499 257.7068 m
427.7081 257.7068 L
S
0.0000 0.0000 0.0000 XA
0.0000 0.0000 0.0000 Xa
0 i 1 J 1 j 1.0000 w 4 M []0 d
0 D
438.1378 275.7716 m
446.6587 261.0129 L
S
0.0000 0.0000 0.0000 XA
0.0000 0.0000 0.0000 Xa
0 i 1 J 1 j 1.0000 w 4 M []0 d
0 D
394.5103 261.0129 m
403.0312 275.7716 L
S
0.0000 0.0000 0.0000 XA
0.0000 0.0000 0.0000 Xa
0 i 1 J 1 j 1.0000 w 4 M []0 d
0 D
406.8487 257.7068 m
406.8487 261.5244 L
403.0312 261.5244 L
403.0312 257.7068 L
S
0.0000 0.0000 0.0000 XA
0.0000 0.0000 0.0000 Xa
0 i 1 J 1 j 1.0000 w 4 M []0 d
0 D
413.4609 257.7068 m
396.4190 257.7068 L
S
0.0000 0.0000 0.0000 XA
0.0000 0.0000 0.0000 Xa
0 i 1 J 1 j 1.0000 w 4 M []0 d
0 D
406.8487 275.7716 m
415.3696 261.0129 L
S
0.0000 0.0000 0.0000 XA
0.0000 0.0000 0.0000 Xa
0 i 1 J 1 j 1.0000 w 4 M []0 d
0 D
424.4020 255.7981 m
422.4932 252.4920 L
429.1054 248.6745 L
431.0142 251.9805 L
424.4020 255.7981 L
s
0.0000 0.0000 0.0000 XA
0.0000 0.0000 0.0000 Xa
0 i 1 J 1 j 1.0000 w 4 M []0 d
0 D
410.1548 251.9805 m
418.6757 266.7392 L
S
0.0000 0.0000 0.0000 XA
0.0000 0.0000 0.0000 Xa
0 i 1 J 1 j 1.0000 w 4 M []0 d
0 D
422.4932 248.6745 m
422.4932 252.4920 L
418.6757 252.4920 L
418.6757 248.6745 L
S
0.0000 0.0000 0.0000 XA
0.0000 0.0000 0.0000 Xa
0 i 1 J 1 j 1.0000 w 4 M []0 d
0 D
429.1054 248.6745 m
412.0636 248.6745 L
S
0.0000 0.0000 0.0000 XA
0.0000 0.0000 0.0000 Xa
0 i 1 J 1 j 1.0000 w 4 M []0 d
0 D
422.4932 266.7392 m
431.0142 251.9805 L
S
0.0000 0.0000 0.0000 XA
0.0000 0.0000 0.0000 Xa
0 i 1 J 1 j 1.0000 w 4 M []0 d
0 D
387.3867 331.3631 m
391.2042 331.3631 L
391.2042 338.9982 L
387.3867 338.9982 L
387.3867 331.3631 L
s
0.0000 0.0000 0.0000 XA
0.0000 0.0000 0.0000 Xa
0 i 1 J 1 j 1.0000 w 4 M []0 d
0 D
382.1718 329.9658 m
385.4779 328.0571 L
387.3867 331.3631 L
384.0806 333.2719 L
S
0.0000 0.0000 0.0000 XA
0.0000 0.0000 0.0000 Xa
0 i 1 J 1 j 1.0000 w 4 M []0 d
0 D
378.8657 324.2395 m
387.3867 338.9982 L
S
0.0000 0.0000 0.0000 XA
0.0000 0.0000 0.0000 Xa
0 i 1 J 1 j 1.0000 w 4 M []0 d
0 D
397.8163 320.9335 m
380.7745 320.9335 L
S
0.0000 0.0000 0.0000 XA
0.0000 0.0000 0.0000 Xa
0 i 1 J 1 j 1.0000 w 4 M []0 d
0 D
391.2042 338.9982 m
399.7251 324.2395 L
S
0.0000 0.0000 0.0000 XA
0.0000 0.0000 0.0000 Xa
0 i 1 J 1 j 1.0000 w 4 M []0 d
0 D
394.5103 315.2072 m
403.0312 329.9658 L
S
0.0000 0.0000 0.0000 XA
0.0000 0.0000 0.0000 Xa
0 i 1 J 1 j 1.0000 w 4 M []0 d
0 D
413.4609 311.9011 m
396.4190 311.9011 L
S
0.0000 0.0000 0.0000 XA
0.0000 0.0000 0.0000 Xa
0 i 1 J 1 j 1.0000 w 4 M []0 d
0 D
406.8487 329.9658 m
415.3696 315.2072 L
S
0.0000 0.0000 0.0000 XA
0.0000 0.0000 0.0000 Xa
0 i 1 J 1 j 1.0000 w 4 M []0 d
0 D
403.0312 340.3955 m
406.8487 340.3955 L
406.8487 348.0306 L
403.0312 348.0306 L
403.0312 340.3955 L
s
0.0000 0.0000 0.0000 XA
0.0000 0.0000 0.0000 Xa
0 i 1 J 1 j 1.0000 w 4 M []0 d
0 D
397.8163 338.9982 m
401.1224 337.0894 L
403.0312 340.3955 L
399.7251 342.3043 L
S
0.0000 0.0000 0.0000 XA
0.0000 0.0000 0.0000 Xa
0 i 1 J 1 j 1.0000 w 4 M []0 d
0 D
394.5103 333.2719 m
403.0312 348.0306 L
S
0.0000 0.0000 0.0000 XA
0.0000 0.0000 0.0000 Xa
0 i 1 J 1 j 1.0000 w 4 M []0 d
0 D
413.4609 329.9658 m
396.4190 329.9658 L
S
0.0000 0.0000 0.0000 XA
0.0000 0.0000 0.0000 Xa
0 i 1 J 1 j 1.0000 w 4 M []0 d
0 D
410.1548 342.3043 m
406.8487 340.3955 L
408.7575 337.0894 L
412.0636 338.9982 L
S
0.0000 0.0000 0.0000 XA
0.0000 0.0000 0.0000 Xa
0 i 1 J 1 j 1.0000 w 4 M []0 d
0 D
406.8487 348.0306 m
415.3696 333.2719 L
S
0.0000 0.0000 0.0000 XA
0.0000 0.0000 0.0000 Xa
0 i 1 J 1 j 1.0000 w 4 M []0 d
0 D
410.1548 324.2395 m
418.6757 338.9982 L
S
0.0000 0.0000 0.0000 XA
0.0000 0.0000 0.0000 Xa
0 i 1 J 1 j 1.0000 w 4 M []0 d
0 D
429.1054 320.9335 m
412.0636 320.9335 L
S
0.0000 0.0000 0.0000 XA
0.0000 0.0000 0.0000 Xa
0 i 1 J 1 j 1.0000 w 4 M []0 d
0 D
422.4932 338.9982 m
431.0142 324.2395 L
S
0.0000 0.0000 0.0000 XA
0.0000 0.0000 0.0000 Xa
0 i 1 J 1 j 1.0000 w 4 M []0 d
0 D
410.1548 306.1748 m
418.6757 320.9335 L
S
0.0000 0.0000 0.0000 XA
0.0000 0.0000 0.0000 Xa
0 i 1 J 1 j 1.0000 w 4 M []0 d
0 D
429.1054 302.8687 m
412.0636 302.8687 L
S
0.0000 0.0000 0.0000 XA
0.0000 0.0000 0.0000 Xa
0 i 1 J 1 j 1.0000 w 4 M []0 d
0 D
422.4932 320.9335 m
431.0142 306.1748 L
S
0.0000 0.0000 0.0000 XA
0.0000 0.0000 0.0000 Xa
0 i 1 J 1 j 1.0000 w 4 M []0 d
0 D
382.1718 311.9011 m
385.4779 309.9923 L
387.3867 313.2984 L
384.0806 315.2072 L
S
0.0000 0.0000 0.0000 XA
0.0000 0.0000 0.0000 Xa
0 i 1 J 1 j 1.0000 w 4 M []0 d
0 D
378.8657 306.1748 m
387.3867 320.9335 L
S
0.0000 0.0000 0.0000 XA
0.0000 0.0000 0.0000 Xa
0 i 1 J 1 j 1.0000 w 4 M []0 d
0 D
397.8163 302.8687 m
380.7745 302.8687 L
S
0.0000 0.0000 0.0000 XA
0.0000 0.0000 0.0000 Xa
0 i 1 J 1 j 1.0000 w 4 M []0 d
0 D
391.2042 320.9335 m
399.7251 306.1748 L
S
0.0000 0.0000 0.0000 XA
0.0000 0.0000 0.0000 Xa
0 i 1 J 1 j 1.0000 w 4 M []0 d
0 D
394.5103 297.1424 m
403.0312 311.9011 L
S
0.0000 0.0000 0.0000 XA
0.0000 0.0000 0.0000 Xa
0 i 1 J 1 j 1.0000 w 4 M []0 d
0 D
413.4609 293.8363 m
396.4190 293.8363 L
S
0.0000 0.0000 0.0000 XA
0.0000 0.0000 0.0000 Xa
0 i 1 J 1 j 1.0000 w 4 M []0 d
0 D
406.8487 311.9011 m
415.3696 297.1424 L
S
0.0000 0.0000 0.0000 XA
0.0000 0.0000 0.0000 Xa
0 i 1 J 1 j 1.0000 w 4 M []0 d
0 D
425.7993 315.2072 m
434.3202 329.9658 L
S
0.0000 0.0000 0.0000 XA
0.0000 0.0000 0.0000 Xa
0 i 1 J 1 j 1.0000 w 4 M []0 d
0 D
444.7499 311.9011 m
427.7081 311.9011 L
S
0.0000 0.0000 0.0000 XA
0.0000 0.0000 0.0000 Xa
0 i 1 J 1 j 1.0000 w 4 M []0 d
0 D
438.1378 329.9658 m
446.6587 315.2072 L
S
0.0000 0.0000 0.0000 XA
0.0000 0.0000 0.0000 Xa
0 i 1 J 1 j 1.0000 w 4 M []0 d
0 D
441.4439 306.1748 m
449.9648 320.9335 L
S
0.0000 0.0000 0.0000 XA
0.0000 0.0000 0.0000 Xa
0 i 1 J 1 j 1.0000 w 4 M []0 d
0 D
460.3945 302.8687 m
443.3526 302.8687 L
S
0.0000 0.0000 0.0000 XA
0.0000 0.0000 0.0000 Xa
0 i 1 J 1 j 1.0000 w 4 M []0 d
0 D
453.7823 320.9335 m
462.3032 306.1748 L
S
0.0000 0.0000 0.0000 XA
0.0000 0.0000 0.0000 Xa
0 i 1 J 1 j 1.0000 w 4 M []0 d
0 D
449.9648 331.3631 m
453.7823 331.3631 L
453.7823 338.9982 L
449.9648 338.9982 L
449.9648 331.3631 L
s
0.0000 0.0000 0.0000 XA
0.0000 0.0000 0.0000 Xa
0 i 1 J 1 j 1.0000 w 4 M []0 d
0 D
441.4439 324.2395 m
449.9648 338.9982 L
S
0.0000 0.0000 0.0000 XA
0.0000 0.0000 0.0000 Xa
0 i 1 J 1 j 1.0000 w 4 M []0 d
0 D
460.3945 320.9335 m
443.3526 320.9335 L
S
0.0000 0.0000 0.0000 XA
0.0000 0.0000 0.0000 Xa
0 i 1 J 1 j 1.0000 w 4 M []0 d
0 D
453.7823 338.9982 m
462.3032 324.2395 L
S
0.0000 0.0000 0.0000 XA
0.0000 0.0000 0.0000 Xa
0 i 1 J 1 j 1.0000 w 4 M []0 d
0 D
457.0884 315.2072 m
465.6093 329.9658 L
S
0.0000 0.0000 0.0000 XA
0.0000 0.0000 0.0000 Xa
0 i 1 J 1 j 1.0000 w 4 M []0 d
0 D
476.0390 311.9011 m
458.9971 311.9011 L
S
0.0000 0.0000 0.0000 XA
0.0000 0.0000 0.0000 Xa
0 i 1 J 1 j 1.0000 w 4 M []0 d
0 D
469.4268 329.9658 m
477.9478 315.2072 L
S
0.0000 0.0000 0.0000 XA
0.0000 0.0000 0.0000 Xa
0 i 1 J 1 j 1.0000 w 4 M []0 d
0 D
457.0884 297.1424 m
465.6093 311.9011 L
S
0.0000 0.0000 0.0000 XA
0.0000 0.0000 0.0000 Xa
0 i 1 J 1 j 1.0000 w 4 M []0 d
0 D
476.0390 293.8363 m
458.9971 293.8363 L
S
0.0000 0.0000 0.0000 XA
0.0000 0.0000 0.0000 Xa
0 i 1 J 1 j 1.0000 w 4 M []0 d
0 D
469.4268 311.9011 m
477.9478 297.1424 L
S
0.0000 0.0000 0.0000 XA
0.0000 0.0000 0.0000 Xa
0 i 1 J 1 j 1.0000 w 4 M []0 d
0 D
425.7993 297.1424 m
434.3202 311.9011 L
S
0.0000 0.0000 0.0000 XA
0.0000 0.0000 0.0000 Xa
0 i 1 J 1 j 1.0000 w 4 M []0 d
0 D
444.7499 293.8363 m
427.7081 293.8363 L
S
0.0000 0.0000 0.0000 XA
0.0000 0.0000 0.0000 Xa
0 i 1 J 1 j 1.0000 w 4 M []0 d
0 D
438.1378 311.9011 m
446.6587 297.1424 L
S
0.0000 0.0000 0.0000 XA
0.0000 0.0000 0.0000 Xa
0 i 1 J 1 j 1.0000 w 4 M []0 d
0 D
441.4439 288.1100 m
449.9648 302.8687 L
S
0.0000 0.0000 0.0000 XA
0.0000 0.0000 0.0000 Xa
0 i 1 J 1 j 1.0000 w 4 M []0 d
0 D
460.3945 284.8040 m
443.3526 284.8040 L
S
0.0000 0.0000 0.0000 XA
0.0000 0.0000 0.0000 Xa
0 i 1 J 1 j 1.0000 w 4 M []0 d
0 D
453.7823 302.8687 m
462.3032 288.1100 L
S
0.0000 0.0000 0.0000 XA
0.0000 0.0000 0.0000 Xa
0 i 1 J 1 j 1.0000 w 4 M []0 d
0 D
441.4439 270.0453 m
449.9648 284.8040 L
S
0.0000 0.0000 0.0000 XA
0.0000 0.0000 0.0000 Xa
0 i 1 J 1 j 1.0000 w 4 M []0 d
0 D
460.3945 266.7392 m
443.3526 266.7392 L
S
0.0000 0.0000 0.0000 XA
0.0000 0.0000 0.0000 Xa
0 i 1 J 1 j 1.0000 w 4 M []0 d
0 D
453.7823 284.8040 m
462.3032 270.0453 L
S
0.0000 0.0000 0.0000 XA
0.0000 0.0000 0.0000 Xa
0 i 1 J 1 j 1.0000 w 4 M []0 d
0 D
457.0884 261.0129 m
465.6093 275.7716 L
S
0.0000 0.0000 0.0000 XA
0.0000 0.0000 0.0000 Xa
0 i 1 J 1 j 1.0000 w 4 M []0 d
0 D
469.4268 257.7068 m
469.4268 261.5244 L
465.6093 261.5244 L
465.6093 257.7068 L
S
0.0000 0.0000 0.0000 XA
0.0000 0.0000 0.0000 Xa
0 i 1 J 1 j 1.0000 w 4 M []0 d
0 D
476.0390 257.7068 m
458.9971 257.7068 L
S
0.0000 0.0000 0.0000 XA
0.0000 0.0000 0.0000 Xa
0 i 1 J 1 j 1.0000 w 4 M []0 d
0 D
469.4268 275.7716 m
477.9478 261.0129 L
S
0.0000 0.0000 0.0000 XA
0.0000 0.0000 0.0000 Xa
0 i 1 J 1 j 1.0000 w 4 M []0 d
0 D
457.0884 279.0777 m
465.6093 293.8363 L
S
0.0000 0.0000 0.0000 XA
0.0000 0.0000 0.0000 Xa
0 i 1 J 1 j 1.0000 w 4 M []0 d
0 D
476.0390 275.7716 m
458.9971 275.7716 L
S
0.0000 0.0000 0.0000 XA
0.0000 0.0000 0.0000 Xa
0 i 1 J 1 j 1.0000 w 4 M []0 d
0 D
469.4268 293.8363 m
477.9478 279.0777 L
S
0.0000 0.0000 0.0000 XA
0.0000 0.0000 0.0000 Xa
0 i 1 J 1 j 1.0000 w 4 M []0 d
0 D
486.9801 273.8628 m
485.0714 270.5567 L
491.6835 266.7392 L
493.5923 270.0453 L
486.9801 273.8628 L
s
0.0000 0.0000 0.0000 XA
0.0000 0.0000 0.0000 Xa
0 i 1 J 1 j 1.0000 w 4 M []0 d
0 D
472.7329 270.0453 m
481.2538 284.8040 L
S
0.0000 0.0000 0.0000 XA
0.0000 0.0000 0.0000 Xa
0 i 1 J 1 j 1.0000 w 4 M []0 d
0 D
491.6835 266.7392 m
474.6417 266.7392 L
S
0.0000 0.0000 0.0000 XA
0.0000 0.0000 0.0000 Xa
0 i 1 J 1 j 1.0000 w 4 M []0 d
0 D
488.3774 279.0777 m
485.0714 277.1689 L
486.9801 273.8628 L
490.2862 275.7716 L
S
0.0000 0.0000 0.0000 XA
0.0000 0.0000 0.0000 Xa
0 i 1 J 1 j 1.0000 w 4 M []0 d
0 D
485.0714 284.8040 m
493.5923 270.0453 L
S
0.0000 0.0000 0.0000 XA
0.0000 0.0000 0.0000 Xa
0 i 1 J 1 j 1.0000 w 4 M []0 d
0 D
486.9801 255.7981 m
485.0714 252.4920 L
491.6835 248.6745 L
493.5923 251.9805 L
486.9801 255.7981 L
s
0.0000 0.0000 0.0000 XA
0.0000 0.0000 0.0000 Xa
0 i 1 J 1 j 1.0000 w 4 M []0 d
0 D
472.7329 251.9805 m
481.2538 266.7392 L
S
0.0000 0.0000 0.0000 XA
0.0000 0.0000 0.0000 Xa
0 i 1 J 1 j 1.0000 w 4 M []0 d
0 D
485.0714 248.6745 m
485.0714 252.4920 L
481.2538 252.4920 L
481.2538 248.6745 L
S
0.0000 0.0000 0.0000 XA
0.0000 0.0000 0.0000 Xa
0 i 1 J 1 j 1.0000 w 4 M []0 d
0 D
491.6835 248.6745 m
474.6417 248.6745 L
S
0.0000 0.0000 0.0000 XA
0.0000 0.0000 0.0000 Xa
0 i 1 J 1 j 1.0000 w 4 M []0 d
0 D
488.3774 261.0129 m
485.0714 259.1042 L
486.9801 255.7981 L
490.2862 257.7068 L
S
0.0000 0.0000 0.0000 XA
0.0000 0.0000 0.0000 Xa
0 i 1 J 1 j 1.0000 w 4 M []0 d
0 D
485.0714 266.7392 m
493.5923 251.9805 L
S
0.0000 0.0000 0.0000 XA
0.0000 0.0000 0.0000 Xa
0 i 1 J 1 j 1.0000 w 4 M []0 d
0 D
455.6911 255.7981 m
453.7823 252.4920 L
460.3945 248.6745 L
462.3032 251.9805 L
455.6911 255.7981 L
s
0.0000 0.0000 0.0000 XA
0.0000 0.0000 0.0000 Xa
0 i 1 J 1 j 1.0000 w 4 M []0 d
0 D
441.4439 251.9805 m
449.9648 266.7392 L
S
0.0000 0.0000 0.0000 XA
0.0000 0.0000 0.0000 Xa
0 i 1 J 1 j 1.0000 w 4 M []0 d
0 D
453.7823 248.6745 m
453.7823 252.4920 L
449.9648 252.4920 L
449.9648 248.6745 L
S
0.0000 0.0000 0.0000 XA
0.0000 0.0000 0.0000 Xa
0 i 1 J 1 j 1.0000 w 4 M []0 d
0 D
460.3945 248.6745 m
443.3526 248.6745 L
S
0.0000 0.0000 0.0000 XA
0.0000 0.0000 0.0000 Xa
0 i 1 J 1 j 1.0000 w 4 M []0 d
0 D
453.7823 266.7392 m
462.3032 251.9805 L
S
0.0000 0.0000 0.0000 XA
0.0000 0.0000 0.0000 Xa
0 i 1 J 1 j 1.0000 w 4 M []0 d
0 D
486.9801 309.9923 m
485.0714 306.6862 L
491.6835 302.8687 L
493.5923 306.1748 L
486.9801 309.9923 L
s
0.0000 0.0000 0.0000 XA
0.0000 0.0000 0.0000 Xa
0 i 1 J 1 j 1.0000 w 4 M []0 d
0 D
472.7329 306.1748 m
481.2538 320.9335 L
S
0.0000 0.0000 0.0000 XA
0.0000 0.0000 0.0000 Xa
0 i 1 J 1 j 1.0000 w 4 M []0 d
0 D
491.6835 302.8687 m
474.6417 302.8687 L
S
0.0000 0.0000 0.0000 XA
0.0000 0.0000 0.0000 Xa
0 i 1 J 1 j 1.0000 w 4 M []0 d
0 D
488.3774 315.2072 m
485.0714 313.2984 L
486.9801 309.9923 L
490.2862 311.9011 L
S
0.0000 0.0000 0.0000 XA
0.0000 0.0000 0.0000 Xa
0 i 1 J 1 j 1.0000 w 4 M []0 d
0 D
485.0714 320.9335 m
493.5923 306.1748 L
S
0.0000 0.0000 0.0000 XA
0.0000 0.0000 0.0000 Xa
0 i 1 J 1 j 1.0000 w 4 M []0 d
0 D
486.9801 291.9276 m
485.0714 288.6215 L
491.6835 284.8040 L
493.5923 288.1100 L
486.9801 291.9276 L
s
0.0000 0.0000 0.0000 XA
0.0000 0.0000 0.0000 Xa
0 i 1 J 1 j 1.0000 w 4 M []0 d
0 D
472.7329 288.1100 m
481.2538 302.8687 L
S
0.0000 0.0000 0.0000 XA
0.0000 0.0000 0.0000 Xa
0 i 1 J 1 j 1.0000 w 4 M []0 d
0 D
491.6835 284.8040 m
474.6417 284.8040 L
S
0.0000 0.0000 0.0000 XA
0.0000 0.0000 0.0000 Xa
0 i 1 J 1 j 1.0000 w 4 M []0 d
0 D
488.3774 297.1424 m
485.0714 295.2336 L
486.9801 291.9276 L
490.2862 293.8363 L
S
0.0000 0.0000 0.0000 XA
0.0000 0.0000 0.0000 Xa
0 i 1 J 1 j 1.0000 w 4 M []0 d
0 D
485.0714 302.8687 m
493.5923 288.1100 L
S
0.0000 0.0000 0.0000 XA
0.0000 0.0000 0.0000 Xa
0 i 1 J 1 j 1.0000 w 4 M []0 d
0 D
393.1130 255.7981 m
391.2042 252.4920 L
397.8163 248.6745 L
399.7251 251.9805 L
393.1130 255.7981 L
s
0.0000 0.0000 0.0000 XA
0.0000 0.0000 0.0000 Xa
0 i 1 J 1 j 1.0000 w 4 M []0 d
0 D
382.1718 257.7068 m
385.4779 255.7981 L
387.3867 259.1042 L
384.0806 261.0129 L
S
0.0000 0.0000 0.0000 XA
0.0000 0.0000 0.0000 Xa
0 i 1 J 1 j 1.0000 w 4 M []0 d
0 D
378.8657 251.9805 m
387.3867 266.7392 L
S
0.0000 0.0000 0.0000 XA
0.0000 0.0000 0.0000 Xa
0 i 1 J 1 j 1.0000 w 4 M []0 d
0 D
391.2042 248.6745 m
391.2042 252.4920 L
387.3867 252.4920 L
387.3867 248.6745 L
S
0.0000 0.0000 0.0000 XA
0.0000 0.0000 0.0000 Xa
0 i 1 J 1 j 1.0000 w 4 M []0 d
0 D
397.8163 248.6745 m
380.7745 248.6745 L
S
0.0000 0.0000 0.0000 XA
0.0000 0.0000 0.0000 Xa
0 i 1 J 1 j 1.0000 w 4 M []0 d
0 D
391.2042 266.7392 m
399.7251 251.9805 L
S
0.0000 0.0000 0.0000 XA
0.0000 0.0000 0.0000 Xa
0 i 1 J 1 j 1.0000 w 4 M []0 d
0 D
434.3202 340.3955 m
438.1378 340.3955 L
438.1378 348.0306 L
434.3202 348.0306 L
434.3202 340.3955 L
s
0.0000 0.0000 0.0000 XA
0.0000 0.0000 0.0000 Xa
0 i 1 J 1 j 1.0000 w 4 M []0 d
0 D
429.1054 338.9982 m
432.4115 337.0894 L
434.3202 340.3955 L
431.0142 342.3043 L
S
0.0000 0.0000 0.0000 XA
0.0000 0.0000 0.0000 Xa
0 i 1 J 1 j 1.0000 w 4 M []0 d
0 D
425.7993 333.2719 m
434.3202 348.0306 L
S
0.0000 0.0000 0.0000 XA
0.0000 0.0000 0.0000 Xa
0 i 1 J 1 j 1.0000 w 4 M []0 d
0 D
444.7499 329.9658 m
427.7081 329.9658 L
S
0.0000 0.0000 0.0000 XA
0.0000 0.0000 0.0000 Xa
0 i 1 J 1 j 1.0000 w 4 M []0 d
0 D
441.4439 342.3043 m
438.1378 340.3955 L
440.0465 337.0894 L
443.3526 338.9982 L
S
0.0000 0.0000 0.0000 XA
0.0000 0.0000 0.0000 Xa
0 i 1 J 1 j 1.0000 w 4 M []0 d
0 D
438.1378 348.0306 m
446.6587 333.2719 L
S
0.0000 0.0000 0.0000 XA
0.0000 0.0000 0.0000 Xa
0 i 1 J 1 j 1.0000 w 4 M []0 d
0 D
460.3945 338.9982 m
463.7005 337.0894 L
465.6093 340.3955 L
462.3032 342.3043 L
S
0.0000 0.0000 0.0000 XA
0.0000 0.0000 0.0000 Xa
0 i 1 J 1 j 1.0000 w 4 M []0 d
0 D
457.0884 333.2719 m
465.6093 348.0306 L
S
0.0000 0.0000 0.0000 XA
0.0000 0.0000 0.0000 Xa
0 i 1 J 1 j 1.0000 w 4 M []0 d
0 D
476.0390 329.9658 m
458.9971 329.9658 L
S
0.0000 0.0000 0.0000 XA
0.0000 0.0000 0.0000 Xa
0 i 1 J 1 j 1.0000 w 4 M []0 d
0 D
472.7329 342.3043 m
469.4268 340.3955 L
471.3356 337.0894 L
474.6417 338.9982 L
S
0.0000 0.0000 0.0000 XA
0.0000 0.0000 0.0000 Xa
0 i 1 J 1 j 1.0000 w 4 M []0 d
0 D
469.4268 348.0306 m
477.9478 333.2719 L
S
0.0000 0.0000 0.0000 XA
0.0000 0.0000 0.0000 Xa
0 i 1 J 1 j 1.0000 w 4 M []0 d
0 D
486.9801 328.0571 m
485.0714 324.7510 L
491.6835 320.9335 L
493.5923 324.2395 L
486.9801 328.0571 L
s
0.0000 0.0000 0.0000 XA
0.0000 0.0000 0.0000 Xa
0 i 1 J 1 j 1.0000 w 4 M []0 d
0 D
472.7329 324.2395 m
481.2538 338.9982 L
S
0.0000 0.0000 0.0000 XA
0.0000 0.0000 0.0000 Xa
0 i 1 J 1 j 1.0000 w 4 M []0 d
0 D
491.6835 320.9335 m
474.6417 320.9335 L
S
0.0000 0.0000 0.0000 XA
0.0000 0.0000 0.0000 Xa
0 i 1 J 1 j 1.0000 w 4 M []0 d
0 D
488.3774 333.2719 m
485.0714 331.3631 L
486.9801 328.0571 L
490.2862 329.9658 L
S
0.0000 0.0000 0.0000 XA
0.0000 0.0000 0.0000 Xa
0 i 1 J 1 j 1.0000 w 4 M []0 d
0 D
485.0714 338.9982 m
493.5923 324.2395 L
S
0.0000 0.0000 0.0000 XA
0.0000 0.0000 0.0000 Xa
0 i 1 J 1 j 1.0000 w 4 M []0 d
0 D
387.3867 259.1042 m
391.2042 259.1042 L
391.2042 270.5567 L
387.3867 270.5567 L
380.7745 266.7392 L
378.8657 270.0453 L
385.4779 273.8628 L
387.3867 270.5567 L
387.3867 259.1042 L
s
0.0000 0.0000 0.0000 XA
0.0000 0.0000 0.0000 Xa
0 i 1 J 1 j 1.0000 w 4 M []0 d
0 D
408.7575 282.8952 m
406.8487 279.5891 L
416.7670 273.8628 L
418.6757 277.1689 L
408.7575 282.8952 L
s
0.0000 0.0000 0.0000 XA
0.0000 0.0000 0.0000 Xa
0 i 1 J 1 j 1.0000 w 4 M []0 d
0 D
422.4932 277.1689 m
422.4932 288.6215 L
418.6757 288.6215 L
408.7575 282.8952 L
406.8487 286.2013 L
416.7670 291.9276 L
418.6757 295.2336 L
408.7575 300.9599 L
406.8487 297.6539 L
416.7670 291.9276 L
418.6757 288.6215 L
418.6757 277.1689 L
422.4932 277.1689 L
s
0.0000 0.0000 0.0000 XA
0.0000 0.0000 0.0000 Xa
0 i 1 J 1 j 1.0000 w 4 M []0 d
0 D
432.4115 282.8952 m
434.3202 279.5891 L
434.3202 268.1365 L
424.4020 273.8628 L
422.4932 270.5567 L
432.4115 264.8304 L
434.3202 268.1365 L
438.1378 268.1365 L
438.1378 279.5891 L
434.3202 279.5891 L
424.4020 273.8628 L
422.4932 277.1689 L
432.4115 282.8952 L
422.4932 288.6215 L
424.4020 291.9276 L
434.3202 286.2013 L
434.3202 297.6539 L
432.4115 300.9599 L
434.3202 304.2660 L
438.1378 304.2660 L
438.1378 315.7186 L
434.3202 315.7186 L
424.4020 309.9923 L
422.4932 313.2984 L
432.4115 319.0247 L
422.4932 324.7510 L
424.4020 328.0571 L
434.3202 322.3308 L
434.3202 333.7834 L
432.4115 337.0894 L
422.4932 331.3631 L
424.4020 328.0571 L
434.3202 333.7834 L
438.1378 333.7834 L
438.1378 322.3308 L
434.3202 322.3308 L
432.4115 319.0247 L
434.3202 315.7186 L
434.3202 304.2660 L
424.4020 309.9923 L
422.4932 306.6862 L
432.4115 300.9599 L
422.4932 295.2336 L
424.4020 291.9276 L
434.3202 297.6539 L
438.1378 297.6539 L
438.1378 286.2013 L
434.3202 286.2013 L
432.4115 282.8952 L
s
0.0000 0.0000 0.0000 XA
0.0000 0.0000 0.0000 Xa
0 i 1 J 1 j 1.0000 w 4 M []0 d
0 D
434.3202 261.5244 m
432.4115 264.8304 L
422.4932 259.1042 L
424.4020 255.7981 L
434.3202 261.5244 L
s
0.0000 0.0000 0.0000 XA
0.0000 0.0000 0.0000 Xa
0 i 1 J 1 j 1.0000 w 4 M []0 d
0 D
387.3867 313.2984 m
391.2042 313.2984 L
391.2042 324.7510 L
387.3867 324.7510 L
380.7745 320.9335 L
378.8657 324.2395 L
385.4779 328.0571 L
387.3867 324.7510 L
387.3867 313.2984 L
s
0.0000 0.0000 0.0000 XA
0.0000 0.0000 0.0000 Xa
0 i 1 J 1 j 1.0000 w 4 M []0 d
0 D
403.0312 322.3308 m
393.1130 328.0571 L
391.2042 324.7510 L
401.1224 319.0247 L
403.0312 322.3308 L
s
0.0000 0.0000 0.0000 XA
0.0000 0.0000 0.0000 Xa
0 i 1 J 1 j 1.0000 w 4 M []0 d
0 D
406.8487 322.3308 m
406.8487 333.7834 L
403.0312 333.7834 L
393.1130 328.0571 L
391.2042 331.3631 L
401.1224 337.0894 L
403.0312 333.7834 L
403.0312 322.3308 L
406.8487 322.3308 L
s
0.0000 0.0000 0.0000 XA
0.0000 0.0000 0.0000 Xa
0 i 1 J 1 j 1.0000 w 4 M []0 d
0 D
416.7670 328.0571 m
418.6757 324.7510 L
418.6757 313.2984 L
408.7575 319.0247 L
406.8487 315.7186 L
416.7670 309.9923 L
418.6757 313.2984 L
422.4932 313.2984 L
422.4932 324.7510 L
418.6757 324.7510 L
408.7575 319.0247 L
406.8487 322.3308 L
416.7670 328.0571 L
406.8487 333.7834 L
408.7575 337.0894 L
418.6757 331.3631 L
422.4932 331.3631 L
422.4932 338.9982 L
418.6757 338.9982 L
418.6757 331.3631 L
416.7670 328.0571 L
s
0.0000 0.0000 0.0000 XA
0.0000 0.0000 0.0000 Xa
0 i 1 J 1 j 1.0000 w 4 M []0 d
0 D
418.6757 295.2336 m
422.4932 295.2336 L
422.4932 306.6862 L
418.6757 306.6862 L
416.7670 309.9923 L
406.8487 304.2660 L
408.7575 300.9599 L
418.6757 306.6862 L
418.6757 295.2336 L
s
0.0000 0.0000 0.0000 XA
0.0000 0.0000 0.0000 Xa
0 i 1 J 1 j 1.0000 w 4 M []0 d
0 D
387.3867 295.2336 m
391.2042 295.2336 L
391.2042 306.6862 L
387.3867 306.6862 L
380.7745 302.8687 L
378.8657 306.1748 L
385.4779 309.9923 L
387.3867 306.6862 L
387.3867 295.2336 L
s
0.0000 0.0000 0.0000 XA
0.0000 0.0000 0.0000 Xa
0 i 1 J 1 j 1.0000 w 4 M []0 d
0 D
449.9648 313.2984 m
440.0465 319.0247 L
438.1378 315.7186 L
448.0560 309.9923 L
449.9648 313.2984 L
s
0.0000 0.0000 0.0000 XA
0.0000 0.0000 0.0000 Xa
0 i 1 J 1 j 1.0000 w 4 M []0 d
0 D
453.7823 313.2984 m
453.7823 324.7510 L
449.9648 324.7510 L
440.0465 319.0247 L
438.1378 322.3308 L
448.0560 328.0571 L
449.9648 331.3631 L
440.0465 337.0894 L
438.1378 333.7834 L
448.0560 328.0571 L
449.9648 324.7510 L
449.9648 313.2984 L
453.7823 313.2984 L
s
0.0000 0.0000 0.0000 XA
0.0000 0.0000 0.0000 Xa
0 i 1 J 1 j 1.0000 w 4 M []0 d
0 D
463.7005 319.0247 m
465.6093 322.3308 L
469.4268 322.3308 L
469.4268 333.7834 L
465.6093 333.7834 L
455.6911 328.0571 L
453.7823 331.3631 L
463.7005 337.0894 L
465.6093 333.7834 L
465.6093 322.3308 L
455.6911 328.0571 L
453.7823 324.7510 L
463.7005 319.0247 L
453.7823 313.2984 L
455.6911 309.9923 L
465.6093 315.7186 L
469.4268 315.7186 L
469.4268 304.2660 L
465.6093 304.2660 L
463.7005 300.9599 L
453.7823 306.6862 L
455.6911 309.9923 L
465.6093 304.2660 L
465.6093 315.7186 L
463.7005 319.0247 L
s
0.0000 0.0000 0.0000 XA
0.0000 0.0000 0.0000 Xa
0 i 1 J 1 j 1.0000 w 4 M []0 d
0 D
479.3451 273.8628 m
481.2538 270.5567 L
481.2538 259.1042 L
471.3356 264.8304 L
469.4268 261.5244 L
479.3451 255.7981 L
472.7329 251.9805 L
474.6417 248.6745 L
481.2538 252.4920 L
479.3451 255.7981 L
481.2538 259.1042 L
485.0714 259.1042 L
485.0714 270.5567 L
481.2538 270.5567 L
471.3356 264.8304 L
469.4268 268.1365 L
479.3451 273.8628 L
469.4268 279.5891 L
471.3356 282.8952 L
481.2538 277.1689 L
481.2538 288.6215 L
479.3451 291.9276 L
481.2538 295.2336 L
485.0714 295.2336 L
485.0714 306.6862 L
481.2538 306.6862 L
471.3356 300.9599 L
469.4268 304.2660 L
479.3451 309.9923 L
469.4268 315.7186 L
471.3356 319.0247 L
481.2538 313.2984 L
481.2538 324.7510 L
479.3451 328.0571 L
481.2538 331.3631 L
481.2538 338.9982 L
485.0714 338.9982 L
485.0714 331.3631 L
481.2538 331.3631 L
471.3356 337.0894 L
469.4268 333.7834 L
479.3451 328.0571 L
469.4268 322.3308 L
471.3356 319.0247 L
481.2538 324.7510 L
485.0714 324.7510 L
485.0714 313.2984 L
481.2538 313.2984 L
479.3451 309.9923 L
481.2538 306.6862 L
481.2538 295.2336 L
471.3356 300.9599 L
469.4268 297.6539 L
479.3451 291.9276 L
469.4268 286.2013 L
471.3356 282.8952 L
481.2538 288.6215 L
485.0714 288.6215 L
485.0714 277.1689 L
481.2538 277.1689 L
479.3451 273.8628 L
s
0.0000 0.0000 0.0000 XA
0.0000 0.0000 0.0000 Xa
0 i 1 J 1 j 1.0000 w 4 M []0 d
0 D
465.6093 286.2013 m
455.6911 291.9276 L
453.7823 288.6215 L
463.7005 282.8952 L
453.7823 277.1689 L
455.6911 273.8628 L
465.6093 279.5891 L
469.4268 279.5891 L
469.4268 268.1365 L
465.6093 268.1365 L
463.7005 264.8304 L
453.7823 270.5567 L
455.6911 273.8628 L
465.6093 268.1365 L
465.6093 279.5891 L
463.7005 282.8952 L
465.6093 286.2013 L
469.4268 286.2013 L
469.4268 297.6539 L
465.6093 297.6539 L
463.7005 300.9599 L
453.7823 295.2336 L
455.6911 291.9276 L
465.6093 297.6539 L
465.6093 286.2013 L
S
0.0000 0.0000 0.0000 XA
0.0000 0.0000 0.0000 Xa
0 i 1 J 1 j 1.0000 w 4 M []0 d
0 D
449.9648 288.6215 m
448.0560 291.9276 L
449.9648 295.2336 L
453.7823 295.2336 L
453.7823 306.6862 L
449.9648 306.6862 L
448.0560 309.9923 L
438.1378 304.2660 L
440.0465 300.9599 L
449.9648 306.6862 L
449.9648 295.2336 L
440.0465 300.9599 L
438.1378 297.6539 L
448.0560 291.9276 L
438.1378 286.2013 L
440.0465 282.8952 L
449.9648 288.6215 L
453.7823 288.6215 L
453.7823 277.1689 L
449.9648 277.1689 L
448.0560 273.8628 L
449.9648 270.5567 L
449.9648 259.1042 L
440.0465 264.8304 L
438.1378 261.5244 L
448.0560 255.7981 L
441.4439 251.9805 L
443.3526 248.6745 L
449.9648 252.4920 L
448.0560 255.7981 L
449.9648 259.1042 L
453.7823 259.1042 L
453.7823 270.5567 L
449.9648 270.5567 L
440.0465 264.8304 L
438.1378 268.1365 L
448.0560 273.8628 L
438.1378 279.5891 L
440.0465 282.8952 L
449.9648 277.1689 L
449.9648 288.6215 L
s
0.0000 0.0000 0.0000 XA
0.0000 0.0000 0.0000 Xa
0 i 1 J 1 j 1.0000 w 4 M []0 d
0 D
463.7005 264.8304 m
453.7823 259.1042 L
455.6911 255.7981 L
465.6093 261.5244 L
463.7005 264.8304 L
s
0.0000 0.0000 0.0000 XA
0.0000 0.0000 0.0000 Xa
0 i 1 J 1 j 1.0000 w 4 M []0 d
0 D
403.0312 261.5244 m
401.1224 264.8304 L
391.2042 259.1042 L
393.1130 255.7981 L
403.0312 261.5244 L
s
0.0000 0.0000 0.0000 XA
0.0000 0.0000 0.0000 Xa
0 i 1 J 1 j 1.0000 w 4 M []0 d
0 D
387.3867 252.4920 m
380.7745 248.6745 L
378.8657 251.9805 L
385.4779 255.7981 L
387.3867 252.4920 L
s
0.0000 0.0000 0.0000 XA
0.0000 0.0000 0.0000 Xa
0 i 1 J 1 j 1.0000 w 4 M []0 d
0 D
385.4779 291.9276 m
387.3867 288.6215 L
387.3867 277.1689 L
391.2042 277.1689 L
391.2042 288.6215 L
387.3867 288.6215 L
380.7745 284.8040 L
378.8657 288.1100 L
385.4779 291.9276 L
s
0.0000 0.0000 0.0000 XA
0.0000 0.0000 0.0000 Xa
0 i 1 J 1 j 1.0000 w 4 M []0 d
0 D
465.6093 340.3955 m
465.6093 348.0306 L
469.4268 348.0306 L
469.4268 340.3955 L
465.6093 340.3955 L
s
0.0000 0.0000 0.0000 XA
0.0000 0.0000 0.0000 Xa
0 i 1 J 1 j 1.0000 w 4 M []0 d
0 D
403.0312 297.6539 m
401.1224 300.9599 L
403.0312 304.2660 L
406.8487 304.2660 L
406.8487 315.7186 L
403.0312 315.7186 L
401.1224 319.0247 L
391.2042 313.2984 L
393.1130 309.9923 L
403.0312 315.7186 L
403.0312 304.2660 L
393.1130 309.9923 L
391.2042 306.6862 L
401.1224 300.9599 L
391.2042 295.2336 L
393.1130 291.9276 L
403.0312 297.6539 L
406.8487 297.6539 L
406.8487 286.2013 L
403.0312 286.2013 L
401.1224 282.8952 L
403.0312 279.5891 L
403.0312 268.1365 L
393.1130 273.8628 L
391.2042 270.5567 L
401.1224 264.8304 L
403.0312 268.1365 L
406.8487 268.1365 L
406.8487 279.5891 L
403.0312 279.5891 L
393.1130 273.8628 L
391.2042 277.1689 L
401.1224 282.8952 L
391.2042 288.6215 L
393.1130 291.9276 L
403.0312 286.2013 L
403.0312 297.6539 L
s
0.0000 0.0000 0.0000 XA
0.0000 0.0000 0.0000 Xa
0 i 1 J 1 j 1.0000 w 4 M []0 d
0 D
418.6757 252.4920 m
416.7670 255.7981 L
418.6757 259.1042 L
422.4932 259.1042 L
422.4932 270.5567 L
418.6757 270.5567 L
416.7670 273.8628 L
406.8487 268.1365 L
408.7575 264.8304 L
418.6757 270.5567 L
418.6757 259.1042 L
408.7575 264.8304 L
406.8487 261.5244 L
416.7670 255.7981 L
410.1548 251.9805 L
412.0636 248.6745 L
418.6757 252.4920 L
s
0.0000 0.0000 0.0000 XA
0.0000 0.0000 0.0000 Xa
0 i 1 J 1 j 1.0000 w 4 M []0 d
0 D
286.9358 276.9250 m
301.1374 252.3272 L
S
0.0000 0.0000 0.0000 XA
0.0000 0.0000 0.0000 Xa
0 i 1 J 1 j 1.0000 w 4 M []0 d
0 D
297.9561 246.8171 m
269.5530 246.8171 L
S
0.0000 0.0000 0.0000 XA
0.0000 0.0000 0.0000 Xa
0 i 1 J 1 j 1.0000 w 4 M []0 d
0 D
286.9358 246.8171 m
286.9358 253.1796 L
280.5733 253.1796 L
280.5733 246.8171 L
S
0.0000 0.0000 0.0000 XA
0.0000 0.0000 0.0000 Xa
0 i 1 J 1 j 1.0000 w 4 M []0 d
0 D
266.3718 252.3272 m
280.5733 276.9250 L
S
0.0000 0.0000 0.0000 XA
0.0000 0.0000 0.0000 Xa
0 i 1 J 1 j 1.0000 w 4 M []0 d
0 D
290.1171 258.6897 m
286.9358 253.1796 L
297.9561 246.8171 L
301.1374 252.3272 L
290.1171 258.6897 L
s
0.0000 0.0000 0.0000 XA
0.0000 0.0000 0.0000 Xa
0 i 1 J 1 j 1.0000 w 4 M []0 d
0 D
260.8616 291.9789 m
275.0632 267.3811 L
S
0.0000 0.0000 0.0000 XA
0.0000 0.0000 0.0000 Xa
0 i 1 J 1 j 1.0000 w 4 M []0 d
0 D
271.8819 261.8710 m
243.4788 261.8710 L
S
0.0000 0.0000 0.0000 XA
0.0000 0.0000 0.0000 Xa
0 i 1 J 1 j 1.0000 w 4 M []0 d
0 D
260.8616 261.8710 m
260.8616 268.2336 L
254.4991 268.2336 L
254.4991 261.8710 L
S
0.0000 0.0000 0.0000 XA
0.0000 0.0000 0.0000 Xa
0 i 1 J 1 j 1.0000 w 4 M []0 d
0 D
240.2975 267.3811 m
254.4991 291.9789 L
S
0.0000 0.0000 0.0000 XA
0.0000 0.0000 0.0000 Xa
0 i 1 J 1 j 1.0000 w 4 M []0 d
0 D
245.8077 276.9250 m
251.3178 273.7437 L
254.4991 279.2538 L
248.9890 282.4351 L
S
0.0000 0.0000 0.0000 XA
0.0000 0.0000 0.0000 Xa
0 i 1 J 1 j 1.0000 w 4 M []0 d
0 D
313.0101 291.9789 m
327.2116 267.3811 L
S
0.0000 0.0000 0.0000 XA
0.0000 0.0000 0.0000 Xa
0 i 1 J 1 j 1.0000 w 4 M []0 d
0 D
318.5202 282.4351 m
313.0101 279.2538 L
316.1913 273.7437 L
321.7015 276.9250 L
S
0.0000 0.0000 0.0000 XA
0.0000 0.0000 0.0000 Xa
0 i 1 J 1 j 1.0000 w 4 M []0 d
0 D
324.0303 261.8710 m
295.6273 261.8710 L
S
0.0000 0.0000 0.0000 XA
0.0000 0.0000 0.0000 Xa
0 i 1 J 1 j 1.0000 w 4 M []0 d
0 D
313.0101 261.8710 m
313.0101 268.2336 L
306.6475 268.2336 L
306.6475 261.8710 L
S
0.0000 0.0000 0.0000 XA
0.0000 0.0000 0.0000 Xa
0 i 1 J 1 j 1.0000 w 4 M []0 d
0 D
292.4460 267.3811 m
306.6475 291.9789 L
S
0.0000 0.0000 0.0000 XA
0.0000 0.0000 0.0000 Xa
0 i 1 J 1 j 1.0000 w 4 M []0 d
0 D
316.1913 273.7437 m
313.0101 268.2336 L
324.0303 261.8710 L
327.2116 267.3811 L
316.1913 273.7437 L
s
0.0000 0.0000 0.0000 XA
0.0000 0.0000 0.0000 Xa
0 i 1 J 1 j 1.0000 w 4 M []0 d
0 D
313.0101 322.0868 m
327.2116 297.4890 L
S
0.0000 0.0000 0.0000 XA
0.0000 0.0000 0.0000 Xa
0 i 1 J 1 j 1.0000 w 4 M []0 d
0 D
318.5202 312.5430 m
313.0101 309.3617 L
316.1913 303.8516 L
321.7015 307.0329 L
S
0.0000 0.0000 0.0000 XA
0.0000 0.0000 0.0000 Xa
0 i 1 J 1 j 1.0000 w 4 M []0 d
0 D
324.0303 291.9789 m
295.6273 291.9789 L
S
0.0000 0.0000 0.0000 XA
0.0000 0.0000 0.0000 Xa
0 i 1 J 1 j 1.0000 w 4 M []0 d
0 D
292.4460 297.4890 m
306.6475 322.0868 L
S
0.0000 0.0000 0.0000 XA
0.0000 0.0000 0.0000 Xa
0 i 1 J 1 j 1.0000 w 4 M []0 d
0 D
316.1913 303.8516 m
313.0101 298.3415 L
324.0303 291.9789 L
327.2116 297.4890 L
316.1913 303.8516 L
s
0.0000 0.0000 0.0000 XA
0.0000 0.0000 0.0000 Xa
0 i 1 J 1 j 1.0000 w 4 M []0 d
0 D
286.9358 337.1408 m
301.1374 312.5430 L
S
0.0000 0.0000 0.0000 XA
0.0000 0.0000 0.0000 Xa
0 i 1 J 1 j 1.0000 w 4 M []0 d
0 D
292.4460 327.5970 m
286.9358 324.4157 L
290.1171 318.9056 L
295.6273 322.0868 L
S
0.0000 0.0000 0.0000 XA
0.0000 0.0000 0.0000 Xa
0 i 1 J 1 j 1.0000 w 4 M []0 d
0 D
297.9561 307.0329 m
269.5530 307.0329 L
S
0.0000 0.0000 0.0000 XA
0.0000 0.0000 0.0000 Xa
0 i 1 J 1 j 1.0000 w 4 M []0 d
0 D
266.3718 312.5430 m
280.5733 337.1408 L
S
0.0000 0.0000 0.0000 XA
0.0000 0.0000 0.0000 Xa
0 i 1 J 1 j 1.0000 w 4 M []0 d
0 D
271.8819 322.0868 m
277.3920 318.9056 L
280.5733 324.4157 L
275.0632 327.5970 L
S
0.0000 0.0000 0.0000 XA
0.0000 0.0000 0.0000 Xa
0 i 1 J 1 j 1.0000 w 4 M []0 d
0 D
280.5733 324.4157 m
286.9358 324.4157 L
286.9358 337.1408 L
280.5733 337.1408 L
280.5733 324.4157 L
s
0.0000 0.0000 0.0000 XA
0.0000 0.0000 0.0000 Xa
0 i 1 J 1 j 1.0000 w 4 M []0 d
0 D
286.9358 307.0329 m
301.1374 282.4351 L
S
0.0000 0.0000 0.0000 XA
0.0000 0.0000 0.0000 Xa
0 i 1 J 1 j 1.0000 w 4 M []0 d
0 D
297.9561 276.9250 m
269.5530 276.9250 L
S
0.0000 0.0000 0.0000 XA
0.0000 0.0000 0.0000 Xa
0 i 1 J 1 j 1.0000 w 4 M []0 d
0 D
266.3718 282.4351 m
280.5733 307.0329 L
S
0.0000 0.0000 0.0000 XA
0.0000 0.0000 0.0000 Xa
0 i 1 J 1 j 1.0000 w 4 M []0 d
0 D
260.8616 322.0868 m
275.0632 297.4890 L
S
0.0000 0.0000 0.0000 XA
0.0000 0.0000 0.0000 Xa
0 i 1 J 1 j 1.0000 w 4 M []0 d
0 D
271.8819 291.9789 m
243.4788 291.9789 L
S
0.0000 0.0000 0.0000 XA
0.0000 0.0000 0.0000 Xa
0 i 1 J 1 j 1.0000 w 4 M []0 d
0 D
240.2975 297.4890 m
254.4991 322.0868 L
S
0.0000 0.0000 0.0000 XA
0.0000 0.0000 0.0000 Xa
0 i 1 J 1 j 1.0000 w 4 M []0 d
0 D
245.8077 307.0329 m
251.3178 303.8516 L
254.4991 309.3617 L
248.9890 312.5430 L
S
0.0000 0.0000 0.0000 XA
0.0000 0.0000 0.0000 Xa
0 i 1 J 1 j 1.0000 w 4 M []0 d
0 D
254.4991 309.3617 m
260.8616 309.3617 L
260.8616 322.0868 L
254.4991 322.0868 L
254.4991 309.3617 L
s
0.0000 0.0000 0.0000 XA
0.0000 0.0000 0.0000 Xa
0 i 1 J 1 j 1.0000 w 4 M []0 d
0 D
188.7623 307.1279 m
202.9639 282.5301 L
S
0.0000 0.0000 0.0000 XA
0.0000 0.0000 0.0000 Xa
0 i 1 J 1 j 1.0000 w 4 M []0 d
0 D
194.2724 297.5840 m
188.7623 294.4028 L
191.9436 288.8926 L
197.4537 292.0739 L
S
0.0000 0.0000 0.0000 XA
0.0000 0.0000 0.0000 Xa
0 i 1 J 1 j 1.0000 w 4 M []0 d
0 D
199.7826 277.0200 m
171.3795 277.0200 L
S
0.0000 0.0000 0.0000 XA
0.0000 0.0000 0.0000 Xa
0 i 1 J 1 j 1.0000 w 4 M []0 d
0 D
188.7623 277.0200 m
188.7623 283.3825 L
182.3998 283.3825 L
182.3998 277.0200 L
S
0.0000 0.0000 0.0000 XA
0.0000 0.0000 0.0000 Xa
0 i 1 J 1 j 1.0000 w 4 M []0 d
0 D
168.1982 282.5301 m
182.3998 307.1279 L
S
0.0000 0.0000 0.0000 XA
0.0000 0.0000 0.0000 Xa
0 i 1 J 1 j 1.0000 w 4 M []0 d
0 D
173.7084 292.0739 m
179.2185 288.8926 L
182.3998 294.4028 L
176.8896 297.5840 L
S
0.0000 0.0000 0.0000 XA
0.0000 0.0000 0.0000 Xa
0 i 1 J 1 j 1.0000 w 4 M []0 d
0 D
191.9436 288.8926 m
188.7623 283.3825 L
199.7826 277.0200 L
202.9639 282.5301 L
191.9436 288.8926 L
s
0.0000 0.0000 0.0000 XA
0.0000 0.0000 0.0000 Xa
0 i 1 J 1 j 1.0000 w 4 M []0 d
0 D
280.5733 253.1796 m
277.3920 258.6897 L
280.5733 264.1999 L
280.5733 283.2875 L
286.9358 283.2875 L
286.9358 264.1999 L
280.5733 264.1999 L
264.0429 273.7437 L
260.8616 268.2336 L
277.3920 258.6897 L
266.3718 252.3272 L
269.5530 246.8171 L
280.5733 253.1796 L
s
0.0000 0.0000 0.0000 XA
0.0000 0.0000 0.0000 Xa
0 i 1 J 1 j 1.0000 w 4 M []0 d
0 D
254.4991 268.2336 m
251.3178 273.7437 L
240.2975 267.3811 L
243.4788 261.8710 L
254.4991 268.2336 L
s
0.0000 0.0000 0.0000 XA
0.0000 0.0000 0.0000 Xa
0 i 1 J 1 j 1.0000 w 4 M []0 d
0 D
306.6475 268.2336 m
290.1171 258.6897 L
286.9358 264.1999 L
303.4662 273.7437 L
306.6475 268.2336 L
s
0.0000 0.0000 0.0000 XA
0.0000 0.0000 0.0000 Xa
0 i 1 J 1 j 1.0000 w 4 M []0 d
0 D
280.5733 294.3078 m
286.9358 294.3078 L
286.9358 313.3954 L
280.5733 313.3954 L
277.3920 318.9056 L
260.8616 309.3617 L
264.0429 303.8516 L
280.5733 313.3954 L
280.5733 294.3078 L
s
0.0000 0.0000 0.0000 XA
0.0000 0.0000 0.0000 Xa
0 i 1 J 1 j 1.0000 w 4 M []0 d
0 D
277.3920 288.7976 m
280.5733 283.2875 L
264.0429 273.7437 L
260.8616 279.2538 L
277.3920 288.7976 L
280.5733 294.3078 L
264.0429 303.8516 L
260.8616 298.3415 L
277.3920 288.7976 L
s
0.0000 0.0000 0.0000 XA
0.0000 0.0000 0.0000 Xa
0 i 1 J 1 j 1.0000 w 4 M []0 d
0 D
306.6475 279.2538 m
290.1171 288.7976 L
286.9358 283.2875 L
303.4662 273.7437 L
306.6475 279.2538 L
s
0.0000 0.0000 0.0000 XA
0.0000 0.0000 0.0000 Xa
0 i 1 J 1 j 1.0000 w 4 M []0 d
0 D
251.3178 303.8516 m
240.2975 297.4890 L
243.4788 291.9789 L
254.4991 298.3415 L
254.4991 279.2538 L
260.8616 279.2538 L
260.8616 298.3415 L
254.4991 298.3415 L
251.3178 303.8516 L
s
0.0000 0.0000 0.0000 XA
0.0000 0.0000 0.0000 Xa
0 i 1 J 1 j 1.0000 w 4 M []0 d
0 D
303.4662 303.8516 m
306.6475 298.3415 L
306.6475 279.2538 L
313.0101 279.2538 L
313.0101 298.3415 L
306.6475 298.3415 L
290.1171 288.7976 L
286.9358 294.3078 L
303.4662 303.8516 L
s
0.0000 0.0000 0.0000 XA
0.0000 0.0000 0.0000 Xa
0 i 1 J 1 j 1.0000 w 4 M []0 d
0 D
290.1171 318.9056 m
286.9358 313.3954 L
303.4662 303.8516 L
306.6475 309.3617 L
306.6475 322.0868 L
313.0101 322.0868 L
313.0101 309.3617 L
306.6475 309.3617 L
290.1171 318.9056 L
s
0.0000 0.0000 0.0000 XA
0.0000 0.0000 0.0000 Xa
0 i 1 J 1 j 1.0000 w 4 M []0 d
0 D
188.7623 294.4028 m
182.3998 294.4028 L
182.3998 307.1279 L
188.7623 307.1279 L
188.7623 294.4028 L
s
0.0000 0.0000 0.0000 XA
0.0000 0.0000 0.0000 Xa
0 i 1 J 1 j 1.0000 w 4 M []0 d
0 D
179.2185 288.8926 m
168.1982 282.5301 L
171.3795 277.0200 L
182.3998 283.3825 L
179.2185 288.8926 L
s
LB
%AI5_EndLayer--
%%PageTrailer
gsave annotatepage grestore showpage
%%Trailer
Adobe_IllustratorA_AI3 /terminate get exec
Adobe_typography_AI3 /terminate get exec
Adobe_customcolor /terminate get exec
Adobe_cshow /terminate get exec
Adobe_cmykcolor /terminate get exec
Adobe_packedarray /terminate get exec
%%EOF
