;HEADER
;Start_gcode
G21                     ; Set to metric [change to G20 if you want Imperial]
G90                     ; Force coordinates to be absolute relative to the origin
G28                     ; Home X/Y/Z axis
M117 Printing...
;ENDHEADER
;Layer #
G0 X398.13 Y237.45 Z80.00 F5000
G1 X398.13 Y237.45 Z8.00 F3000
G1 X403.58 Y233.20 Z8.00 F3000
G1 X409.46 Y229.59 Z8.00 F3000
G1 X415.71 Y226.67 Z8.00 F3000
G1 X422.25 Y224.45 Z8.00 F3000
G1 X429.00 Y222.99 Z8.00 F3000
G1 X435.86 Y222.29 Z8.00 F3000
G1 X442.77 Y222.36 Z8.00 F3000
G1 X449.62 Y223.21 Z8.00 F3000
G1 X456.33 Y224.82 Z8.00 F3000
G1 X462.82 Y227.17 Z8.00 F3000
G1 X469.01 Y230.23 Z8.00 F3000
G1 X474.81 Y233.96 Z8.00 F3000
G1 X480.17 Y238.32 Z8.00 F3000
G1 X484.99 Y243.26 Z8.00 F3000
G1 X489.24 Y248.70 Z8.00 F3000
G1 X492.85 Y254.58 Z8.00 F3000
G1 X495.78 Y260.83 Z8.00 F3000
G1 X497.99 Y267.37 Z8.00 F3000
G1 X499.45 Y274.12 Z8.00 F3000
G1 X500.15 Y280.99 Z8.00 F3000
G1 X500.08 Y287.89 Z8.00 F3000
G1 X499.23 Y294.74 Z8.00 F3000
G1 X497.63 Y301.45 Z8.00 F3000
G1 X495.28 Y307.95 Z8.00 F3000
G1 X492.22 Y314.13 Z8.00 F3000
G1 X488.48 Y319.94 Z8.00 F3000
G1 X484.12 Y325.29 Z8.00 F3000
G1 X479.19 Y330.12 Z8.00 F3000
G1 X473.75 Y334.36 Z8.00 F3000
G1 X467.86 Y337.97 Z8.00 F3000
G1 X461.61 Y340.90 Z8.00 F3000
G1 X455.07 Y343.11 Z8.00 F3000
G1 X448.33 Y344.58 Z8.00 F3000
G1 X441.46 Y345.28 Z8.00 F3000
G1 X434.55 Y345.20 Z8.00 F3000
G1 X427.70 Y344.36 Z8.00 F3000
G1 X420.99 Y342.75 Z8.00 F3000
G1 X414.50 Y340.40 Z8.00 F3000
G1 X408.31 Y337.34 Z8.00 F3000
G1 X402.51 Y333.61 Z8.00 F3000
G1 X397.16 Y329.24 Z8.00 F3000
G1 X392.33 Y324.31 Z8.00 F3000
G1 X388.08 Y318.87 Z8.00 F3000
G1 X384.47 Y312.99 Z8.00 F3000
G1 X381.54 Y306.73 Z8.00 F3000
G1 X379.33 Y300.19 Z8.00 F3000
G1 X377.87 Y293.45 Z8.00 F3000
G1 X377.17 Y286.58 Z8.00 F3000
G1 X377.24 Y279.68 Z8.00 F3000
G1 X378.09 Y272.83 Z8.00 F3000
G1 X379.69 Y266.11 Z8.00 F3000
G1 X382.04 Y259.62 Z8.00 F3000
G1 X385.10 Y253.44 Z8.00 F3000
G1 X388.84 Y247.63 Z8.00 F3000
G1 X393.20 Y242.28 Z8.00 F3000
G1 X398.13 Y237.45 Z8.00 F3000
G0 X398.13 Y237.45 Z80.00 F5000
G0 X386.52 Y411.17 Z80.00 F5000
G1 X386.52 Y411.17 Z8.00 F3000
G1 X391.96 Y406.93 Z8.00 F3000
G1 X397.85 Y403.32 Z8.00 F3000
G1 X404.10 Y400.39 Z8.00 F3000
G1 X410.64 Y398.18 Z8.00 F3000
G1 X417.38 Y396.71 Z8.00 F3000
G1 X424.25 Y396.01 Z8.00 F3000
G1 X431.15 Y396.09 Z8.00 F3000
G1 X438.00 Y396.93 Z8.00 F3000
G1 X444.72 Y398.54 Z8.00 F3000
G1 X451.21 Y400.89 Z8.00 F3000
G1 X457.40 Y403.95 Z8.00 F3000
G1 X463.20 Y407.68 Z8.00 F3000
G1 X468.55 Y412.05 Z8.00 F3000
G1 X473.38 Y416.98 Z8.00 F3000
G1 X477.63 Y422.42 Z8.00 F3000
G1 X481.24 Y428.31 Z8.00 F3000
G1 X484.17 Y434.56 Z8.00 F3000
G1 X486.38 Y441.10 Z8.00 F3000
G1 X487.84 Y447.84 Z8.00 F3000
G1 X488.54 Y454.71 Z8.00 F3000
G1 X488.47 Y461.61 Z8.00 F3000
G1 X487.62 Y468.46 Z8.00 F3000
G1 X486.01 Y475.18 Z8.00 F3000
G1 X483.67 Y481.67 Z8.00 F3000
G1 X480.60 Y487.85 Z8.00 F3000
G1 X476.87 Y493.66 Z8.00 F3000
G1 X472.51 Y499.01 Z8.00 F3000
G1 X467.58 Y503.84 Z8.00 F3000
G1 X462.13 Y508.09 Z8.00 F3000
G1 X456.25 Y511.70 Z8.00 F3000
G1 X450.00 Y514.63 Z8.00 F3000
G1 X443.46 Y516.84 Z8.00 F3000
G1 X436.71 Y518.30 Z8.00 F3000
G1 X429.84 Y519.00 Z8.00 F3000
G1 X422.94 Y518.93 Z8.00 F3000
G1 X416.09 Y518.08 Z8.00 F3000
G1 X409.38 Y516.47 Z8.00 F3000
G1 X402.89 Y514.12 Z8.00 F3000
G1 X396.70 Y511.06 Z8.00 F3000
G1 X390.89 Y507.33 Z8.00 F3000
G1 X385.54 Y502.97 Z8.00 F3000
G1 X380.71 Y498.03 Z8.00 F3000
G1 X376.47 Y492.59 Z8.00 F3000
G1 X372.86 Y486.71 Z8.00 F3000
G1 X369.93 Y480.46 Z8.00 F3000
G1 X367.72 Y473.92 Z8.00 F3000
G1 X366.25 Y467.17 Z8.00 F3000
G1 X365.55 Y460.30 Z8.00 F3000
G1 X365.63 Y453.40 Z8.00 F3000
G1 X366.47 Y446.55 Z8.00 F3000
G1 X368.08 Y439.84 Z8.00 F3000
G1 X370.43 Y433.35 Z8.00 F3000
G1 X373.49 Y427.16 Z8.00 F3000
G1 X377.23 Y421.35 Z8.00 F3000
G1 X381.59 Y416.00 Z8.00 F3000
G1 X386.52 Y411.17 Z8.00 F3000
G0 X386.52 Y411.17 Z80.00 F5000
G0 X429.20 Y588.52 Z80.00 F5000
G1 X429.20 Y588.52 Z8.00 F3000
G1 X444.48 Y567.47 Z8.00 F3000
G1 X459.60 Y547.33 Z8.00 F3000
G1 X474.32 Y528.45 Z8.00 F3000
G1 X488.42 Y511.12 Z8.00 F3000
G1 X501.68 Y495.63 Z8.00 F3000
G1 X513.91 Y482.18 Z8.00 F3000
G1 X524.94 Y470.95 Z8.00 F3000
G1 X534.67 Y461.99 Z8.00 F3000
G1 X538.81 Y457.96 Z8.00 F3000
G1 X540.58 Y455.85 Z8.00 F3000
G1 X542.15 Y453.67 Z8.00 F3000
G1 X543.50 Y451.43 Z8.00 F3000
G1 X544.65 Y449.13 Z8.00 F3000
G1 X545.58 Y446.77 Z8.00 F3000
G1 X546.29 Y444.35 Z8.00 F3000
G1 X546.78 Y441.87 Z8.00 F3000
G1 X547.06 Y439.34 Z8.00 F3000
G1 X547.10 Y436.76 Z8.00 F3000
G1 X546.93 Y434.13 Z8.00 F3000
G1 X546.52 Y431.45 Z8.00 F3000
G1 X545.90 Y428.72 Z8.00 F3000
G1 X543.96 Y423.15 Z8.00 F3000
G1 X541.13 Y417.42 Z8.00 F3000
G1 X537.41 Y411.56 Z8.00 F3000
G1 X532.83 Y405.60 Z8.00 F3000
G1 X527.41 Y399.55 Z8.00 F3000
G1 X521.17 Y393.45 Z8.00 F3000
G1 X514.17 Y387.30 Z8.00 F3000
G1 X506.43 Y381.15 Z8.00 F3000
G1 X498.00 Y375.00 Z8.00 F3000
G1 X507.25 Y369.18 Z8.00 F3000
G1 X515.82 Y363.29 Z8.00 F3000
G1 X523.66 Y357.36 Z8.00 F3000
G1 X530.72 Y351.41 Z8.00 F3000
G1 X536.97 Y345.45 Z8.00 F3000
G1 X542.37 Y339.52 Z8.00 F3000
G1 X546.90 Y333.63 Z8.00 F3000
G1 X550.52 Y327.80 Z8.00 F3000
G1 X553.23 Y322.07 Z8.00 F3000
G1 X554.24 Y319.24 Z8.00 F3000
G1 X555.02 Y316.44 Z8.00 F3000
G1 X555.57 Y313.67 Z8.00 F3000
G1 X555.89 Y310.94 Z8.00 F3000
G1 X555.98 Y308.24 Z8.00 F3000
G1 X555.84 Y305.59 Z8.00 F3000
G1 X555.47 Y302.98 Z8.00 F3000
G1 X554.88 Y300.41 Z8.00 F3000
G1 X554.07 Y297.88 Z8.00 F3000
G1 X553.03 Y295.41 Z8.00 F3000
G1 X551.78 Y292.98 Z8.00 F3000
G1 X550.32 Y290.61 Z8.00 F3000
G1 X546.78 Y286.01 Z8.00 F3000
G1 X542.70 Y281.17 Z8.00 F3000
G1 X538.37 Y275.59 Z8.00 F3000
G1 X533.79 Y269.30 Z8.00 F3000
G1 X528.98 Y262.28 Z8.00 F3000
G1 X518.71 Y246.18 Z8.00 F3000
G1 X507.71 Y227.45 Z8.00 F3000
G1 X496.12 Y206.36 Z8.00 F3000
G1 X484.13 Y183.24 Z8.00 F3000
G1 X471.92 Y158.49 Z8.00 F3000
G1 X459.68 Y132.50 Z8.00 F3000
G0 X459.68 Y132.50 Z80.00 F5000
G0 X348.20 Y168.68 Z80.00 F5000
G1 X348.20 Y168.68 Z8.00 F3000
G1 X335.90 Y168.24 Z8.00 F3000
G1 X323.60 Y168.58 Z8.00 F3000
G1 X311.35 Y169.69 Z8.00 F3000
G1 X299.19 Y171.57 Z8.00 F3000
G1 X287.17 Y174.20 Z8.00 F3000
G1 X275.34 Y177.59 Z8.00 F3000
G1 X263.74 Y181.71 Z8.00 F3000
G1 X252.43 Y186.56 Z8.00 F3000
G1 X241.45 Y192.10 Z8.00 F3000
G1 X230.83 Y198.32 Z8.00 F3000
G1 X220.63 Y205.20 Z8.00 F3000
G1 X210.87 Y212.70 Z8.00 F3000
G1 X201.61 Y220.80 Z8.00 F3000
G1 X192.88 Y229.47 Z8.00 F3000
G1 X184.70 Y238.67 Z8.00 F3000
G1 X177.12 Y248.36 Z8.00 F3000
G1 X170.17 Y258.51 Z8.00 F3000
G1 X163.86 Y269.08 Z8.00 F3000
G1 X158.23 Y280.02 Z8.00 F3000
G1 X153.30 Y291.29 Z8.00 F3000
G1 X149.09 Y302.86 Z8.00 F3000
G1 X145.61 Y314.66 Z8.00 F3000
G1 X142.88 Y326.66 Z8.00 F3000
G1 X140.90 Y338.80 Z8.00 F3000
G1 X139.70 Y351.05 Z8.00 F3000
G1 X139.26 Y363.35 Z8.00 F3000
G1 X139.60 Y375.65 Z8.00 F3000
G1 X140.71 Y387.90 Z8.00 F3000
G1 X142.59 Y400.06 Z8.00 F3000
G1 X145.23 Y412.08 Z8.00 F3000
G1 X148.61 Y423.91 Z8.00 F3000
G1 X152.74 Y435.50 Z8.00 F3000
G1 X157.58 Y446.82 Z8.00 F3000
G1 X163.12 Y457.80 Z8.00 F3000
G1 X169.34 Y468.42 Z8.00 F3000
G1 X176.22 Y478.62 Z8.00 F3000
G1 X183.72 Y488.38 Z8.00 F3000
G1 X191.83 Y497.64 Z8.00 F3000
G1 X200.49 Y506.37 Z8.00 F3000
G1 X209.69 Y514.55 Z8.00 F3000
G1 X219.38 Y522.13 Z8.00 F3000
G1 X229.53 Y529.08 Z8.00 F3000
G1 X240.10 Y535.39 Z8.00 F3000
G1 X251.04 Y541.02 Z8.00 F3000
G1 X262.32 Y545.95 Z8.00 F3000
G1 X273.88 Y550.16 Z8.00 F3000
G1 X285.68 Y553.64 Z8.00 F3000
G1 X297.68 Y556.37 Z8.00 F3000
G1 X309.83 Y558.34 Z8.00 F3000
G1 X322.07 Y559.55 Z8.00 F3000
G0 X322.07 Y559.55 Z80.00 F5000
G0 X406.06 Y445.20 Z80.00 F5000
G1 X406.06 Y445.20 Z8.00 F3000
G1 X408.59 Y441.65 Z8.00 F3000
G1 X411.72 Y438.61 Z8.00 F3000
G1 X415.34 Y436.17 Z8.00 F3000
G1 X419.34 Y434.43 Z8.00 F3000
G1 X423.58 Y433.42 Z8.00 F3000
G1 X427.94 Y433.19 Z8.00 F3000
G1 X432.27 Y433.74 Z8.00 F3000
G1 X436.43 Y435.05 Z8.00 F3000
G1 X440.29 Y437.09 Z8.00 F3000
G1 X443.72 Y439.78 Z8.00 F3000
G1 X446.62 Y443.04 Z8.00 F3000
G1 X448.88 Y446.77 Z8.00 F3000
G1 X450.45 Y450.84 Z8.00 F3000
G1 X451.26 Y455.13 Z8.00 F3000
G1 X451.30 Y459.49 Z8.00 F3000
G1 X450.56 Y463.79 Z8.00 F3000
G1 X449.06 Y467.88 Z8.00 F3000
G1 X446.85 Y471.65 Z8.00 F3000
G1 X444.01 Y474.96 Z8.00 F3000
G1 X440.62 Y477.70 Z8.00 F3000
G1 X436.79 Y479.80 Z8.00 F3000
G1 X432.66 Y481.18 Z8.00 F3000
G1 X428.34 Y481.80 Z8.00 F3000
G1 X423.98 Y481.64 Z8.00 F3000
G1 X419.72 Y480.71 Z8.00 F3000
G1 X415.69 Y479.03 Z8.00 F3000
G1 X412.03 Y476.65 Z8.00 F3000
G1 X408.85 Y473.66 Z8.00 F3000
G1 X406.26 Y470.16 Z8.00 F3000
G1 X404.34 Y466.24 Z8.00 F3000
G1 X403.14 Y462.05 Z8.00 F3000
G1 X402.72 Y457.70 Z8.00 F3000
G1 X403.07 Y453.36 Z8.00 F3000
G1 X404.20 Y449.14 Z8.00 F3000
G1 X406.06 Y445.20 Z8.00 F3000
G0 X406.06 Y445.20 Z80.00 F5000
G0 X418.40 Y260.62 Z80.00 F5000
G1 X418.40 Y260.62 Z8.00 F3000
G1 X422.38 Y257.67 Z8.00 F3000
G1 X426.78 Y255.39 Z8.00 F3000
G1 X431.48 Y253.85 Z8.00 F3000
G1 X436.38 Y253.09 Z8.00 F3000
G1 X441.33 Y253.12 Z8.00 F3000
G1 X446.22 Y253.95 Z8.00 F3000
G1 X450.90 Y255.55 Z8.00 F3000
G1 X455.28 Y257.88 Z8.00 F3000
G1 X459.22 Y260.88 Z8.00 F3000
G1 X462.62 Y264.47 Z8.00 F3000
G1 X465.41 Y268.56 Z8.00 F3000
G1 X467.51 Y273.05 Z8.00 F3000
G1 X468.86 Y277.82 Z8.00 F3000
G1 X469.42 Y282.74 Z8.00 F3000
G1 X469.19 Y287.69 Z8.00 F3000
G1 X468.17 Y292.53 Z8.00 F3000
G1 X466.38 Y297.15 Z8.00 F3000
G1 X463.88 Y301.43 Z8.00 F3000
G1 X460.72 Y305.25 Z8.00 F3000
G1 X456.99 Y308.51 Z8.00 F3000
G1 X452.79 Y311.13 Z8.00 F3000
G1 X448.22 Y313.04 Z8.00 F3000
G1 X443.41 Y314.19 Z8.00 F3000
G1 X438.47 Y314.56 Z8.00 F3000
G1 X433.53 Y314.13 Z8.00 F3000
G1 X428.73 Y312.92 Z8.00 F3000
G1 X424.18 Y310.95 Z8.00 F3000
G1 X420.02 Y308.27 Z8.00 F3000
G1 X416.33 Y304.96 Z8.00 F3000
G1 X413.22 Y301.11 Z8.00 F3000
G1 X410.77 Y296.80 Z8.00 F3000
G1 X409.04 Y292.16 Z8.00 F3000
G1 X408.08 Y287.30 Z8.00 F3000
G1 X407.92 Y282.35 Z8.00 F3000
G1 X408.54 Y277.44 Z8.00 F3000
G1 X409.95 Y272.69 Z8.00 F3000
G1 X412.10 Y268.23 Z8.00 F3000
G1 X414.94 Y264.17 Z8.00 F3000
G1 X418.40 Y260.62 Z8.00 F3000
G0 X418.40 Y260.62 Z80.00 F5000
G0 X345.99 Y364.84 Z80.00 F5000
G1 X345.99 Y364.84 Z8.00 F3000
G1 X273.62 Y305.47 Z8.00 F3000
G1 X269.99 Y359.76 Z8.00 F3000
G1 X345.99 Y364.84 Z8.00 F3000
G0 X345.99 Y364.84 Z80.00 F5000
G0 X155.64 Y275.77 Z80.00 F5000
G1 X155.64 Y275.77 Z8.00 F3000
G1 X152.65 Y262.28 Z8.00 F3000
G1 X150.02 Y249.49 Z8.00 F3000
G1 X147.75 Y237.41 Z8.00 F3000
G1 X145.84 Y226.04 Z8.00 F3000
G1 X144.28 Y215.37 Z8.00 F3000
G1 X143.09 Y205.41 Z8.00 F3000
G1 X142.25 Y196.15 Z8.00 F3000
G1 X141.76 Y187.59 Z8.00 F3000
G1 X141.64 Y179.75 Z8.00 F3000
G1 X141.87 Y172.61 Z8.00 F3000
G1 X142.46 Y166.17 Z8.00 F3000
G1 X143.41 Y160.44 Z8.00 F3000
G1 X144.71 Y155.41 Z8.00 F3000
G1 X146.38 Y151.09 Z8.00 F3000
G1 X148.40 Y147.48 Z8.00 F3000
G1 X150.77 Y144.57 Z8.00 F3000
G1 X153.51 Y142.37 Z8.00 F3000
G1 X156.60 Y140.87 Z8.00 F3000
G1 X160.05 Y140.08 Z8.00 F3000
G1 X163.86 Y139.99 Z8.00 F3000
G1 X168.03 Y140.61 Z8.00 F3000
G1 X172.55 Y141.94 Z8.00 F3000
G1 X177.43 Y143.97 Z8.00 F3000
G1 X182.67 Y146.70 Z8.00 F3000
G1 X188.26 Y150.15 Z8.00 F3000
G1 X194.22 Y154.29 Z8.00 F3000
G1 X200.53 Y159.14 Z8.00 F3000
G1 X207.20 Y164.70 Z8.00 F3000
G1 X214.22 Y170.97 Z8.00 F3000
G1 X221.61 Y177.94 Z8.00 F3000
G1 X229.35 Y185.61 Z8.00 F3000
G1 X237.45 Y193.99 Z8.00 F3000
G0 X237.45 Y193.99 Z80.00 F5000
G0 X191.84 Y223.66 Z80.00 F5000
G1 X191.84 Y223.66 Z8.00 F3000
G1 X172.30 Y189.64 Z8.00 F3000
G0 X172.30 Y189.64 Z80.00 F5000
;FOOTER
; end_gcode
G28 X Y
G0 Z100 				; HOME
G90                             ; absolute positioning
;ENDFOOTER
