;HEADER
;Start_gcode
G21                     ; Set to metric [change to G20 if you want Imperial]
G90                     ; Force coordinates to be absolute relative to the origin
G28                     ; Home X/Y/Z axis
M117 Printing...
;ENDHEADER
;Layer # 
G0 X377.90 Y81.59 Z80.00 F5000 
G1 X377.90 Y81.59 Z6.00 F3000 
G1 X397.12 Y264.45 Z6.00 F3000 
G0 X397.12 Y264.45 Z80.00 F5000 
G0 X389.65 Y259.60 Z80.00 F5000 
G1 X389.65 Y259.60 Z6.00 F3000 
G1 X331.39 Y80.29 Z6.00 F3000 
G0 X331.39 Y80.29 Z80.00 F5000 
G0 X282.71 Y88.23 Z80.00 F5000 
G1 X282.71 Y88.23 Z6.00 F3000 
G1 X378.56 Y254.25 Z6.00 F3000 
G0 X378.56 Y254.25 Z80.00 F5000 
G0 X187.46 Y136.91 Z80.00 F5000 
G1 X187.46 Y136.91 Z6.00 F3000 
G1 X341.17 Y248.59 Z6.00 F3000 
G0 X341.17 Y248.59 Z80.00 F5000 
G0 X362.47 Y249.67 Z80.00 F5000 
G1 X362.47 Y249.67 Z6.00 F3000 
G1 X233.83 Y106.80 Z6.00 F3000 
G0 X233.83 Y106.80 Z80.00 F5000 
G0 X402.33 Y268.56 Z80.00 F5000 
G1 X402.33 Y268.56 Z6.00 F3000 
G1 X421.03 Y90.67 Z6.00 F3000 
G0 X421.03 Y90.67 Z80.00 F5000 
G0 X460.09 Y106.18 Z80.00 F5000 
G1 X460.09 Y106.18 Z6.00 F3000 
G1 X406.19 Y272.07 Z6.00 F3000 
G0 X406.19 Y272.07 Z80.00 F5000 
G0 X409.25 Y275.18 Z80.00 F5000 
G1 X409.25 Y275.18 Z6.00 F3000 
G1 X494.78 Y127.03 Z6.00 F3000 
G0 X494.78 Y127.03 Z80.00 F5000 
G0 X414.16 Y280.96 Z80.00 F5000 
G1 X414.16 Y280.96 Z6.00 F3000 
G1 X550.57 Y181.86 Z6.00 F3000 
G0 X550.57 Y181.86 Z80.00 F5000 
G0 X571.39 Y214.96 Z80.00 F5000 
G1 X571.39 Y214.96 Z6.00 F3000 
G1 X416.39 Y283.97 Z6.00 F3000 
G0 X416.39 Y283.97 Z80.00 F5000 
G0 X418.64 Y287.32 Z80.00 F5000 
G1 X418.64 Y287.32 Z6.00 F3000 
G1 X587.07 Y251.51 Z6.00 F3000 
G0 X587.07 Y251.51 Z80.00 F5000 
G0 X597.04 Y291.29 Z80.00 F5000 
G1 X597.04 Y291.29 Z6.00 F3000 
G1 X421.02 Y291.29 Z6.00 F3000 
G0 X421.02 Y291.29 Z80.00 F5000 
G0 X423.64 Y296.33 Z80.00 F5000 
G1 X423.64 Y296.33 Z6.00 F3000 
G1 X600.44 Y333.91 Z6.00 F3000 
G0 X600.44 Y333.91 Z80.00 F5000 
G0 X596.21 Y378.68 Z80.00 F5000 
G1 X596.21 Y378.68 Z6.00 F3000 
G1 X426.53 Y303.13 Z6.00 F3000 
G0 X426.53 Y303.13 Z80.00 F5000 
G0 X429.48 Y312.75 Z80.00 F5000 
G1 X429.48 Y312.75 Z6.00 F3000 
G1 X583.19 Y424.43 Z6.00 F3000 
G0 X583.19 Y424.43 Z80.00 F5000 
G0 X560.29 Y469.37 Z80.00 F5000 
G1 X560.29 Y469.37 Z6.00 F3000 
G1 X431.64 Y326.49 Z6.00 F3000 
G0 X431.64 Y326.49 Z80.00 F5000 
G0 X430.95 Y345.00 Z80.00 F5000 
G1 X430.95 Y345.00 Z6.00 F3000 
G1 X526.80 Y511.01 Z6.00 F3000 
G0 X526.80 Y511.01 Z80.00 F5000 
G0 X482.80 Y546.31 Z80.00 F5000 
G1 X482.80 Y546.31 Z6.00 F3000 
G1 X424.54 Y366.99 Z6.00 F3000 
G0 X424.54 Y366.99 Z80.00 F5000 
G0 X410.22 Y389.03 Z80.00 F5000 
G1 X410.22 Y389.03 Z6.00 F3000 
G1 X429.44 Y571.89 Z6.00 F3000 
G0 X429.44 Y571.89 Z80.00 F5000 
G0 X369.12 Y584.58 Z80.00 F5000 
G1 X369.12 Y584.58 Z6.00 F3000 
G1 X387.81 Y406.70 Z6.00 F3000 
G0 X387.81 Y406.70 Z80.00 F5000 
G0 X359.39 Y416.09 Z80.00 F5000 
G1 X359.39 Y416.09 Z6.00 F3000 
G1 X305.49 Y581.98 Z6.00 F3000 
G0 X305.49 Y581.98 Z80.00 F5000 
G0 X243.12 Y562.92 Z80.00 F5000 
G1 X243.12 Y562.92 Z6.00 F3000 
G1 X328.65 Y414.77 Z6.00 F3000 
G0 X328.65 Y414.77 Z80.00 F5000 
G0 X300.04 Y402.24 Z80.00 F5000 
G1 X300.04 Y402.24 Z6.00 F3000 
G1 X186.90 Y527.90 Z6.00 F3000 
G0 X186.90 Y527.90 Z80.00 F5000 
G0 X141.44 Y479.10 Z80.00 F5000 
G1 X141.44 Y479.10 Z6.00 F3000 
G1 X277.85 Y380.00 Z6.00 F3000 
G0 X277.85 Y380.00 Z80.00 F5000 
G0 X265.36 Y351.21 Z80.00 F5000 
G1 X265.36 Y351.21 Z6.00 F3000 
G1 X110.36 Y420.22 Z6.00 F3000 
G0 X110.36 Y420.22 Z80.00 F5000 
G0 X95.78 Y355.94 Z80.00 F5000 
G1 X95.78 Y355.94 Z6.00 F3000 
G1 X264.21 Y320.14 Z6.00 F3000 
G0 X264.21 Y320.14 Z80.00 F5000 
G0 X274.12 Y291.29 Z80.00 F5000 
G1 X274.12 Y291.29 Z6.00 F3000 
G1 X98.11 Y291.29 Z6.00 F3000 
G0 X98.11 Y291.29 Z80.00 F5000 
G0 X116.05 Y230.95 Z80.00 F5000 
G1 X116.05 Y230.95 Z6.00 F3000 
G1 X292.85 Y268.53 Z6.00 F3000 
G0 X292.85 Y268.53 Z80.00 F5000 
G0 X316.67 Y254.22 Z80.00 F5000 
G1 X316.67 Y254.22 Z6.00 F3000 
G1 X146.99 Y178.67 Z6.00 F3000 
G0 X146.99 Y178.67 Z80.00 F5000 
G0 X524.97 Y152.44 Z80.00 F5000 
G1 X524.97 Y152.44 Z6.00 F3000 
G1 X411.83 Y278.09 Z6.00 F3000 
G0 X411.83 Y278.09 Z80.00 F5000 
G0 X600.44 Y332.64 Z80.00 F5000 
G1 X600.44 Y332.64 Z6.00 F3000 
G1 X474.01 Y332.64 Z6.00 F3000 
G0 X474.01 Y332.64 Z80.00 F5000 
G0 X221.14 Y332.64 Z80.00 F5000 
G1 X221.14 Y332.64 Z6.00 F3000 
G1 X94.71 Y332.64 Z6.00 F3000 
G0 X94.71 Y332.64 Z80.00 F5000 
G0 X578.58 Y435.49 Z80.00 F5000 
G1 X578.58 Y435.49 Z6.00 F3000 
G1 X463.08 Y384.06 Z6.00 F3000 
G0 X463.08 Y384.06 Z80.00 F5000 
G0 X232.07 Y281.21 Z80.00 F5000 
G1 X232.07 Y281.21 Z6.00 F3000 
G1 X116.57 Y229.79 Z6.00 F3000 
G0 X116.57 Y229.79 Z80.00 F5000 
G0 X516.77 Y520.55 Z80.00 F5000 
G1 X516.77 Y520.55 Z6.00 F3000 
G1 X432.17 Y426.59 Z6.00 F3000 
G0 X432.17 Y426.59 Z80.00 F5000 
G0 X262.97 Y238.68 Z80.00 F5000 
G1 X262.97 Y238.68 Z6.00 F3000 
G1 X178.37 Y144.72 Z6.00 F3000 
G0 X178.37 Y144.72 Z80.00 F5000 
G0 X425.71 Y573.13 Z80.00 F5000 
G1 X425.71 Y573.13 Z6.00 F3000 
G1 X386.64 Y452.88 Z6.00 F3000 
G0 X386.64 Y452.88 Z80.00 F5000 
G0 X308.50 Y212.39 Z80.00 F5000 
G1 X308.50 Y212.39 Z6.00 F3000 
G1 X269.43 Y92.14 Z6.00 F3000 
G0 X269.43 Y92.14 Z80.00 F5000 
G0 X321.14 Y584.12 Z80.00 F5000 
G1 X321.14 Y584.12 Z6.00 F3000 
G1 X334.36 Y458.38 Z6.00 F3000 
G0 X334.36 Y458.38 Z80.00 F5000 
G0 X360.79 Y206.90 Z80.00 F5000 
G1 X360.79 Y206.90 Z6.00 F3000 
G1 X374.00 Y81.15 Z6.00 F3000 
G0 X374.00 Y81.15 Z80.00 F5000 
G0 X221.14 Y551.63 Z80.00 F5000 
G1 X221.14 Y551.63 Z6.00 F3000 
G1 X284.36 Y442.13 Z6.00 F3000 
G0 X284.36 Y442.13 Z80.00 F5000 
G0 X410.79 Y223.14 Z80.00 F5000 
G1 X410.79 Y223.14 Z6.00 F3000 
G1 X474.01 Y113.65 Z6.00 F3000 
G0 X474.01 Y113.65 Z80.00 F5000 
<null>
<null>
<null>
<null>
G0 X100.23 Y385.21 Z80.00 F5000 
G1 X100.23 Y385.21 Z6.00 F3000 
G1 X223.90 Y358.92 Z6.00 F3000 
G0 X223.90 Y358.92 Z80.00 F5000 
G0 X471.24 Y306.35 Z80.00 F5000 
G1 X471.24 Y306.35 Z6.00 F3000 
G1 X594.91 Y280.06 Z6.00 F3000 
G0 X594.91 Y280.06 Z80.00 F5000 
G0 X100.23 Y280.06 Z80.00 F5000 
G1 X100.23 Y280.06 Z6.00 F3000 
G1 X223.90 Y306.35 Z6.00 F3000 
G0 X223.90 Y306.35 Z80.00 F5000 
G0 X471.24 Y358.92 Z80.00 F5000 
G1 X471.24 Y358.92 Z6.00 F3000 
G1 X594.91 Y385.21 Z6.00 F3000 
G0 X594.91 Y385.21 Z80.00 F5000 
G0 X143.00 Y184.00 Z80.00 F5000 
G1 X143.00 Y184.00 Z6.00 F3000 
G1 X245.29 Y258.32 Z6.00 F3000 
G0 X245.29 Y258.32 Z80.00 F5000 
G0 X449.86 Y406.95 Z80.00 F5000 
G1 X449.86 Y406.95 Z6.00 F3000 
G1 X552.15 Y481.27 Z6.00 F3000 
G0 X552.15 Y481.27 Z80.00 F5000 
G0 X221.14 Y113.65 Z80.00 F5000 
G1 X221.14 Y113.65 Z6.00 F3000 
G1 X284.36 Y223.14 Z6.00 F3000 
G0 X284.36 Y223.14 Z80.00 F5000 
G0 X410.79 Y442.13 Z80.00 F5000 
G1 X410.79 Y442.13 Z6.00 F3000 
G1 X474.01 Y551.63 Z6.00 F3000 
G0 X474.01 Y551.63 Z80.00 F5000 
G0 X321.14 Y81.15 Z80.00 F5000 
G1 X321.14 Y81.15 Z6.00 F3000 
G1 X334.36 Y206.90 Z6.00 F3000 
G0 X334.36 Y206.90 Z80.00 F5000 
G0 X360.79 Y458.38 Z80.00 F5000 
G1 X360.79 Y458.38 Z6.00 F3000 
G1 X374.00 Y584.12 Z6.00 F3000 
G0 X374.00 Y584.12 Z80.00 F5000 
G0 X425.71 Y92.14 Z80.00 F5000 
G1 X425.71 Y92.14 Z6.00 F3000 
G1 X386.64 Y212.39 Z6.00 F3000 
G0 X386.64 Y212.39 Z80.00 F5000 
G0 X308.50 Y452.88 Z80.00 F5000 
G1 X308.50 Y452.88 Z6.00 F3000 
G1 X269.43 Y573.13 Z6.00 F3000 
G0 X269.43 Y573.13 Z80.00 F5000 
G0 X516.77 Y144.72 Z80.00 F5000 
G1 X516.77 Y144.72 Z6.00 F3000 
G1 X432.17 Y238.68 Z6.00 F3000 
G0 X432.17 Y238.68 Z80.00 F5000 
G0 X262.97 Y426.59 Z80.00 F5000 
G1 X262.97 Y426.59 Z6.00 F3000 
G1 X178.37 Y520.55 Z6.00 F3000 
G0 X178.37 Y520.55 Z80.00 F5000 
G0 X578.58 Y229.79 Z80.00 F5000 
G1 X578.58 Y229.79 Z6.00 F3000 
G1 X463.08 Y281.21 Z6.00 F3000 
G0 X463.08 Y281.21 Z80.00 F5000 
G0 X232.07 Y384.06 Z80.00 F5000 
G1 X232.07 Y384.06 Z6.00 F3000 
G1 X116.57 Y435.49 Z6.00 F3000 
G0 X116.57 Y435.49 Z80.00 F5000 
;FOOTER
; end_gcode
G28 X Y
G0 Z100 				; HOME
G90                             ; absolute positioning
;ENDFOOTER
