EESchema Schematic File Version 4
EELAYER 30 0
EELAYER END
$Descr A4 11693 8268
encoding utf-8
Sheet 1 1
Title ""
Date ""
Rev ""
Comp ""
Comment1 ""
Comment2 ""
Comment3 ""
Comment4 ""
$EndDescr
$Comp
L ESP32-footprints-Shem-Lib:ESP32-WROOM U2
U 1 1 5E60EEE1
P 5650 4100
F 0 "U2" H 5625 5487 60  0000 C CNN
F 1 "ESP32-WROOM" H 5625 5381 60  0000 C CNN
F 2 "ESP32-footprints-Lib:ESP32-WROOM_FAB" H 6000 5450 60  0001 C CNN
F 3 "" H 5200 4550 60  0001 C CNN
	1    5650 4100
	1    0    0    -1  
$EndComp
$Comp
L fab:RES-US1206FAB R1
U 1 1 5E61707A
P 2850 1600
F 0 "R1" V 2800 1750 45  0000 C CNN
F 1 "100" V 2900 1750 45  0000 C CNN
F 2 "fab-R1206FAB" H 2880 1750 20  0001 C CNN
F 3 "" H 2850 1600 50  0001 C CNN
	1    2850 1600
	0    1    1    0   
$EndComp
$Comp
L fab:LEDFAB1206 M3
U 1 1 5E61A874
P 4950 5900
F 0 "M3" V 5154 5950 45  0000 C CNN
F 1 "RED" V 5070 5950 45  0000 C CNN
F 2 "fab-LED1206FAB" H 4980 6050 20  0001 C CNN
F 3 "" H 4950 5900 50  0001 C CNN
	1    4950 5900
	1    0    0    -1  
$EndComp
$Comp
L fab:LEDFAB1206 M2
U 1 1 5E620D1C
P 2600 3550
F 0 "M2" V 2804 3600 45  0000 C CNN
F 1 "BLUE" V 2720 3600 45  0000 C CNN
F 2 "fab-LED1206FAB" H 2630 3700 20  0001 C CNN
F 3 "" H 2600 3550 50  0001 C CNN
	1    2600 3550
	0    -1   -1   0   
$EndComp
$Comp
L fab:RES-US1206FAB R2
U 1 1 5E623B12
P 5050 1600
F 0 "R2" H 5100 1800 45  0000 R CNN
F 1 "10k" H 5100 1700 45  0000 R CNN
F 2 "fab-R1206FAB" H 5080 1750 20  0001 C CNN
F 3 "" H 5050 1600 50  0001 C CNN
	1    5050 1600
	-1   0    0    1   
$EndComp
$Comp
L fab:RES-US1206FAB R3
U 1 1 5E624ACB
P 4950 6350
F 0 "R3" H 5000 6550 45  0000 R CNN
F 1 "100" H 5000 6450 45  0000 R CNN
F 2 "fab-R1206FAB" H 4980 6500 20  0001 C CNN
F 3 "" H 4950 6350 50  0001 C CNN
	1    4950 6350
	0    -1   -1   0   
$EndComp
$Comp
L fab:CAP-UNPOLARIZEDFAB C3
U 1 1 5E625D4A
P 2500 1600
F 0 "C3" V 2408 1688 45  0000 L CNN
F 1 "10uF" V 2492 1688 45  0000 L CNN
F 2 "fab-C1206FAB" H 2530 1750 20  0001 C CNN
F 3 "" H 2500 1600 50  0001 C CNN
	1    2500 1600
	0    1    1    0   
$EndComp
$Comp
L fab:CAP-UNPOLARIZEDFAB C2
U 1 1 5E6260EA
P 1350 1750
F 0 "C2" V 1350 1600 45  0000 C CNN
F 1 "10uF" V 1250 1600 45  0000 C CNN
F 2 "fab-C1206FAB" H 1380 1900 20  0001 C CNN
F 3 "" H 1350 1750 50  0001 C CNN
	1    1350 1750
	0    -1   -1   0   
$EndComp
$Comp
L fab:CAP-UNPOLARIZEDFAB C1
U 1 1 5E6273EC
P 2100 1500
F 0 "C1" V 2092 1412 45  0000 R CNN
F 1 "0.1uF" V 2008 1412 45  0000 R CNN
F 2 "fab-C1206FAB" H 2130 1650 20  0001 C CNN
F 3 "" H 2100 1500 50  0001 C CNN
	1    2100 1500
	0    -1   -1   0   
$EndComp
$Comp
L fab:6MM_SWITCH6MM_SWITCH S3
U 1 1 5E627CF6
P 6200 1450
F 0 "S3" H 6400 1450 45  0000 L CNN
F 1 "6MM_SWITCH6MM_SWITCH" V 5950 1150 45  0000 L CNN
F 2 "fab-6MM_SWITCH" H 6230 1600 20  0001 C CNN
F 3 "" H 6200 1450 50  0001 C CNN
	1    6200 1450
	0    1    1    0   
$EndComp
$Comp
L fab:FTDI-SMD-HEADER M1
U 1 1 5E6283BA
P 1150 1150
F 0 "M1" H 1150 1150 45  0001 C CNN
F 1 "FTDI-SMD-HEADER" H 1150 1150 45  0001 C CNN
F 2 "fab-1X06SMD" H 1180 1300 20  0001 C CNN
F 3 "" H 1150 1150 50  0001 C CNN
	1    1150 1150
	-1   0    0    1   
$EndComp
$Comp
L Connector:Conn_01x13_Female J3
U 1 1 5E631A46
P 7750 3750
F 0 "J3" V 7950 3750 50  0000 L CNN
F 1 "Conn_01x13_Female" V 7850 3450 50  0000 L CNN
F 2 "Connector_PinHeader_2.54mm:PinHeader_1x13_P2.54mm_Vertical" H 7750 3750 50  0001 C CNN
F 3 "~" H 7750 3750 50  0001 C CNN
	1    7750 3750
	1    0    0    -1  
$EndComp
$Comp
L Connector:Conn_01x11_Female J1
U 1 1 5E634650
P 3800 4200
F 0 "J1" V 4050 4200 50  0000 C CNN
F 1 "Conn_01x11_Female" V 3950 4200 50  0000 C CNN
F 2 "Connector_PinHeader_2.54mm:PinHeader_1x11_P2.54mm_Vertical" H 3800 4200 50  0001 C CNN
F 3 "~" H 3800 4200 50  0001 C CNN
	1    3800 4200
	-1   0    0    1   
$EndComp
Text Notes 1850 650  0    50   ~ 10
FTDI - POWER
Text GLabel 3550 1350 2    50   Input ~ 10
3V3
Text GLabel 3550 2100 2    50   Input ~ 10
GND
Text GLabel 1500 850  2    50   Input ~ 10
RX
Text GLabel 1500 1000 2    50   Input ~ 10
TX
Text GLabel 1150 3550 0    50   Input ~ 10
3V3
Text GLabel 3900 4800 0    50   Input ~ 10
GND
Wire Wire Line
	3900 4800 4550 4800
Text GLabel 6650 1550 2    50   Input ~ 10
GND
Text GLabel 5150 1300 0    50   Input ~ 10
RESET
Text GLabel 4600 1600 0    50   Input ~ 10
3V3
Wire Wire Line
	4600 1600 4850 1600
Wire Wire Line
	5150 1300 5550 1300
Wire Wire Line
	6000 1300 6000 1450
Wire Wire Line
	5250 1600 5550 1600
Wire Wire Line
	5550 1600 5550 1300
Connection ~ 5550 1300
Wire Wire Line
	5550 1300 6000 1300
Wire Wire Line
	4950 5700 4950 5400
Text GLabel 5200 6750 2    50   Input ~ 10
GND
Wire Wire Line
	6400 1550 6650 1550
$Comp
L fab:RES-US1206FAB R5
U 1 1 5E686900
P 1850 3550
F 0 "R5" H 1850 3744 45  0000 C CNN
F 1 "100" H 1850 3660 45  0000 C CNN
F 2 "fab-R1206FAB" H 1880 3700 20  0001 C CNN
F 3 "" H 1850 3550 50  0001 C CNN
	1    1850 3550
	1    0    0    -1  
$EndComp
Wire Wire Line
	1650 3550 1150 3550
Wire Notes Line
	550  550  550  2250
Wire Notes Line
	3850 2250 3850 550 
Wire Wire Line
	3550 2100 3350 2100
Wire Wire Line
	3550 1350 2850 1350
Wire Wire Line
	1450 1350 1350 1350
Wire Wire Line
	1350 1950 1350 2100
Connection ~ 1350 2100
Wire Wire Line
	1350 2100 1250 2100
Wire Wire Line
	1250 1650 1250 2100
Wire Wire Line
	1150 1650 1250 1650
Wire Wire Line
	1350 1350 1350 1450
Wire Wire Line
	1150 1450 1350 1450
Connection ~ 1350 1450
Wire Wire Line
	1350 1450 1350 1650
Wire Wire Line
	1150 1350 1300 1350
Wire Wire Line
	1300 1350 1300 1000
Wire Wire Line
	1300 1000 1500 1000
Wire Wire Line
	1150 1250 1250 1250
Wire Wire Line
	1250 1250 1250 850 
Wire Wire Line
	1250 850  1500 850 
$Comp
L fab:LEDFAB1206 LADFAB1206
U 1 1 5E6C9B8F
P 3350 1700
F 0 "LADFAB1206" H 3600 1650 45  0000 C CNN
F 1 "M1" H 3550 1750 45  0000 C CNN
F 2 "fab-LED1206FAB" H 3380 1850 20  0001 C CNN
F 3 "" H 3350 1700 50  0001 C CNN
	1    3350 1700
	1    0    0    -1  
$EndComp
$Comp
L Regulator_Linear:NCP1117-12_SOT223 U1
U 1 1 5E6CF398
P 1750 1350
F 0 "U1" H 1750 1592 50  0000 C CNN
F 1 "NCP1117-12_SOT223" H 1750 1501 50  0000 C CNN
F 2 "Package_TO_SOT_SMD:SOT-223-3_TabPin2" H 1750 1550 50  0001 C CNN
F 3 "http://www.onsemi.com/pub_link/Collateral/NCP1117-D.PDF" H 1850 1100 50  0001 C CNN
	1    1750 1350
	1    0    0    -1  
$EndComp
Wire Wire Line
	1750 1650 1750 2100
Connection ~ 1750 2100
Wire Wire Line
	1750 2100 1350 2100
Wire Wire Line
	2100 1700 2100 2100
Connection ~ 2100 2100
Wire Wire Line
	2100 2100 1750 2100
Wire Wire Line
	2100 1400 2100 1350
Connection ~ 2100 1350
Wire Wire Line
	2100 1350 2050 1350
Wire Wire Line
	2500 1400 2500 1350
Connection ~ 2500 1350
Wire Wire Line
	2500 1350 2100 1350
Wire Wire Line
	2500 1700 2500 2100
Connection ~ 2500 2100
Wire Wire Line
	2500 2100 2100 2100
Wire Wire Line
	2850 1400 2850 1350
Connection ~ 2850 1350
Wire Wire Line
	2850 1350 2500 1350
Wire Wire Line
	2850 1800 2850 1900
Wire Wire Line
	2850 1900 3150 1900
Wire Wire Line
	3150 1900 3150 1500
Wire Wire Line
	3150 1500 3350 1500
Wire Wire Line
	3350 1800 3350 2100
Connection ~ 3350 2100
Wire Wire Line
	3350 2100 2500 2100
Wire Notes Line
	550  550  3850 550 
Wire Notes Line
	550  2250 3850 2250
Wire Notes Line
	4050 2250 7450 2250
Wire Notes Line
	7450 2250 7450 550 
Text Notes 5500 650  0    50   ~ 10
RESET BUTTON
Wire Wire Line
	6400 1450 6400 1550
Connection ~ 6400 1550
Wire Wire Line
	6000 1550 6000 1450
Connection ~ 6000 1450
Wire Notes Line
	4050 2250 4050 550 
Wire Notes Line
	4050 550  7450 550 
Text GLabel 9700 1450 2    50   Input ~ 10
PROG
$Comp
L fab:SLIDE-SWITCH S2
U 1 1 5E708E90
P 9300 1450
F 0 "S2" H 9300 1171 45  0000 C CNN
F 1 "SLIDE-SWITCH" H 9300 1255 45  0000 C CNN
F 2 "fab-AYZ0102AGRLC" H 9330 1600 20  0001 C CNN
F 3 "" H 9300 1450 50  0001 C CNN
	1    9300 1450
	-1   0    0    1   
$EndComp
Wire Wire Line
	9500 1450 9700 1450
Text GLabel 7200 5000 2    50   Input ~ 10
PROG
Wire Wire Line
	6550 4550 6950 4550
Wire Wire Line
	6950 4550 6950 5000
Wire Wire Line
	6950 5000 7200 5000
Text GLabel 6900 5150 2    50   Input ~ 10
GND
Wire Wire Line
	6550 4650 6800 4650
Wire Wire Line
	6800 4650 6800 4750
Wire Wire Line
	6800 5150 6900 5150
Wire Wire Line
	6550 4750 6800 4750
Connection ~ 6800 4750
Wire Wire Line
	6800 4750 6800 5150
Wire Wire Line
	5200 5150 4550 5150
Wire Wire Line
	4550 5150 4550 4800
Connection ~ 4550 4800
Wire Wire Line
	4550 4800 4700 4800
$Comp
L Connector:Conn_01x09_Female J2
U 1 1 5E725191
P 5700 5700
F 0 "J2" V 5773 5680 50  0000 C CNN
F 1 "Conn_01x09_Female" V 5864 5680 50  0000 C CNN
F 2 "Connector_PinHeader_2.54mm:PinHeader_1x09_P2.54mm_Vertical" H 5700 5700 50  0001 C CNN
F 3 "~" H 5700 5700 50  0001 C CNN
	1    5700 5700
	0    1    1    0   
$EndComp
Wire Notes Line
	7700 550  7700 2250
Wire Notes Line
	7700 2250 10500 2250
Wire Notes Line
	10500 2250 10500 550 
Wire Notes Line
	10500 550  7700 550 
Text Notes 8850 650  0    50   ~ 10
SLIDER SWITCH
$Comp
L fab:6MM_SWITCH6MM_SWITCH S5
U 1 1 5E735A80
P 2150 4600
F 0 "S5" V 1750 4650 45  0000 L CNN
F 1 "6MM_SWITCH6MM_SWITCH" V 1850 4300 45  0000 L CNN
F 2 "fab-6MM_SWITCH" H 2180 4750 20  0001 C CNN
F 3 "" H 2150 4600 50  0001 C CNN
	1    2150 4600
	0    1    1    0   
$EndComp
Text GLabel 1650 4700 0    50   Input ~ 10
BUTTON
Text GLabel 1150 5050 0    50   Input ~ 10
3V3
$Comp
L fab:RES-US1206FAB R4
U 1 1 5E740E06
P 1600 5050
F 0 "R4" H 1650 5250 45  0000 R CNN
F 1 "10k" H 1650 5150 45  0000 R CNN
F 2 "fab-R1206FAB" H 1630 5200 20  0001 C CNN
F 3 "" H 1600 5050 50  0001 C CNN
	1    1600 5050
	-1   0    0    1   
$EndComp
Wire Wire Line
	1150 5050 1400 5050
Wire Wire Line
	1650 4700 1800 4700
Wire Wire Line
	1950 4700 1950 4600
Connection ~ 1950 4700
Text GLabel 4550 4500 0    50   Input ~ 10
BUTTON
Wire Wire Line
	4700 4700 4000 4700
Wire Wire Line
	4000 4500 4700 4500
Wire Wire Line
	4700 4600 4000 4600
Wire Wire Line
	4000 4400 4700 4400
Wire Wire Line
	4700 4300 4000 4300
Wire Wire Line
	4000 4200 4700 4200
Wire Wire Line
	4700 4100 4000 4100
Wire Wire Line
	4000 4000 4700 4000
Wire Wire Line
	4700 3900 4000 3900
Wire Wire Line
	4000 3800 4700 3800
Wire Wire Line
	4700 3700 4000 3700
Text GLabel 4500 3500 0    50   Input ~ 10
3V3
Text GLabel 4250 3600 0    50   Input ~ 10
RESET
Wire Wire Line
	4500 3500 4700 3500
Wire Wire Line
	4700 3600 4250 3600
Wire Wire Line
	5300 5500 5300 5400
Wire Wire Line
	5400 5500 5400 5150
Wire Wire Line
	5500 5150 5500 5500
Wire Wire Line
	5600 5150 5600 5500
Wire Wire Line
	5700 5150 5700 5500
Wire Wire Line
	5800 5150 5800 5500
Wire Wire Line
	5900 5150 5900 5500
Wire Wire Line
	6000 5150 6000 5500
Wire Wire Line
	6100 5150 6100 5500
Wire Wire Line
	4950 5400 5300 5400
Connection ~ 5300 5400
Wire Wire Line
	5300 5400 5300 5150
Wire Wire Line
	4950 6150 4950 6000
Wire Wire Line
	4950 6550 4950 6750
Wire Wire Line
	4950 6750 5200 6750
Text GLabel 6950 2900 2    50   Input ~ 10
TX
Text GLabel 7800 2700 2    50   Input ~ 10
GND
Text GLabel 7800 2900 2    50   Input ~ 10
3V3
Wire Wire Line
	7800 2900 7500 2900
Wire Wire Line
	7500 2900 7500 3150
Wire Wire Line
	7500 3150 7550 3150
Wire Wire Line
	7800 2700 7350 2700
Wire Wire Line
	7350 2700 7350 3250
Wire Wire Line
	7350 3250 7550 3250
Wire Wire Line
	6550 3350 7550 3350
Wire Wire Line
	6550 3450 7550 3450
Wire Wire Line
	6550 3550 6850 3550
Wire Wire Line
	6550 3650 6700 3650
Wire Wire Line
	6550 3750 7550 3750
Wire Wire Line
	6550 3950 6750 3950
Wire Wire Line
	6750 3950 6750 3850
Wire Wire Line
	6750 3850 7550 3850
Wire Wire Line
	6550 4050 6850 4050
Wire Wire Line
	6850 4050 6850 3950
Wire Wire Line
	6850 3950 7550 3950
Wire Wire Line
	6550 4150 6950 4150
Wire Wire Line
	6950 4150 6950 4050
Wire Wire Line
	6950 4050 7550 4050
Wire Wire Line
	6550 4250 7050 4250
Wire Wire Line
	7050 4250 7050 4150
Wire Wire Line
	7050 4150 7550 4150
Wire Wire Line
	6550 4350 7150 4350
Wire Wire Line
	7150 4350 7150 4250
Wire Wire Line
	7150 4250 7550 4250
Wire Wire Line
	6550 4450 7250 4450
Wire Wire Line
	7250 4450 7250 4350
Wire Wire Line
	7250 4350 7550 4350
Text GLabel 6950 3050 2    50   Input ~ 10
RX
Wire Wire Line
	6950 2900 6700 2900
Wire Wire Line
	6700 2900 6700 3650
Connection ~ 6700 3650
Wire Wire Line
	6700 3650 7550 3650
Wire Wire Line
	6950 3050 6850 3050
Wire Wire Line
	6850 3050 6850 3550
Connection ~ 6850 3550
Wire Wire Line
	6850 3550 7550 3550
Wire Wire Line
	1800 5050 1800 4700
Connection ~ 1800 4700
Wire Wire Line
	1800 4700 1950 4700
Text GLabel 2600 4700 2    50   Input ~ 10
GND
Wire Wire Line
	2600 4700 2350 4700
Wire Wire Line
	2350 4600 2350 4700
Connection ~ 2350 4700
Wire Wire Line
	2050 3550 2400 3550
Text GLabel 2900 3550 2    50   Input ~ 10
GND
Wire Wire Line
	2900 3550 2700 3550
Text GLabel 8700 1550 0    50   Input ~ 10
GND
Wire Wire Line
	8700 1550 9100 1550
$EndSCHEMATC
