;HEADER
;Start_gcode
G21                     ; Set to metric [change to G20 if you want Imperial]
G90                     ; Force coordinates to be absolute relative to the origin
G28                     ; Home X/Y/Z axis
M117 Printing...
;ENDHEADER
;Layer #
G0 X178.14 Y463.74 Z90.00 F2524
M400
M280 P1  S0
G1 X178.14 Y463.74 Z15.00 F3000
G1 X200.01 Y462.91 Z15.00 F3000
G1 X221.35 Y461.41 Z15.00 F3000
G1 X231.85 Y460.36 Z15.00 F3000
G1 X242.27 Y459.07 Z15.00 F3000
G1 X252.62 Y457.52 Z15.00 F3000
G1 X262.92 Y455.69 Z15.00 F3000
G1 X274.66 Y453.27 Z15.00 F3000
G1 X286.35 Y450.64 Z15.00 F3000
G1 X309.74 Y445.37 Z15.00 F3000
G1 X319.34 Y443.56 Z15.00 F3000
G1 X328.96 Y442.16 Z15.00 F3000
G1 X338.59 Y441.19 Z15.00 F3000
G1 X348.23 Y440.68 Z15.00 F3000
G1 X357.88 Y440.64 Z15.00 F3000
G1 X367.54 Y441.10 Z15.00 F3000
G1 X377.21 Y442.07 Z15.00 F3000
G1 X386.89 Y443.58 Z15.00 F3000
G1 X398.40 Y445.88 Z15.00 F3000
G1 X409.87 Y448.42 Z15.00 F3000
G1 X432.81 Y453.57 Z15.00 F3000
G1 X450.74 Y456.96 Z15.00 F3000
G1 X468.76 Y459.59 Z15.00 F3000
G1 X486.87 Y461.47 Z15.00 F3000
G1 X505.06 Y462.61 Z15.00 F3000
G1 X525.39 Y463.32 Z15.00 F3000
G1 X535.56 Y463.37 Z15.00 F3000
G1 X545.71 Y463.04 Z15.00 F3000
G1 X563.02 Y461.97 Z15.00 F3000
G1 X580.31 Y460.48 Z15.00 F3000
G1 X597.54 Y458.41 Z15.00 F3000
G1 X606.12 Y457.11 Z15.00 F3000
G1 X614.67 Y455.59 Z15.00 F3000
G1 X632.74 Y452.01 Z15.00 F3000
G1 X650.75 Y447.96 Z15.00 F3000
G1 X653.63 Y447.06 Z15.00 F3000
G1 X656.02 Y445.89 Z15.00 F3000
G1 X657.96 Y444.43 Z15.00 F3000
G1 X659.48 Y442.70 Z15.00 F3000
G1 X660.64 Y440.69 Z15.00 F3000
G1 X661.46 Y438.40 Z15.00 F3000
G1 X662.00 Y435.83 Z15.00 F3000
G1 X662.28 Y432.99 Z15.00 F3000
G1 X662.47 Y426.70 Z15.00 F3000
G1 X662.34 Y420.39 Z15.00 F3000
G1 X661.93 Y414.09 Z15.00 F3000
G1 X661.30 Y407.83 Z15.00 F3000
G1 X660.66 Y404.76 Z15.00 F3000
G1 X660.09 Y403.29 Z15.00 F3000
G1 X659.34 Y401.91 Z15.00 F3000
G1 X658.36 Y400.63 Z15.00 F3000
G1 X657.16 Y399.48 Z15.00 F3000
G1 X655.69 Y398.50 Z15.00 F3000
G1 X653.95 Y397.71 Z15.00 F3000
G1 X651.60 Y396.64 Z15.00 F3000
G1 X649.55 Y395.28 Z15.00 F3000
G1 X647.77 Y393.68 Z15.00 F3000
G1 X646.25 Y391.86 Z15.00 F3000
G1 X644.95 Y389.84 Z15.00 F3000
G1 X643.87 Y387.67 Z15.00 F3000
G1 X642.22 Y382.97 Z15.00 F3000
G1 X639.29 Y371.51 Z15.00 F3000
G1 X636.57 Y360.03 Z15.00 F3000
G1 X624.84 Y311.61 Z15.00 F3000
G1 X622.61 Y303.07 Z15.00 F3000
G1 X620.03 Y294.66 Z15.00 F3000
G1 X616.91 Y286.43 Z15.00 F3000
G1 X615.09 Y282.41 Z15.00 F3000
G1 X613.07 Y278.45 Z15.00 F3000
G1 X609.68 Y272.77 Z15.00 F3000
G1 X605.95 Y267.47 Z15.00 F3000
G1 X601.88 Y262.52 Z15.00 F3000
G1 X597.46 Y257.94 Z15.00 F3000
G1 X592.71 Y253.71 Z15.00 F3000
G1 X587.62 Y249.82 Z15.00 F3000
G1 X582.19 Y246.28 Z15.00 F3000
G1 X576.42 Y243.08 Z15.00 F3000
G1 X571.01 Y240.43 Z15.00 F3000
G1 X565.53 Y238.01 Z15.00 F3000
G1 X559.97 Y235.81 Z15.00 F3000
G1 X554.34 Y233.84 Z15.00 F3000
G1 X548.62 Y232.11 Z15.00 F3000
G1 X542.83 Y230.62 Z15.00 F3000
G1 X536.96 Y229.38 Z15.00 F3000
G1 X531.02 Y228.38 Z15.00 F3000
G1 X526.19 Y227.73 Z15.00 F3000
G1 X521.36 Y227.39 Z15.00 F3000
G1 X509.36 Y227.18 Z15.00 F3000
G1 X497.39 Y227.39 Z15.00 F3000
G1 X489.04 Y228.05 Z15.00 F3000
G1 X480.83 Y229.14 Z15.00 F3000
G1 X472.76 Y230.71 Z15.00 F3000
G1 X464.86 Y232.80 Z15.00 F3000
G1 X457.14 Y235.47 Z15.00 F3000
G1 X449.63 Y238.75 Z15.00 F3000
G1 X442.33 Y242.70 Z15.00 F3000
G1 X435.26 Y247.36 Z15.00 F3000
G1 X430.41 Y251.14 Z15.00 F3000
G1 X425.88 Y255.19 Z15.00 F3000
G1 X421.64 Y259.48 Z15.00 F3000
G1 X417.68 Y264.01 Z15.00 F3000
G1 X413.99 Y268.77 Z15.00 F3000
G1 X410.53 Y273.73 Z15.00 F3000
G1 X407.30 Y278.87 Z15.00 F3000
G1 X404.27 Y284.20 Z15.00 F3000
G1 X401.13 Y290.33 Z15.00 F3000
G1 X398.25 Y296.56 Z15.00 F3000
G1 X395.62 Y302.87 Z15.00 F3000
G1 X393.20 Y309.27 Z15.00 F3000
G1 X388.87 Y322.26 Z15.00 F3000
G1 X385.05 Y335.44 Z15.00 F3000
G1 X379.60 Y356.34 Z15.00 F3000
G1 X374.32 Y377.27 Z15.00 F3000
G1 X372.81 Y381.74 Z15.00 F3000
G1 X371.96 Y383.80 Z15.00 F3000
G1 X370.92 Y385.67 Z15.00 F3000
G1 X369.69 Y387.33 Z15.00 F3000
G1 X368.28 Y388.76 Z15.00 F3000
G1 X366.68 Y389.95 Z15.00 F3000
G1 X364.89 Y390.89 Z15.00 F3000
G1 X362.92 Y391.57 Z15.00 F3000
G1 X360.75 Y391.96 Z15.00 F3000
G1 X357.15 Y392.25 Z15.00 F3000
G1 X353.52 Y392.34 Z15.00 F3000
G1 X349.89 Y392.23 Z15.00 F3000
G1 X346.29 Y391.91 Z15.00 F3000
G1 X344.15 Y391.51 Z15.00 F3000
G1 X342.19 Y390.84 Z15.00 F3000
G1 X340.41 Y389.91 Z15.00 F3000
G1 X338.82 Y388.74 Z15.00 F3000
G1 X337.43 Y387.33 Z15.00 F3000
G1 X336.26 Y385.69 Z15.00 F3000
G1 X335.30 Y383.84 Z15.00 F3000
G1 X334.56 Y381.79 Z15.00 F3000
G1 X329.72 Y364.16 Z15.00 F3000
G1 X325.10 Y346.46 Z15.00 F3000
G1 X321.66 Y333.67 Z15.00 F3000
G1 X317.94 Y320.97 Z15.00 F3000
G1 X313.72 Y308.43 Z15.00 F3000
G1 X311.36 Y302.24 Z15.00 F3000
G1 X308.80 Y296.11 Z15.00 F3000
G1 X304.18 Y286.39 Z15.00 F3000
G1 X301.64 Y281.68 Z15.00 F3000
G1 X298.94 Y277.07 Z15.00 F3000
G1 X296.05 Y272.59 Z15.00 F3000
G1 X292.96 Y268.23 Z15.00 F3000
G1 X289.67 Y264.01 Z15.00 F3000
G1 X286.14 Y259.94 Z15.00 F3000
G1 X281.89 Y255.55 Z15.00 F3000
G1 X277.42 Y251.47 Z15.00 F3000
G1 X272.73 Y247.71 Z15.00 F3000
G1 X267.83 Y244.29 Z15.00 F3000
G1 X262.71 Y241.21 Z15.00 F3000
G1 X257.37 Y238.49 Z15.00 F3000
G1 X251.80 Y236.14 Z15.00 F3000
G1 X246.01 Y234.18 Z15.00 F3000
G1 X233.69 Y230.77 Z15.00 F3000
G1 X227.43 Y229.48 Z15.00 F3000
G1 X221.15 Y228.67 Z15.00 F3000
G1 X210.94 Y227.92 Z15.00 F3000
G1 X200.70 Y227.45 Z15.00 F3000
G1 X190.47 Y227.35 Z15.00 F3000
G1 X180.26 Y227.72 Z15.00 F3000
G1 X176.70 Y228.06 Z15.00 F3000
G1 X173.15 Y228.61 Z15.00 F3000
G1 X166.07 Y230.16 Z15.00 F3000
G1 X152.10 Y234.22 Z15.00 F3000
G1 X143.37 Y237.20 Z15.00 F3000
G1 X134.93 Y240.86 Z15.00 F3000
G1 X126.81 Y245.21 Z15.00 F3000
G1 X122.88 Y247.66 Z15.00 F3000
G1 X119.03 Y250.28 Z15.00 F3000
G1 X113.37 Y254.67 Z15.00 F3000
G1 X108.18 Y259.41 Z15.00 F3000
G1 X103.48 Y264.51 Z15.00 F3000
G1 X99.25 Y269.94 Z15.00 F3000
G1 X95.51 Y275.71 Z15.00 F3000
G1 X92.26 Y281.81 Z15.00 F3000
G1 X89.50 Y288.22 Z15.00 F3000
G1 X87.24 Y294.94 Z15.00 F3000
G1 X82.94 Y310.50 Z15.00 F3000
G1 X78.95 Y326.16 Z15.00 F3000
G1 X71.18 Y357.53 Z15.00 F3000
G1 X67.49 Y372.19 Z15.00 F3000
G1 X63.55 Y386.78 Z15.00 F3000
G1 X62.88 Y388.70 Z15.00 F3000
G1 X62.01 Y390.48 Z15.00 F3000
G1 X60.94 Y392.12 Z15.00 F3000
G1 X59.70 Y393.61 Z15.00 F3000
G1 X58.28 Y394.94 Z15.00 F3000
G1 X56.70 Y396.11 Z15.00 F3000
G1 X54.97 Y397.09 Z15.00 F3000
G1 X53.09 Y397.90 Z15.00 F3000
G1 X51.32 Y398.71 Z15.00 F3000
G1 X49.86 Y399.74 Z15.00 F3000
G1 X48.69 Y400.93 Z15.00 F3000
G1 X47.76 Y402.28 Z15.00 F3000
G1 X47.06 Y403.73 Z15.00 F3000
G1 X46.54 Y405.27 Z15.00 F3000
G1 X45.93 Y408.49 Z15.00 F3000
G1 X45.42 Y413.98 Z15.00 F3000
G1 X45.15 Y419.50 Z15.00 F3000
G1 X44.99 Y430.54 Z15.00 F3000
G1 X45.11 Y434.29 Z15.00 F3000
G1 X45.58 Y437.53 Z15.00 F3000
G1 X46.44 Y440.30 Z15.00 F3000
G1 X47.74 Y442.64 Z15.00 F3000
G1 X49.54 Y444.59 Z15.00 F3000
G1 X51.87 Y446.21 Z15.00 F3000
G1 X54.80 Y447.54 Z15.00 F3000
G1 X58.37 Y448.62 Z15.00 F3000
G1 X67.33 Y450.80 Z15.00 F3000
G1 X76.35 Y452.76 Z15.00 F3000
G1 X85.42 Y454.45 Z15.00 F3000
G1 X94.54 Y455.83 Z15.00 F3000
G1 X110.35 Y457.77 Z15.00 F3000
G1 X126.18 Y459.49 Z15.00 F3000
G1 X157.89 Y462.66 Z15.00 F3000
G1 X168.60 Y463.36 Z15.00 F3000
G1 X178.14 Y463.74 Z15.00 F3000
G0 X178.14 Y463.74 Z90.00 F2524
G0 X90.11 Y389.32 Z90.00 F2524
G1 X90.11 Y389.32 Z15.00 F3000
G1 X90.51 Y372.97 Z15.00 F3000
G1 X90.82 Y365.55 Z15.00 F3000
G1 X91.48 Y358.38 Z15.00 F3000
G1 X93.01 Y347.54 Z15.00 F3000
G1 X94.78 Y336.74 Z15.00 F3000
G1 X96.77 Y325.96 Z15.00 F3000
G1 X98.97 Y315.24 Z15.00 F3000
G1 X101.07 Y306.68 Z15.00 F3000
G1 X103.77 Y298.30 Z15.00 F3000
G1 X107.16 Y290.15 Z15.00 F3000
G1 X109.15 Y286.19 Z15.00 F3000
G1 X111.36 Y282.31 Z15.00 F3000
G1 X115.48 Y276.14 Z15.00 F3000
G1 X120.08 Y270.58 Z15.00 F3000
G1 X125.11 Y265.58 Z15.00 F3000
G1 X130.54 Y261.11 Z15.00 F3000
G1 X136.36 Y257.12 Z15.00 F3000
G1 X142.52 Y253.59 Z15.00 F3000
G1 X149.00 Y250.48 Z15.00 F3000
G1 X155.77 Y247.74 Z15.00 F3000
G1 X164.80 Y244.75 Z15.00 F3000
G1 X173.88 Y242.45 Z15.00 F3000
G1 X183.01 Y240.84 Z15.00 F3000
G1 X192.19 Y239.91 Z15.00 F3000
G1 X201.41 Y239.66 Z15.00 F3000
G1 X210.67 Y240.07 Z15.00 F3000
G1 X219.98 Y241.15 Z15.00 F3000
G1 X229.34 Y242.89 Z15.00 F3000
G1 X235.42 Y244.42 Z15.00 F3000
G1 X241.24 Y246.26 Z15.00 F3000
G1 X246.78 Y248.40 Z15.00 F3000
G1 X252.06 Y250.83 Z15.00 F3000
G1 X257.08 Y253.57 Z15.00 F3000
G1 X261.83 Y256.60 Z15.00 F3000
G1 X266.31 Y259.92 Z15.00 F3000
G1 X270.53 Y263.53 Z15.00 F3000
G1 X274.49 Y267.42 Z15.00 F3000
G1 X278.18 Y271.59 Z15.00 F3000
G1 X281.62 Y276.05 Z15.00 F3000
G1 X284.79 Y280.78 Z15.00 F3000
G1 X287.71 Y285.79 Z15.00 F3000
G1 X290.36 Y291.07 Z15.00 F3000
G1 X292.76 Y296.61 Z15.00 F3000
G1 X294.90 Y302.42 Z15.00 F3000
G1 X298.62 Y314.28 Z15.00 F3000
G1 X301.89 Y326.29 Z15.00 F3000
G1 X307.67 Y350.51 Z15.00 F3000
G1 X309.85 Y360.84 Z15.00 F3000
G1 X311.54 Y371.26 Z15.00 F3000
G1 X312.58 Y381.77 Z15.00 F3000
G1 X312.81 Y387.06 Z15.00 F3000
G1 X312.80 Y392.39 Z15.00 F3000
G1 X312.35 Y398.39 Z15.00 F3000
G1 X311.25 Y404.01 Z15.00 F3000
G1 X309.50 Y409.23 Z15.00 F3000
G1 X308.37 Y411.69 Z15.00 F3000
G1 X307.07 Y414.03 Z15.00 F3000
G1 X305.59 Y416.27 Z15.00 F3000
G1 X303.95 Y418.38 Z15.00 F3000
G1 X302.12 Y420.38 Z15.00 F3000
G1 X300.11 Y422.26 Z15.00 F3000
G1 X297.92 Y424.02 Z15.00 F3000
G1 X295.55 Y425.65 Z15.00 F3000
G1 X292.99 Y427.15 Z15.00 F3000
G1 X290.24 Y428.51 Z15.00 F3000
G1 X283.09 Y431.58 Z15.00 F3000
G1 X275.81 Y434.34 Z15.00 F3000
G1 X268.41 Y436.80 Z15.00 F3000
G1 X260.95 Y438.97 Z15.00 F3000
G1 X253.78 Y440.75 Z15.00 F3000
G1 X246.57 Y442.26 Z15.00 F3000
G1 X239.31 Y443.55 Z15.00 F3000
G1 X232.03 Y444.63 Z15.00 F3000
G1 X217.38 Y446.35 Z15.00 F3000
G1 X202.68 Y447.68 Z15.00 F3000
G1 X194.49 Y448.40 Z15.00 F3000
G1 X190.41 Y448.60 Z15.00 F3000
G1 X186.34 Y448.53 Z15.00 F3000
G1 X180.53 Y448.01 Z15.00 F3000
G1 X174.74 Y447.29 Z15.00 F3000
G1 X163.21 Y445.51 Z15.00 F3000
G1 X141.73 Y442.11 Z15.00 F3000
G1 X131.02 Y440.26 Z15.00 F3000
G1 X120.35 Y438.17 Z15.00 F3000
G1 X115.22 Y436.76 Z15.00 F3000
G1 X110.56 Y434.80 Z15.00 F3000
G1 X106.37 Y432.30 Z15.00 F3000
G1 X102.68 Y429.25 Z15.00 F3000
G1 X99.50 Y425.67 Z15.00 F3000
G1 X96.87 Y421.57 Z15.00 F3000
G1 X94.78 Y416.94 Z15.00 F3000
G1 X93.27 Y411.79 Z15.00 F3000
G1 X92.09 Y405.71 Z15.00 F3000
G1 X91.29 Y399.78 Z15.00 F3000
G1 X90.11 Y389.32 Z15.00 F3000
G0 X90.11 Y389.32 Z90.00 F2524
G0 X616.32 Y380.52 Z90.00 F2524
G1 X616.32 Y380.52 Z15.00 F3000
G1 X616.40 Y389.84 Z15.00 F3000
G1 X616.27 Y399.12 Z15.00 F3000
G1 X615.77 Y404.55 Z15.00 F3000
G1 X614.74 Y409.88 Z15.00 F3000
G1 X613.16 Y415.07 Z15.00 F3000
G1 X610.99 Y420.08 Z15.00 F3000
G1 X608.70 Y424.02 Z15.00 F3000
G1 X606.03 Y427.46 Z15.00 F3000
G1 X603.02 Y430.42 Z15.00 F3000
G1 X599.69 Y432.93 Z15.00 F3000
G1 X596.08 Y435.00 Z15.00 F3000
G1 X592.20 Y436.68 Z15.00 F3000
G1 X588.09 Y437.98 Z15.00 F3000
G1 X583.77 Y438.92 Z15.00 F3000
G1 X557.93 Y443.17 Z15.00 F3000
G1 X532.05 Y447.07 Z15.00 F3000
G1 X524.52 Y448.16 Z15.00 F3000
G1 X520.76 Y448.47 Z15.00 F3000
G1 X517.03 Y448.43 Z15.00 F3000
G1 X499.95 Y447.21 Z15.00 F3000
G1 X482.92 Y445.51 Z15.00 F3000
G1 X474.44 Y444.40 Z15.00 F3000
G1 X465.99 Y443.09 Z15.00 F3000
G1 X457.58 Y441.54 Z15.00 F3000
G1 X449.20 Y439.72 Z15.00 F3000
G1 X440.33 Y437.50 Z15.00 F3000
G1 X431.59 Y434.86 Z15.00 F3000
G1 X423.05 Y431.62 Z15.00 F3000
G1 X418.89 Y429.71 Z15.00 F3000
G1 X414.82 Y427.57 Z15.00 F3000
G1 X410.50 Y424.82 Z15.00 F3000
G1 X406.54 Y421.63 Z15.00 F3000
G1 X403.03 Y417.93 Z15.00 F3000
G1 X400.03 Y413.67 Z15.00 F3000
G1 X398.18 Y410.19 Z15.00 F3000
G1 X396.69 Y406.62 Z15.00 F3000
G1 X395.56 Y402.97 Z15.00 F3000
G1 X394.77 Y399.27 Z15.00 F3000
G1 X394.29 Y395.52 Z15.00 F3000
G1 X394.10 Y391.74 Z15.00 F3000
G1 X394.18 Y387.92 Z15.00 F3000
G1 X394.52 Y384.10 Z15.00 F3000
G1 X397.64 Y361.78 Z15.00 F3000
G1 X399.55 Y350.67 Z15.00 F3000
G1 X401.77 Y339.63 Z15.00 F3000
G1 X404.99 Y325.50 Z15.00 F3000
G1 X406.79 Y318.48 Z15.00 F3000
G1 X408.79 Y311.53 Z15.00 F3000
G1 X411.06 Y304.67 Z15.00 F3000
G1 X413.66 Y297.91 Z15.00 F3000
G1 X416.63 Y291.29 Z15.00 F3000
G1 X420.05 Y284.81 Z15.00 F3000
G1 X423.30 Y279.52 Z15.00 F3000
G1 X426.85 Y274.52 Z15.00 F3000
G1 X430.69 Y269.83 Z15.00 F3000
G1 X434.84 Y265.45 Z15.00 F3000
G1 X439.30 Y261.39 Z15.00 F3000
G1 X444.07 Y257.65 Z15.00 F3000
G1 X449.16 Y254.25 Z15.00 F3000
G1 X454.57 Y251.18 Z15.00 F3000
G1 X459.53 Y248.79 Z15.00 F3000
G1 X464.58 Y246.73 Z15.00 F3000
G1 X469.71 Y244.99 Z15.00 F3000
G1 X474.91 Y243.53 Z15.00 F3000
G1 X480.19 Y242.33 Z15.00 F3000
G1 X485.52 Y241.38 Z15.00 F3000
G1 X490.91 Y240.64 Z15.00 F3000
G1 X496.35 Y240.11 Z15.00 F3000
G1 X504.70 Y239.71 Z15.00 F3000
G1 X512.95 Y239.83 Z15.00 F3000
G1 X521.12 Y240.47 Z15.00 F3000
G1 X529.19 Y241.63 Z15.00 F3000
G1 X537.17 Y243.32 Z15.00 F3000
G1 X545.06 Y245.53 Z15.00 F3000
G1 X552.85 Y248.27 Z15.00 F3000
G1 X560.55 Y251.56 Z15.00 F3000
G1 X564.79 Y253.64 Z15.00 F3000
G1 X568.90 Y255.92 Z15.00 F3000
G1 X572.86 Y258.39 Z15.00 F3000
G1 X576.66 Y261.07 Z15.00 F3000
G1 X580.30 Y263.97 Z15.00 F3000
G1 X583.76 Y267.11 Z15.00 F3000
G1 X587.04 Y270.49 Z15.00 F3000
G1 X590.13 Y274.12 Z15.00 F3000
G1 X592.74 Y277.64 Z15.00 F3000
G1 X595.11 Y281.26 Z15.00 F3000
G1 X597.27 Y284.99 Z15.00 F3000
G1 X599.22 Y288.82 Z15.00 F3000
G1 X602.60 Y296.74 Z15.00 F3000
G1 X605.39 Y304.97 Z15.00 F3000
G1 X608.06 Y314.24 Z15.00 F3000
G1 X610.37 Y323.56 Z15.00 F3000
G1 X612.33 Y332.92 Z15.00 F3000
G1 X613.91 Y342.34 Z15.00 F3000
G1 X615.11 Y351.80 Z15.00 F3000
G1 X615.91 Y361.31 Z15.00 F3000
G1 X616.32 Y370.89 Z15.00 F3000
G1 X616.32 Y380.52 Z15.00 F3000
G0 X616.32 Y380.52 Z90.00 F2524
M400
M280 P1  S90
;FOOTER
; end_gcode
G28 X Y
G0 Z100 				; HOME
G90                             ; absolute positioning
;ENDFOOTER
