<?xml version="1.0" encoding="utf-8"?>
<!-- Generator: Adobe Illustrator 22.1.0, SVG Export Plug-In . SVG Version: 6.00 Build 0)  -->
<svg version="1.1" id="Layer_1" xmlns="http://www.w3.org/2000/svg" xmlns:xlink="http://www.w3.org/1999/xlink" x="0px" y="0px"
	 viewBox="0 0 283.5 283.5" style="enable-background:new 0 0 283.5 283.5;" xml:space="preserve">
<style type="text/css">
	.st0{fill:#F4F7F5;}
	.st1{fill:#010101;}
	.st2{fill:none;stroke:#010101;stroke-width:3;stroke-miterlimit:10;}
	.st3{fill:#010101;stroke:#000000;stroke-miterlimit:10;}
	.st4{fill:none;stroke:#000000;stroke-width:3;stroke-miterlimit:10;}
	.st5{fill:none;stroke:#010101;stroke-width:5;stroke-miterlimit:10;}
</style>
<rect x="0.5" y="-0.4" class="st0" width="281.1" height="283.5"/>
<g>
	<g>
		<path d="M100.3,203.5h-4.5v-2.3h11.8v2.3h-4.5v13.4h-2.8V203.5z"/>
		<path d="M110.1,199.9h2.8v4.4l-0.1,2.3c1-0.9,2.2-1.8,3.8-1.8c2.5,0,3.6,1.7,3.6,4.7v7.4h-2.8v-7c0-1.9-0.6-2.7-1.8-2.7
			c-1,0-1.7,0.5-2.7,1.5v8.2h-2.8V199.9z"/>
		<path d="M122.7,211c0-3.8,2.7-6.2,5.4-6.2c3.2,0,4.9,2.3,4.9,5.6c0,0.5-0.1,1.1-0.1,1.3h-7.5c0.2,2.1,1.6,3.3,3.5,3.3
			c1,0,1.9-0.3,2.7-0.9l0.9,1.7c-1.1,0.8-2.5,1.3-4,1.3C125.2,217.1,122.7,214.9,122.7,211z M130.6,209.8c0-1.8-0.8-2.9-2.4-2.9
			c-1.4,0-2.6,1-2.8,2.9H130.6z"/>
		<path d="M139.1,201.2h2.9l1.4,7.9c0.3,1.7,0.5,3.3,0.8,5h0.1c0.3-1.7,0.7-3.4,1-5l1.9-7.9h2.4l1.9,7.9c0.3,1.6,0.7,3.3,1,5h0.1
			c0.3-1.7,0.5-3.4,0.8-5l1.4-7.9h2.7l-3,15.7h-3.4l-1.9-8.3c-0.3-1.2-0.5-2.4-0.7-3.6h-0.1c-0.2,1.2-0.5,2.4-0.7,3.6l-1.9,8.3h-3.4
			L139.1,201.2z"/>
		<path d="M159,213.7c0-2.5,2.1-3.8,6.9-4.4c0-1.3-0.5-2.3-2.1-2.3c-1.2,0-2.3,0.5-3.3,1.2l-1-1.8c1.3-0.8,3-1.5,4.8-1.5
			c2.9,0,4.4,1.8,4.4,5.1v7h-2.3l-0.2-1.3h-0.1c-1.1,0.9-2.3,1.6-3.7,1.6C160.4,217.1,159,215.7,159,213.7z M165.9,213.7V211
			c-3.2,0.4-4.3,1.2-4.3,2.4c0,1,0.7,1.5,1.7,1.5C164.3,215,165,214.5,165.9,213.7z"/>
		<path d="M171.2,221.4l0.5-2.1c0.2,0.1,0.6,0.2,0.8,0.2c1.2,0,2-0.8,2.4-2l0.2-0.7l-4.6-11.6h2.8l2,5.8c0.4,1,0.7,2.2,1,3.3h0.1
			c0.3-1.1,0.6-2.3,0.9-3.3l1.8-5.8h2.7l-4.3,12.3c-1,2.7-2.2,4.3-4.8,4.3C172.1,221.7,171.7,221.6,171.2,221.4z"/>
		<path d="M80,232.3h-4.5V230h11.8v2.3h-4.5v13.4H80V232.3z"/>
		<path d="M89.7,228.7h2.8v4.4l-0.1,2.3c1-0.9,2.2-1.8,3.8-1.8c2.5,0,3.6,1.7,3.6,4.7v7.4H97v-7c0-1.9-0.6-2.7-1.8-2.7
			c-1,0-1.7,0.5-2.7,1.5v8.2h-2.8V228.7z"/>
		<path d="M102.7,230.2c0-0.9,0.7-1.6,1.7-1.6s1.7,0.6,1.7,1.6c0,0.9-0.7,1.6-1.7,1.6S102.7,231.1,102.7,230.2z M103.1,233.9h2.8
			v11.8h-2.8V233.9z"/>
		<path d="M109.3,233.9h2.3l0.2,1.6h0.1c1.1-1,2.3-1.9,3.9-1.9c2.5,0,3.6,1.7,3.6,4.7v7.4h-2.8v-7c0-1.9-0.6-2.7-1.8-2.7
			c-1,0-1.7,0.5-2.7,1.5v8.2h-2.8V233.9z"/>
		<path d="M122,247.8c0-1,0.6-1.9,1.7-2.5v-0.1c-0.6-0.4-1.1-1-1.1-2c0-0.9,0.6-1.7,1.3-2.2v-0.1c-0.8-0.6-1.6-1.7-1.6-3.1
			c0-2.7,2.2-4.2,4.7-4.2c0.7,0,1.3,0.1,1.7,0.3h4.2v2.1h-2.2c0.4,0.4,0.7,1.2,0.7,2c0,2.6-2,4-4.5,4c-0.5,0-1.1-0.1-1.6-0.3
			c-0.4,0.3-0.6,0.6-0.6,1.1c0,0.7,0.5,1.1,1.9,1.1h2.1c2.8,0,4.3,0.9,4.3,2.9c0,2.3-2.4,4.2-6.3,4.2
			C124.1,250.9,122,249.9,122,247.8z M130.5,247.2c0-0.9-0.7-1.2-2.1-1.2h-1.6c-0.6,0-1.1,0-1.6-0.2c-0.6,0.5-0.9,1-0.9,1.6
			c0,1.1,1.2,1.7,3,1.7C129.2,249.1,130.5,248.2,130.5,247.2z M129.1,237.8c0-1.5-0.9-2.3-2-2.3c-1.2,0-2,0.8-2,2.3
			c0,1.5,0.9,2.4,2,2.4C128.1,240.2,129.1,239.3,129.1,237.8z"/>
		<path d="M134.1,244.3l1.3-1.8c1,0.8,2.1,1.3,3.3,1.3c1.3,0,1.9-0.6,1.9-1.4c0-1-1.3-1.4-2.5-1.9c-1.5-0.6-3.3-1.5-3.3-3.4
			c0-2,1.7-3.5,4.3-3.5c1.6,0,3,0.7,3.9,1.4l-1.3,1.7c-0.8-0.6-1.7-1-2.6-1c-1.2,0-1.7,0.6-1.7,1.3c0,0.9,1.2,1.3,2.5,1.8
			c1.6,0.6,3.4,1.4,3.4,3.6c0,2-1.6,3.7-4.6,3.7C136.9,245.9,135.2,245.2,134.1,244.3z"/>
		<path d="M149.1,230h2.9l1.4,7.9c0.3,1.7,0.5,3.3,0.8,5h0.1c0.3-1.7,0.7-3.4,1-5l1.9-7.9h2.4l1.9,7.9c0.3,1.6,0.7,3.3,1,5h0.1
			c0.3-1.7,0.5-3.4,0.8-5l1.4-7.9h2.7l-3,15.7h-3.4l-1.9-8.3c-0.3-1.2-0.5-2.4-0.7-3.6h-0.1c-0.2,1.2-0.5,2.4-0.7,3.6l-1.9,8.3h-3.4
			L149.1,230z"/>
		<path d="M168.8,239.8c0-3.9,2.7-6.2,5.6-6.2s5.6,2.3,5.6,6.2c0,3.9-2.7,6.2-5.6,6.2S168.8,243.7,168.8,239.8z M177.2,239.8
			c0-2.4-1-3.9-2.8-3.9s-2.8,1.6-2.8,3.9c0,2.4,1,3.9,2.8,3.9S177.2,242.1,177.2,239.8z"/>
		<path d="M182.8,233.9h2.3l0.2,2.1h0.1c0.8-1.5,2.1-2.4,3.4-2.4c0.6,0,1,0.1,1.3,0.2l-0.5,2.4c-0.4-0.1-0.7-0.2-1.2-0.2
			c-0.9,0-2.1,0.6-2.8,2.4v7.2h-2.8V233.9z"/>
		<path d="M191.7,228.7h2.7v10.6h0.1l4.4-5.4h3l-4,4.8l4.5,7h-3l-3-5.1l-1.8,2.1v3h-2.7V228.7z"/>
	</g>
</g>
<g>
	<g>
		<path class="st1" d="M189.7,96.8V84.7h8.1v-4h-4V62.5c0-7.8-6.3-14.2-14.2-14.2s-14.2,6.3-14.2,14.2v18.2h-4v4h8.1v12.1h-52.6
			V84.7h4V48.3H84.6v36.4h4v12.1H76.5v76.8h125.4V96.8H189.7z M169.5,62.5c0-5.6,4.5-10.1,10.1-10.1c5.6,0,10.1,4.5,10.1,10.1v18.2
			h-4V62.5h-12.1v4h8.1v14.2h-4V70.5h-4v10.1h-4V62.5z M173.5,84.7h12.1v12.1h-12.1V84.7z M88.6,52.4h28.3v28.3H88.6V52.4z
			 M92.7,84.7h20.2v12.1H92.7V84.7z M197.8,169.6H80.5v-68.7h8.1v20.2h4v-20.2h20.2v20.2h4v-20.2h52.6v28.3h4v-28.3h12.1v28.3h4
			v-28.3h8.1V169.6z"/>
		<rect x="121" y="109" class="st1" width="4" height="4"/>
		<rect x="153.3" y="109" class="st1" width="4" height="4"/>
		<path class="st1" d="M153.3,121.1h-4v-4h-4v4h-4v-4h-4v4h-4v-4h-4v4h-4v-4h-4v4v28.3v4h4v-4h4v4h4v-4h4v4h4v-4h4v4h4v-4h4v4h4v-4
			v-28.3v-4h-4V121.1z M125,145.4v-20.2h28.3v20.2H125z"/>
		<rect x="112.9" y="125.1" class="st1" width="4" height="4"/>
		<rect x="104.8" y="109" class="st1" width="4" height="4"/>
		<rect x="104.8" y="117.1" class="st1" width="4" height="4"/>
		<rect x="104.8" y="125.1" class="st1" width="4" height="4"/>
		<rect x="96.7" y="109" class="st1" width="4" height="4"/>
		<rect x="96.7" y="117.1" class="st1" width="4" height="4"/>
		<rect x="96.7" y="125.1" class="st1" width="4" height="4"/>
		<rect x="88.6" y="125.1" class="st1" width="4" height="4"/>
		<rect x="161.4" y="109" class="st1" width="4" height="4"/>
		<rect x="177.6" y="109" class="st1" width="4" height="4"/>
		<rect x="161.4" y="117.1" class="st1" width="4" height="4"/>
		<rect x="129" y="109" class="st1" width="4" height="4"/>
		<rect x="137.1" y="109" class="st1" width="4" height="4"/>
		<rect x="145.2" y="109" class="st1" width="4" height="4"/>
		<rect x="177.6" y="117.1" class="st1" width="4" height="4"/>
		<rect x="161.4" y="125.1" class="st1" width="4" height="4"/>
		<rect x="177.6" y="125.1" class="st1" width="4" height="4"/>
		<rect x="88.6" y="133.2" class="st1" width="4" height="4"/>
		<rect x="96.7" y="133.2" class="st1" width="4" height="4"/>
		<rect x="104.8" y="133.2" class="st1" width="4" height="4"/>
		<rect x="112.9" y="133.2" class="st1" width="4" height="4"/>
		<rect x="161.4" y="133.2" class="st1" width="4" height="4"/>
		<rect x="169.5" y="133.2" class="st1" width="4" height="4"/>
		<rect x="177.6" y="133.2" class="st1" width="4" height="4"/>
		<rect x="185.7" y="133.2" class="st1" width="4" height="4"/>
		<rect x="88.6" y="141.3" class="st1" width="4" height="4"/>
		<rect x="96.7" y="141.3" class="st1" width="4" height="4"/>
		<rect x="104.8" y="141.3" class="st1" width="4" height="4"/>
		<rect x="112.9" y="141.3" class="st1" width="4" height="4"/>
		<rect x="161.4" y="141.3" class="st1" width="4" height="4"/>
		<rect x="169.5" y="141.3" class="st1" width="4" height="4"/>
		<rect x="177.6" y="141.3" class="st1" width="4" height="4"/>
		<rect x="185.7" y="141.3" class="st1" width="4" height="4"/>
		<rect x="88.6" y="149.4" class="st1" width="4" height="4"/>
		<rect x="96.7" y="149.4" class="st1" width="4" height="4"/>
		<rect x="104.8" y="149.4" class="st1" width="4" height="4"/>
		<rect x="112.9" y="149.4" class="st1" width="4" height="4"/>
		<rect x="161.4" y="149.4" class="st1" width="4" height="4"/>
		<rect x="169.5" y="149.4" class="st1" width="4" height="4"/>
		<rect x="177.6" y="149.4" class="st1" width="4" height="4"/>
		<rect x="185.7" y="149.4" class="st1" width="4" height="4"/>
		<rect x="88.6" y="157.5" class="st1" width="4" height="4"/>
		<rect x="96.7" y="157.5" class="st1" width="4" height="4"/>
		<rect x="104.8" y="157.5" class="st1" width="4" height="4"/>
		<rect x="112.9" y="157.5" class="st1" width="4" height="4"/>
		<rect x="121" y="157.5" class="st1" width="4" height="4"/>
		<rect x="129" y="157.5" class="st1" width="4" height="4"/>
		<rect x="137.1" y="157.5" class="st1" width="4" height="4"/>
		<rect x="145.2" y="157.5" class="st1" width="4" height="4"/>
		<rect x="153.3" y="157.5" class="st1" width="4" height="4"/>
		<rect x="161.4" y="157.5" class="st1" width="4" height="4"/>
		<rect x="169.5" y="157.5" class="st1" width="4" height="4"/>
		<rect x="177.6" y="157.5" class="st1" width="4" height="4"/>
		<rect x="185.7" y="157.5" class="st1" width="4" height="4"/>
		<path class="st1" d="M102.8,56.4c-5.6,0-10.1,4.5-10.1,10.1s4.5,10.1,10.1,10.1c5.6,0,10.1-4.5,10.1-10.1S108.3,56.4,102.8,56.4z
			 M102.8,60.4c2.6,0,4.9,1.7,5.7,4H97.1C97.9,62.1,100.1,60.4,102.8,60.4z M102.8,72.6c-2.6,0-4.9-1.7-5.7-4h11.4
			C107.6,70.9,105.4,72.6,102.8,72.6z"/>
		<rect x="129" y="129.2" class="st1" width="4" height="4"/>
		<rect x="137.1" y="129.2" class="st1" width="12.1" height="4"/>
		<rect x="129" y="137.3" class="st1" width="20.2" height="4"/>
	</g>
</g>
<g>
	<path class="st1" d="M210.7,32.3c-4.9-4.8-10.8-7.3-17.7-7.5c-0.3,0-0.5,0-0.7-0.2c-0.2-0.2-0.2-0.5-0.1-0.7
		c0.1-0.3,0.4-0.4,0.7-0.4c1.5,0,3,0.1,4.4,0.4c5.9,1.1,10.9,3.8,15,8.1c4.7,5.1,7.1,11.1,7.2,18.1c0,0.5-0.3,0.8-0.7,0.8
		c-0.4,0-0.7-0.3-0.7-0.8c0-2.3-0.3-4.6-1-6.8c-1.1-3.7-2.9-7.1-5.5-9.9C211.4,33,211,32.7,210.7,32.3z"/>
	<path class="st1" d="M207.9,35.2c4,4.1,6.2,9.1,6.3,14.9c0,0.4-0.1,0.7-0.5,0.8c-0.3,0.1-0.6-0.1-0.8-0.4c-0.1-0.1-0.1-0.2-0.1-0.4
		c-0.1-4.2-1.3-8.1-3.8-11.5c-3.9-5.3-9.2-8-15.7-8.3c-0.1,0-0.3,0-0.4,0c-0.5,0-0.7-0.3-0.7-0.7c0-0.4,0.3-0.7,0.8-0.7
		c0.8,0,1.7,0,2.5,0.2c4.7,0.6,8.7,2.6,12.2,5.8C207.7,35,207.8,35.1,207.9,35.2z"/>
	<path class="st1" d="M204.1,39c2.9,3,4.5,6.6,4.6,10.8c0,0.2,0,0.4-0.1,0.7c-0.1,0.3-0.3,0.5-0.7,0.5c-0.4,0-0.6-0.3-0.6-0.7
		c0-1.5-0.2-2.9-0.7-4.3c-1.8-6-7.4-10.2-13.6-10.2c-0.5,0-0.9-0.3-0.9-0.7c0-0.4,0.3-0.7,0.9-0.7C197.3,34.5,201,36,204.1,39z"/>
	<path class="st1" d="M200.2,42.8c1.9,2,3,4.4,3.1,7.2c0,0.4-0.1,0.7-0.4,0.8c-0.5,0.2-0.9-0.1-0.9-0.8c0-1.5-0.4-2.9-1.1-4.2
		c-1.7-3-4.3-4.6-7.8-4.7c-0.4,0-0.7-0.2-0.8-0.5c-0.1-0.3,0.1-0.6,0.3-0.8c0.1-0.1,0.3-0.1,0.5-0.1
		C195.8,39.8,198.2,40.9,200.2,42.8z"/>
</g>
</svg>
