%!PS-Adobe-3.0
%%Creator: Rhinoceros
%%Title: (spiral.AI)
%%BoundingBox: -1 -1 216 188
%%DocumentProcessColors: Black
%%DocumentNeededResources: procset Adobe_packedarray 2.0 0
%%+ procset Adobe_cmykcolor 1.1 0
%%+ procset Adobe_cshow 1.1 0
%%+ procset Adobe_customcolor 1.0 0
%%+ procset Adobe_typography_AI3 1.0 0
%%+ procset Adobe_IllustratorA_AI3 1.0 0
%AI3_ColorUsage: Color
%AI3_TemplateBox: 288 384 288 384
%AI3_TileBox: 0 0 576 768
%AI3_DocumentPreview: None
%%Template:
%%PageOrigin:0 0
%%EndComments
%%BeginProlog
%%IncludeResource: procset Adobe_packedarray 2.0 0
Adobe_packedarray /initialize get exec
%%IncludeResource: procset Adobe_cmykcolor 1.1 0
%%IncludeResource: procset Adobe_cshow 1.1 0
%%IncludeResource: procset Adobe_customcolor 1.0 0
%%IncludeResource: procset Adobe_typography_AI3 1.0 0
%%IncludeResource: procset Adobe_IllustratorA_AI3 1.0 0
%%EndProlog
%%BeginSetup
Adobe_cmykcolor /initialize get exec
Adobe_cshow /initialize get exec
Adobe_customcolor /initialize get exec
Adobe_typography_AI3 /initialize get exec
Adobe_IllustratorA_AI3 /initialize get exec
%%EndSetup
%AI5_BeginLayer
1 1 1 1 0 0 -1 127 255 0 Lb
(Layer 02) Ln
0 A
0 R
0.4980 1.0000 0.0000 XA
0.4980 1.0000 0.0000 Xa
0 i 1 J 1 j 1.0000 w 4 M []0 d
0 D
0.0000 0.0000 m
215.4331 0.0000 L
215.4331 187.0866 L
0.0000 187.0866 L
0.0000 0.0000 L
s
0.4980 1.0000 0.0000 XA
0.4980 1.0000 0.0000 Xa
0 i 1 J 1 j 1.0000 w 4 M []0 d
0 D
113.3858 113.3858 m
73.7008 113.3858 L
73.7008 45.3543 L
170.0787 45.3543 L
170.0787 158.7402 L
170.0787 170.0787 L
17.0079 170.0787 L
17.0079 17.0079 L
28.3465 17.0079 L
28.3465 158.7402 L
158.7402 158.7402 L
158.7402 56.6929 L
85.0394 56.6929 L
85.0394 102.0472 L
102.0472 102.0472 L
102.0472 73.7008 L
141.7323 73.7008 L
141.7323 141.7323 L
45.3543 141.7323 L
45.3543 17.0079 L
198.4252 17.0079 L
198.4252 158.7402 L
198.4252 170.0787 L
187.0866 170.0787 L
187.0866 158.7402 L
187.0866 28.3465 L
56.6929 28.3465 L
56.6929 130.3937 L
130.3937 130.3937 L
130.3937 85.0394 L
113.3858 85.0394 L
113.3858 113.3858 L
s
0.4980 1.0000 0.0000 XA
0.4980 1.0000 0.0000 Xa
0 i 1 J 1 j 1.0000 w 4 M []0 d
0 D
170.0787 158.7402 m
170.0787 170.0787 L
S
0.4980 1.0000 0.0000 XA
0.4980 1.0000 0.0000 Xa
0 i 1 J 1 j 1.0000 w 4 M []0 d
0 D
17.0079 17.0079 m
17.0079 158.7402 L
S
0.4980 1.0000 0.0000 XA
0.4980 1.0000 0.0000 Xa
0 i 1 J 1 j 1.0000 w 4 M []0 d
0 D
113.3858 113.3858 m
113.3858 85.0394 L
130.3937 85.0394 L
130.3937 130.3937 L
56.6929 130.3937 L
56.6929 28.3465 L
187.0866 28.3465 L
187.0866 158.7402 L
187.0866 170.0787 L
198.4252 170.0787 L
198.4252 158.7402 L
198.4252 17.0079 L
45.3543 17.0079 L
45.3543 141.7323 L
141.7323 141.7323 L
141.7323 73.7008 L
102.0472 73.7008 L
102.0472 102.0472 L
85.0394 102.0472 L
85.0394 56.6929 L
158.7402 56.6929 L
158.7402 158.7402 L
28.3465 158.7402 L
28.3465 17.0079 L
17.0079 17.0079 L
17.0079 170.0787 L
170.0787 170.0787 L
170.0787 158.7402 L
170.0787 45.3543 L
73.7008 45.3543 L
73.7008 113.3858 L
113.3858 113.3858 L
f
LB
%AI5_EndLayer--
%%PageTrailer
gsave annotatepage grestore showpage
%%Trailer
Adobe_IllustratorA_AI3 /terminate get exec
Adobe_typography_AI3 /terminate get exec
Adobe_customcolor /terminate get exec
Adobe_cshow /terminate get exec
Adobe_cmykcolor /terminate get exec
Adobe_packedarray /terminate get exec
%%EOF
