%!PS-Adobe-3.0
%%Creator: Rhinoceros
%%Title: (16metasurnarr.AI)
%%BoundingBox: -1 15 1598 2606
%%DocumentProcessColors: Black
%%DocumentNeededResources: procset Adobe_packedarray 2.0 0
%%+ procset Adobe_cmykcolor 1.1 0
%%+ procset Adobe_cshow 1.1 0
%%+ procset Adobe_customcolor 1.0 0
%%+ procset Adobe_typography_AI3 1.0 0
%%+ procset Adobe_IllustratorA_AI3 1.0 0
%AI3_ColorUsage: Color
%AI3_TemplateBox: 288 384 288 384
%AI3_TileBox: 0 0 576 768
%AI3_DocumentPreview: None
%%Template:
%%PageOrigin:0 0
%%EndComments
%%BeginProlog
%%IncludeResource: procset Adobe_packedarray 2.0 0
Adobe_packedarray /initialize get exec
%%IncludeResource: procset Adobe_cmykcolor 1.1 0
%%IncludeResource: procset Adobe_cshow 1.1 0
%%IncludeResource: procset Adobe_customcolor 1.0 0
%%IncludeResource: procset Adobe_typography_AI3 1.0 0
%%IncludeResource: procset Adobe_IllustratorA_AI3 1.0 0
%%EndProlog
%%BeginSetup
Adobe_cmykcolor /initialize get exec
Adobe_cshow /initialize get exec
Adobe_customcolor /initialize get exec
Adobe_typography_AI3 /initialize get exec
Adobe_IllustratorA_AI3 /initialize get exec
%%EndSetup
%AI5_BeginLayer
1 1 1 1 0 0 -1 0 255 74 Lb
(outline) Ln
0 A
0 R
0.0000 1.0000 0.2902 XA
0.0000 1.0000 0.2902 Xa
0 i 1 J 1 j 1.0000 w 4 M []0 d
0 D
40.4097 2605.1140 m
59.3073 2605.0773 L
78.1682 2586.1430 L
97.1025 2605.0039 L
116.0001 2604.9672 L
134.8610 2586.0329 L
153.7953 2604.8938 L
172.6929 2604.8571 L
191.5538 2585.9228 L
210.4881 2604.7837 L
229.3857 2604.7470 L
248.2466 2585.8127 L
267.1809 2604.6736 L
286.0785 2604.6368 L
304.9394 2585.7025 L
323.8737 2604.5634 L
342.7713 2604.5267 L
361.6322 2585.5924 L
361.5221 2528.8996 L
380.4564 2547.7605 L
399.3540 2547.7238 L
418.2149 2528.7895 L
437.1492 2547.6504 L
456.0468 2547.6137 L
474.9077 2528.6794 L
475.0178 2585.3722 L
493.9522 2604.2331 L
512.8498 2604.1964 L
531.7107 2585.2620 L
550.6450 2604.1229 L
569.5426 2604.0862 L
588.4035 2585.1519 L
607.3378 2604.0128 L
626.2354 2603.9761 L
645.0963 2585.0418 L
664.0306 2603.9027 L
682.9282 2603.8660 L
701.7891 2584.9317 L
720.6500 2565.9974 L
720.6133 2547.0998 L
701.6790 2528.2389 L
720.6133 2547.0998 L
739.5109 2547.0631 L
758.3718 2528.1288 L
777.3061 2546.9896 L
796.2037 2546.9529 L
815.0646 2528.0186 L
833.9989 2546.8795 L
852.8965 2546.8428 L
871.7574 2527.9085 L
890.6917 2546.7694 L
909.5893 2546.7327 L
928.4502 2527.7984 L
909.5893 2546.7327 L
909.6260 2565.6303 L
928.5603 2584.4912 L
947.4946 2603.3521 L
966.3922 2603.3154 L
985.2531 2584.3811 L
1004.1140 2565.4468 L
1004.0773 2546.5492 L
985.1430 2527.6883 L
1004.0039 2508.7540 L
1003.9672 2489.8564 L
985.0329 2470.9955 L
966.0986 2452.1346 L
947.2010 2452.1713 L
928.3401 2471.1056 L
909.4057 2452.2447 L
890.5081 2452.2814 L
871.6473 2471.2157 L
852.7129 2452.3548 L
833.8153 2452.3915 L
814.9544 2471.3258 L
796.0201 2452.4649 L
777.1225 2452.5016 L
758.2616 2471.4359 L
739.3273 2452.5751 L
720.4297 2452.6118 L
701.5688 2471.5461 L
682.6345 2452.6852 L
663.7369 2452.7219 L
644.8760 2471.6562 L
644.9861 2528.3490 L
626.0518 2509.4881 L
607.1542 2509.5248 L
588.2933 2528.4591 L
569.3590 2509.5982 L
550.4614 2509.6349 L
531.6005 2528.5692 L
531.4904 2471.8764 L
512.5561 2453.0155 L
493.6585 2453.0522 L
474.7976 2471.9866 L
455.8633 2453.1257 L
436.9657 2453.1624 L
418.1048 2472.0967 L
399.1705 2453.2358 L
380.2729 2453.2725 L
361.4120 2472.2068 L
342.4777 2453.3459 L
323.5801 2453.3826 L
304.7192 2472.3169 L
285.8583 2491.2512 L
285.8950 2510.1488 L
304.8293 2529.0097 L
285.8950 2510.1488 L
266.9974 2510.1855 L
248.1365 2529.1198 L
229.2022 2510.2590 L
210.3046 2510.2957 L
191.4437 2529.2300 L
172.5094 2510.3691 L
153.6118 2510.4058 L
134.7509 2529.3401 L
S
0.0000 1.0000 0.2902 XA
0.0000 1.0000 0.2902 Xa
0 i 1 J 1 j 1.0000 w 4 M []0 d
0 D
77.6176 2302.6790 m
96.4785 2283.7447 L
96.4418 2264.8471 L
77.5075 2245.9862 L
96.3684 2227.0519 L
96.3317 2208.1543 L
77.3974 2189.2934 L
58.4630 2170.4325 L
39.5654 2170.4692 L
20.7045 2189.4035 L
1.8436 2208.3378 L
1.8804 2227.2354 L
20.8147 2246.0963 L
1.9538 2265.0306 L
1.9905 2283.9282 L
20.9248 2302.7891 L
2.0639 2321.7234 L
2.1006 2340.6210 L
21.0349 2359.4819 L
2.1740 2378.4162 L
2.2107 2397.3138 L
21.1450 2416.1747 L
77.8378 2416.0646 L
58.9769 2434.9989 L
59.0137 2453.8965 L
77.9480 2472.7574 L
21.2552 2472.8675 L
2.3943 2491.8018 L
2.4310 2510.6994 L
21.3653 2529.5603 L
2.5044 2548.4946 L
2.5411 2567.3922 L
21.4754 2586.2531 L
40.4097 2605.1140 L
2.5411 2567.3922 L
S
0.0000 1.0000 0.2902 XA
0.0000 1.0000 0.2902 Xa
0 i 1 J 1 j 1.0000 w 4 M []0 d
0 D
77.7277 2359.3718 m
77.6176 2302.6790 L
96.4785 2283.7447 L
115.3761 2283.7080 L
134.3104 2302.5689 L
153.2447 2321.4298 L
153.2814 2340.3274 L
134.4205 2359.2617 L
153.3548 2378.1226 L
153.3915 2397.0202 L
134.5306 2415.9545 L
153.4650 2434.8154 L
153.5017 2453.7130 L
134.6408 2472.6473 L
153.5751 2491.5082 L
153.6118 2510.4058 L
134.7509 2529.3401 L
78.0581 2529.4502 L
S
0.0000 1.0000 0.2902 XA
0.0000 1.0000 0.2902 Xa
0 i 1 J 1 j 1.0000 w 4 M []0 d
0 D
1041.6155 2414.1925 m
1041.7257 2470.8853 L
1022.8648 2489.8196 L
1003.9672 2489.8564 L
985.0329 2470.9955 L
966.0986 2452.1346 L
966.0618 2433.2370 L
984.9227 2414.3027 L
965.9884 2395.4418 L
965.9517 2376.5442 L
984.8126 2357.6098 L
965.8783 2338.7489 L
965.8416 2319.8513 L
984.7025 2300.9170 L
965.7682 2282.0561 L
965.7315 2263.1585 L
984.5924 2244.2242 L
1041.2852 2244.1141 L
S
0.0000 1.0000 0.2902 XA
0.0000 1.0000 0.2902 Xa
0 i 1 J 1 j 1.0000 w 4 M []0 d
0 D
1041.7257 2470.8853 m
1022.8648 2489.8196 L
1022.9015 2508.7172 L
1041.8358 2527.5781 L
1022.9749 2546.5125 L
1023.0116 2565.4101 L
1041.9459 2584.2709 L
1060.8802 2603.1318 L
1079.7778 2603.0951 L
1098.6387 2584.1608 L
1117.4996 2565.2265 L
1117.4629 2546.3289 L
1098.5286 2527.4680 L
1117.3895 2508.5337 L
1117.3528 2489.6361 L
1098.4185 2470.7752 L
1117.2794 2451.8409 L
1117.2427 2432.9433 L
1098.3084 2414.0824 L
1117.1692 2395.1481 L
1117.1325 2376.2505 L
1098.1982 2357.3896 L
1041.5054 2357.4997 L
1060.3663 2338.5654 L
1060.3296 2319.6678 L
1041.3953 2300.8069 L
1098.0881 2300.6968 L
1116.9490 2281.7625 L
1116.9123 2262.8649 L
1097.9780 2244.0040 L
1116.8389 2225.0697 L
1116.8022 2206.1721 L
1097.8679 2187.3112 L
1078.9336 2168.4503 L
1116.8022 2206.1721 L
S
0.0000 1.0000 0.2902 XA
0.0000 1.0000 0.2902 Xa
0 i 1 J 1 j 1.0000 w 4 M []0 d
0 D
1078.9336 2168.4503 m
1060.0360 2168.4870 L
1041.1751 2187.4213 L
1022.2408 2168.5604 L
1003.3431 2168.5971 L
984.4823 2187.5314 L
965.5479 2168.6705 L
946.6503 2168.7072 L
927.7894 2187.6415 L
908.8551 2168.7807 L
889.9575 2168.8174 L
871.0966 2187.7517 L
852.1623 2168.8908 L
833.2647 2168.9275 L
814.4038 2187.8618 L
795.4695 2169.0009 L
776.5719 2169.0376 L
757.7110 2187.9719 L
757.8211 2244.6647 L
738.8868 2225.8038 L
719.9892 2225.8405 L
701.1283 2244.7748 L
682.1940 2225.9139 L
663.2964 2225.9507 L
644.4355 2244.8850 L
644.3254 2188.1922 L
625.3911 2169.3313 L
606.4935 2169.3680 L
587.6326 2188.3023 L
568.6983 2169.4414 L
549.8007 2169.4781 L
530.9398 2188.4124 L
512.0055 2169.5515 L
493.1079 2169.5882 L
474.2470 2188.5225 L
455.3127 2169.6616 L
436.4151 2169.6983 L
417.5542 2188.6326 L
398.6933 2207.5670 L
398.7300 2226.4646 L
417.6643 2245.3255 L
398.7300 2226.4646 L
379.8324 2226.5013 L
360.9715 2245.4356 L
342.0372 2226.5747 L
323.1396 2226.6114 L
304.2787 2245.5457 L
285.3444 2226.6848 L
266.4468 2226.7215 L
247.5859 2245.6558 L
228.6516 2226.7949 L
209.7540 2226.8316 L
190.8931 2245.7659 L
209.7540 2226.8316 L
209.7173 2207.9340 L
190.7830 2189.0731 L
171.8487 2170.2122 L
152.9511 2170.2489 L
134.0902 2189.1833 L
115.2293 2208.1176 L
115.2660 2227.0152 L
134.2003 2245.8761 L
115.3394 2264.8104 L
115.3761 2283.7080 L
134.3104 2302.5689 L
153.2447 2321.4298 L
172.1423 2321.3931 L
191.0032 2302.4587 L
209.9375 2321.3196 L
228.8351 2321.2829 L
247.6960 2302.3486 L
266.6303 2321.2095 L
285.5279 2321.1728 L
304.3888 2302.2385 L
323.3231 2321.0994 L
342.2207 2321.0627 L
361.0816 2302.1284 L
380.0159 2320.9893 L
398.9135 2320.9526 L
417.7744 2302.0183 L
436.7087 2320.8792 L
455.6063 2320.8424 L
474.4672 2301.9081 L
474.3571 2245.2153 L
493.2914 2264.0762 L
512.1890 2264.0395 L
531.0499 2245.1052 L
549.9842 2263.9661 L
568.8818 2263.9294 L
587.7427 2244.9951 L
587.8529 2301.6879 L
606.7872 2320.5488 L
625.6848 2320.5121 L
644.5457 2301.5778 L
663.4800 2320.4387 L
682.3776 2320.4020 L
701.2385 2301.4676 L
720.1728 2320.3285 L
739.0704 2320.2918 L
757.9313 2301.3575 L
776.8656 2320.2184 L
795.7632 2320.1817 L
814.6241 2301.2474 L
833.4850 2282.3131 L
833.4483 2263.4155 L
814.5140 2244.5546 L
833.4483 2263.4155 L
852.3459 2263.3788 L
871.2068 2244.4445 L
890.1411 2263.3054 L
909.0387 2263.2687 L
927.8996 2244.3344 L
946.8339 2263.1952 L
965.7315 2263.1585 L
984.5924 2244.2242 L
S
0.0000 1.0000 0.2902 XA
0.0000 1.0000 0.2902 Xa
0 i 1 J 1 j 1.0000 w 4 M []0 d
0 D
1078.0893 1733.8054 m
1059.1917 1733.8421 L
1040.3308 1752.7765 L
1021.3965 1733.9156 L
1002.4989 1733.9523 L
983.6380 1752.8866 L
964.7037 1734.0257 L
945.8061 1734.0624 L
926.9452 1752.9967 L
908.0109 1734.1358 L
889.1133 1734.1725 L
870.2524 1753.1068 L
851.3181 1734.2459 L
832.4205 1734.2826 L
813.5596 1753.2169 L
794.6253 1734.3560 L
775.7277 1734.3928 L
756.8668 1753.3271 L
756.9769 1810.0199 L
738.0426 1791.1590 L
719.1450 1791.1957 L
700.2841 1810.1300 L
681.3498 1791.2691 L
662.4522 1791.3058 L
643.5913 1810.2401 L
643.4811 1753.5473 L
624.5468 1734.6864 L
605.6492 1734.7231 L
586.7883 1753.6574 L
567.8540 1734.7965 L
548.9564 1734.8332 L
530.0955 1753.7676 L
511.1612 1734.9067 L
492.2636 1734.9434 L
473.4027 1753.8777 L
454.4684 1735.0168 L
435.5708 1735.0535 L
416.7099 1753.9878 L
397.8490 1772.9221 L
397.8857 1791.8197 L
416.8200 1810.6806 L
397.8857 1791.8197 L
378.9881 1791.8564 L
360.1272 1810.7907 L
341.1929 1791.9298 L
322.2953 1791.9665 L
303.4344 1810.9008 L
284.5001 1792.0400 L
265.6025 1792.0767 L
246.7416 1811.0110 L
227.8073 1792.1501 L
208.9097 1792.1868 L
190.0488 1811.1211 L
208.9097 1792.1868 L
208.8730 1773.2892 L
189.9387 1754.4283 L
171.0044 1735.5674 L
152.1068 1735.6041 L
133.2459 1754.5384 L
114.3850 1773.4727 L
114.4217 1792.3703 L
133.3560 1811.2312 L
114.4951 1830.1655 L
114.5318 1849.0631 L
133.4661 1867.9240 L
152.4004 1886.7849 L
171.2980 1886.7482 L
190.1589 1867.8139 L
209.0932 1886.6748 L
227.9909 1886.6381 L
246.8517 1867.7038 L
265.7861 1886.5647 L
284.6837 1886.5280 L
303.5446 1867.5937 L
322.4789 1886.4545 L
341.3765 1886.4178 L
360.2374 1867.4835 L
379.1717 1886.3444 L
398.0693 1886.3077 L
416.9302 1867.3734 L
435.8645 1886.2343 L
454.7621 1886.1976 L
473.6230 1867.2633 L
473.5128 1810.5705 L
492.4472 1829.4314 L
511.3448 1829.3947 L
530.2057 1810.4604 L
549.1400 1829.3213 L
568.0376 1829.2845 L
586.8985 1810.3502 L
587.0086 1867.0430 L
605.9429 1885.9039 L
624.8405 1885.8672 L
643.7014 1866.9329 L
662.6357 1885.7938 L
681.5333 1885.7571 L
700.3942 1866.8228 L
719.3285 1885.6837 L
738.2261 1885.6470 L
757.0870 1866.7127 L
776.0213 1885.5736 L
794.9189 1885.5369 L
813.7798 1866.6026 L
832.6407 1847.6682 L
832.6040 1828.7706 L
813.6697 1809.9097 L
832.6040 1828.7706 L
851.5016 1828.7339 L
870.3625 1809.7996 L
889.2968 1828.6605 L
908.1944 1828.6238 L
927.0553 1809.6895 L
945.9896 1828.5504 L
964.8872 1828.5137 L
983.7481 1809.5794 L
S
0.0000 1.0000 0.2902 XA
0.0000 1.0000 0.2902 Xa
0 i 1 J 1 j 1.0000 w 4 M []0 d
0 D
1040.8814 2036.2405 m
1022.0205 2055.1748 L
1022.0572 2074.0724 L
1040.9915 2092.9333 L
1022.1306 2111.8676 L
1022.1673 2130.7652 L
1041.1016 2149.6261 L
1060.0360 2168.4870 L
1078.9336 2168.4503 L
1097.7945 2149.5160 L
1116.6553 2130.5817 L
1116.6186 2111.6841 L
1097.6843 2092.8232 L
1116.5452 2073.8889 L
1116.5085 2054.9913 L
1097.5742 2036.1304 L
1116.4351 2017.1961 L
1116.3984 1998.2985 L
1097.4641 1979.4376 L
1116.3250 1960.5032 L
1116.2883 1941.6056 L
1097.3540 1922.7448 L
1040.6612 1922.8549 L
1059.5221 1903.9206 L
1059.4853 1885.0230 L
1040.5510 1866.1621 L
1097.2438 1866.0519 L
1116.1047 1847.1176 L
1116.0680 1828.2200 L
1097.1337 1809.3591 L
1115.9946 1790.4248 L
1115.9579 1771.5272 L
1097.0236 1752.6663 L
1078.0893 1733.8054 L
1115.9579 1771.5272 L
S
0.0000 1.0000 0.2902 XA
0.0000 1.0000 0.2902 Xa
0 i 1 J 1 j 1.0000 w 4 M []0 d
0 D
1040.7713 1979.5477 m
1040.8814 2036.2405 L
1022.0205 2055.1748 L
1003.1229 2055.2115 L
984.1886 2036.3506 L
965.2543 2017.4897 L
965.2176 1998.5921 L
984.0785 1979.6578 L
965.1442 1960.7969 L
965.1075 1941.8993 L
983.9684 1922.9650 L
965.0340 1904.1041 L
964.9973 1885.2065 L
983.8582 1866.2722 L
964.9239 1847.4113 L
964.8872 1828.5137 L
983.7481 1809.5794 L
1040.4409 1809.4693 L
S
0.0000 1.0000 0.2902 XA
0.0000 1.0000 0.2902 Xa
0 i 1 J 1 j 1.0000 w 4 M []0 d
0 D
76.8834 1924.7269 m
76.7733 1868.0341 L
95.6342 1849.0998 L
114.5318 1849.0631 L
133.4661 1867.9240 L
152.4004 1886.7849 L
152.4371 1905.6825 L
133.5763 1924.6168 L
152.5106 1943.4777 L
152.5473 1962.3753 L
133.6864 1981.3096 L
152.6207 2000.1705 L
152.6574 2019.0681 L
133.7965 2038.0024 L
152.7308 2056.8633 L
152.7675 2075.7609 L
133.9066 2094.6952 L
77.2138 2094.8054 L
S
0.0000 1.0000 0.2902 XA
0.0000 1.0000 0.2902 Xa
0 i 1 J 1 j 1.0000 w 4 M []0 d
0 D
76.7733 1868.0341 m
95.6342 1849.0998 L
95.5975 1830.2022 L
76.6632 1811.3413 L
95.5241 1792.4070 L
95.4874 1773.5094 L
76.5531 1754.6485 L
57.6188 1735.7876 L
38.7212 1735.8243 L
19.8603 1754.7586 L
0.9994 1773.6930 L
1.0361 1792.5906 L
19.9704 1811.4515 L
1.1095 1830.3858 L
1.1462 1849.2834 L
20.0805 1868.1443 L
1.2196 1887.0786 L
1.2563 1905.9762 L
20.1906 1924.8371 L
1.3297 1943.7714 L
1.3665 1962.6690 L
20.3008 1981.5299 L
76.9936 1981.4198 L
58.1327 2000.3541 L
58.1694 2019.2517 L
77.1037 2038.1126 L
20.4109 2038.2227 L
1.5500 2057.1570 L
1.5867 2076.0546 L
20.5210 2094.9155 L
1.6601 2113.8498 L
1.6968 2132.7474 L
20.6311 2151.6083 L
39.5654 2170.4692 L
1.6968 2132.7474 L
S
0.0000 1.0000 0.2902 XA
0.0000 1.0000 0.2902 Xa
0 i 1 J 1 j 1.0000 w 4 M []0 d
0 D
39.5654 2170.4692 m
58.4630 2170.4325 L
77.3239 2151.4982 L
96.2582 2170.3591 L
115.1558 2170.3224 L
134.0167 2151.3881 L
152.9511 2170.2489 L
171.8487 2170.2122 L
190.7095 2151.2779 L
209.6439 2170.1388 L
228.5415 2170.1021 L
247.4024 2151.1678 L
266.3367 2170.0287 L
285.2343 2169.9920 L
304.0952 2151.0577 L
323.0295 2169.9186 L
341.9271 2169.8819 L
360.7880 2150.9476 L
360.6778 2094.2548 L
379.6122 2113.1157 L
398.5098 2113.0789 L
417.3707 2094.1446 L
436.3050 2113.0055 L
455.2026 2112.9688 L
474.0635 2094.0345 L
474.1736 2150.7273 L
493.1079 2169.5882 L
512.0055 2169.5515 L
530.8664 2150.6172 L
549.8007 2169.4781 L
568.6983 2169.4414 L
587.5592 2150.5071 L
606.4935 2169.3680 L
625.3911 2169.3313 L
644.2520 2150.3970 L
663.1863 2169.2578 L
682.0839 2169.2211 L
700.9448 2150.2868 L
719.8057 2131.3525 L
719.7690 2112.4549 L
700.8347 2093.5940 L
719.7690 2112.4549 L
738.6666 2112.4182 L
757.5275 2093.4839 L
776.4618 2112.3448 L
795.3594 2112.3081 L
814.2203 2093.3738 L
833.1546 2112.2347 L
852.0522 2112.1980 L
870.9131 2093.2637 L
889.8474 2112.1246 L
908.7450 2112.0878 L
927.6059 2093.1535 L
908.7450 2112.0878 L
908.7817 2130.9854 L
927.7160 2149.8463 L
946.6503 2168.7072 L
965.5479 2168.6705 L
984.4088 2149.7362 L
1003.2697 2130.8019 L
1003.2330 2111.9043 L
984.2987 2093.0434 L
1003.1596 2074.1091 L
1003.1229 2055.2115 L
984.1886 2036.3506 L
965.2543 2017.4897 L
946.3567 2017.5264 L
927.4958 2036.4607 L
908.5615 2017.5998 L
889.6639 2017.6365 L
870.8030 2036.5709 L
851.8687 2017.7100 L
832.9711 2017.7467 L
814.1102 2036.6810 L
795.1759 2017.8201 L
776.2783 2017.8568 L
757.4174 2036.7911 L
738.4831 2017.9302 L
719.5855 2017.9669 L
700.7246 2036.9012 L
681.7903 2018.0403 L
662.8927 2018.0770 L
644.0318 2037.0113 L
644.1419 2093.7041 L
625.2076 2074.8433 L
606.3100 2074.8800 L
587.4491 2093.8143 L
568.5148 2074.9534 L
549.6172 2074.9901 L
530.7563 2093.9244 L
530.6461 2037.2316 L
511.7118 2018.3707 L
492.8142 2018.4074 L
473.9533 2037.3417 L
455.0190 2018.4808 L
436.1214 2018.5175 L
417.2605 2037.4518 L
398.3262 2018.5909 L
379.4286 2018.6276 L
360.5677 2037.5619 L
341.6334 2018.7011 L
322.7358 2018.7378 L
303.8749 2037.6721 L
285.0140 2056.6064 L
285.0507 2075.5040 L
303.9850 2094.3649 L
285.0507 2075.5040 L
266.1531 2075.5407 L
247.2922 2094.4750 L
228.3579 2075.6141 L
209.4603 2075.6508 L
190.5994 2094.5851 L
171.6651 2075.7242 L
152.7675 2075.7609 L
133.9066 2094.6952 L
S
0.0000 1.0000 0.2902 XA
0.0000 1.0000 0.2902 Xa
0 i 1 J 1 j 1.0000 w 4 M []0 d
0 D
38.7212 1735.8243 m
57.6188 1735.7876 L
76.4797 1716.8533 L
95.4140 1735.7142 L
114.3116 1735.6775 L
133.1725 1716.7432 L
152.1068 1735.6041 L
171.0044 1735.5674 L
189.8653 1716.6331 L
208.7996 1735.4940 L
227.6972 1735.4573 L
246.5581 1716.5230 L
265.4924 1735.3839 L
284.3900 1735.3471 L
303.2509 1716.4128 L
322.1852 1735.2737 L
341.0828 1735.2370 L
359.9437 1716.3027 L
359.8336 1659.6099 L
378.7679 1678.4708 L
397.6655 1678.4341 L
416.5264 1659.4998 L
435.4607 1678.3607 L
454.3583 1678.3240 L
473.2192 1659.3897 L
473.3293 1716.0825 L
492.2636 1734.9434 L
511.1612 1734.9067 L
530.0221 1715.9723 L
548.9564 1734.8332 L
567.8540 1734.7965 L
586.7149 1715.8622 L
605.6492 1734.7231 L
624.5468 1734.6864 L
643.4077 1715.7521 L
662.3420 1734.6130 L
681.2396 1734.5763 L
700.1005 1715.6420 L
718.9614 1696.7077 L
718.9247 1677.8101 L
699.9904 1658.9492 L
718.9247 1677.8101 L
737.8223 1677.7734 L
756.6832 1658.8391 L
775.6175 1677.6999 L
794.5151 1677.6632 L
813.3760 1658.7289 L
832.3103 1677.5898 L
851.2079 1677.5531 L
870.0688 1658.6188 L
889.0031 1677.4797 L
907.9007 1677.4430 L
926.7616 1658.5087 L
907.9007 1677.4430 L
907.9375 1696.3406 L
926.8718 1715.2015 L
945.8061 1734.0624 L
964.7037 1734.0257 L
983.5646 1715.0914 L
1002.4255 1696.1571 L
1002.3888 1677.2595 L
983.4544 1658.3986 L
1002.3153 1639.4643 L
1002.2786 1620.5667 L
983.3443 1601.7058 L
964.4100 1582.8449 L
945.5124 1582.8816 L
926.6515 1601.8159 L
907.7172 1582.9550 L
888.8196 1582.9917 L
869.9587 1601.9260 L
851.0244 1583.0651 L
832.1268 1583.1018 L
813.2659 1602.0361 L
794.3316 1583.1752 L
775.4340 1583.2119 L
756.5731 1602.1462 L
737.6388 1583.2854 L
718.7412 1583.3221 L
699.8803 1602.2564 L
680.9460 1583.3955 L
662.0484 1583.4322 L
643.1875 1602.3665 L
643.2976 1659.0593 L
624.3633 1640.1984 L
605.4657 1640.2351 L
586.6048 1659.1694 L
567.6705 1640.3085 L
548.7729 1640.3452 L
529.9120 1659.2795 L
529.8019 1602.5867 L
510.8676 1583.7258 L
491.9700 1583.7625 L
473.1091 1602.6969 L
454.1748 1583.8360 L
435.2772 1583.8727 L
416.4163 1602.8070 L
397.4820 1583.9461 L
378.5843 1583.9828 L
359.7235 1602.9171 L
340.7891 1584.0562 L
321.8915 1584.0929 L
303.0306 1603.0272 L
284.1698 1621.9615 L
284.2065 1640.8591 L
303.1408 1659.7200 L
284.2065 1640.8591 L
265.3089 1640.8958 L
246.4480 1659.8302 L
227.5137 1640.9693 L
208.6161 1641.0060 L
189.7552 1659.9403 L
170.8208 1641.0794 L
151.9232 1641.1161 L
133.0624 1660.0504 L
S
0.0000 1.0000 0.2902 XA
0.0000 1.0000 0.2902 Xa
0 i 1 J 1 j 1.0000 w 4 M []0 d
0 D
75.9291 1433.3893 m
94.7900 1414.4550 L
94.7532 1395.5574 L
75.8189 1376.6965 L
94.6798 1357.7622 L
94.6431 1338.8646 L
75.7088 1320.0037 L
56.7745 1301.1428 L
37.8769 1301.1795 L
19.0160 1320.1138 L
0.1551 1339.0481 L
0.1918 1357.9457 L
19.1261 1376.8066 L
0.2652 1395.7409 L
0.3019 1414.6385 L
19.2363 1433.4994 L
0.3754 1452.4337 L
0.4121 1471.3313 L
19.3464 1490.1922 L
0.4855 1509.1265 L
0.5222 1528.0241 L
19.4565 1546.8850 L
76.1493 1546.7749 L
57.2884 1565.7092 L
57.3251 1584.6068 L
76.2594 1603.4677 L
19.5666 1603.5778 L
0.7057 1622.5121 L
0.7424 1641.4097 L
19.6767 1660.2706 L
0.8158 1679.2049 L
0.8526 1698.1026 L
19.7869 1716.9634 L
38.7212 1735.8243 L
0.8526 1698.1026 L
S
0.0000 1.0000 0.2902 XA
0.0000 1.0000 0.2902 Xa
0 i 1 J 1 j 1.0000 w 4 M []0 d
0 D
76.0392 1490.0821 m
75.9291 1433.3893 L
94.7900 1414.4550 L
113.6876 1414.4183 L
132.6219 1433.2792 L
151.5562 1452.1401 L
151.5929 1471.0377 L
132.7320 1489.9720 L
151.6663 1508.8329 L
151.7030 1527.7305 L
132.8421 1546.6648 L
151.7764 1565.5257 L
151.8131 1584.4233 L
132.9522 1603.3576 L
151.8865 1622.2185 L
151.9232 1641.1161 L
133.0624 1660.0504 L
76.3695 1660.1605 L
S
0.0000 1.0000 0.2902 XA
0.0000 1.0000 0.2902 Xa
0 i 1 J 1 j 1.0000 w 4 M []0 d
0 D
1597.0114 1556.3770 m
1597.0114 1537.4793 L
1578.1138 1518.5817 L
1597.0114 1499.6841 L
1597.0114 1480.7864 L
1578.1138 1461.8888 L
1597.0114 1442.9912 L
1597.0114 1424.0935 L
1578.1138 1405.1959 L
1597.0114 1386.2982 L
1597.0114 1367.4006 L
1578.1138 1348.5030 L
1597.0114 1329.6053 L
1597.0114 1310.7077 L
1578.1138 1291.8100 L
1597.0114 1272.9124 L
1597.0114 1254.0148 L
1578.1138 1235.1171 L
1521.4208 1235.1171 L
1540.3185 1216.2195 L
1540.3185 1197.3219 L
1521.4208 1178.4242 L
1540.3185 1159.5266 L
1540.3185 1140.6289 L
1521.4208 1121.7313 L
1578.1138 1121.7313 L
1597.0114 1102.8337 L
1597.0114 1083.9360 L
1578.1138 1065.0384 L
1597.0114 1046.1408 L
1597.0114 1027.2431 L
1578.1138 1008.3455 L
1597.0114 989.4478 L
1597.0114 970.5502 L
1578.1138 951.6526 L
1597.0114 932.7549 L
1597.0114 913.8573 L
1578.1138 894.9597 L
1559.2161 876.0620 L
1540.3185 876.0620 L
1521.4208 894.9597 L
1540.3185 876.0620 L
1540.3185 857.1644 L
1521.4208 838.2667 L
1540.3185 819.3691 L
1540.3185 800.4715 L
1521.4208 781.5738 L
1540.3185 762.6762 L
1540.3185 743.7786 L
1521.4208 724.8809 L
1540.3185 705.9833 L
1540.3185 687.0856 L
1521.4208 668.1880 L
1540.3185 687.0856 L
1559.2161 687.0856 L
1578.1138 668.1880 L
1597.0114 649.2904 L
1597.0114 630.3927 L
1578.1138 611.4951 L
1559.2161 592.5975 L
1540.3185 592.5975 L
1521.4208 611.4951 L
1502.5232 592.5975 L
1483.6256 592.5975 L
1464.7279 611.4951 L
1445.8303 630.3927 L
1445.8303 649.2904 L
1464.7279 668.1880 L
1445.8303 687.0856 L
1445.8303 705.9833 L
1464.7279 724.8809 L
1445.8303 743.7786 L
1445.8303 762.6762 L
1464.7279 781.5738 L
1445.8303 800.4715 L
1445.8303 819.3691 L
1464.7279 838.2667 L
1445.8303 857.1644 L
1445.8303 876.0620 L
1464.7279 894.9597 L
1445.8303 913.8573 L
1445.8303 932.7549 L
1464.7279 951.6526 L
1521.4208 951.6526 L
1502.5232 970.5502 L
1502.5232 989.4478 L
1521.4208 1008.3455 L
1502.5232 1027.2431 L
1502.5232 1046.1408 L
1521.4208 1065.0384 L
1464.7279 1065.0384 L
1445.8303 1083.9360 L
1445.8303 1102.8337 L
1464.7279 1121.7313 L
1445.8303 1140.6289 L
1445.8303 1159.5266 L
1464.7279 1178.4242 L
1445.8303 1197.3219 L
1445.8303 1216.2195 L
1464.7279 1235.1171 L
1445.8303 1254.0148 L
1445.8303 1272.9124 L
1464.7279 1291.8100 L
1483.6256 1310.7077 L
1502.5232 1310.7077 L
1521.4208 1291.8100 L
1502.5232 1310.7077 L
1502.5232 1329.6053 L
1521.4208 1348.5030 L
1502.5232 1367.4006 L
1502.5232 1386.2982 L
1521.4208 1405.1959 L
1502.5232 1424.0935 L
1502.5232 1442.9912 L
1521.4208 1461.8888 L
S
0.0000 1.0000 0.2902 XA
0.0000 1.0000 0.2902 Xa
0 i 1 J 1 j 1.0000 w 4 M []0 d
0 D
1351.3421 1518.5817 m
1294.6492 1518.5817 L
1275.7516 1499.6841 L
1275.7516 1480.7864 L
1294.6492 1461.8888 L
1313.5468 1442.9912 L
1332.4445 1442.9912 L
1351.3421 1461.8888 L
1370.2397 1442.9912 L
1389.1374 1442.9912 L
1408.0350 1461.8888 L
1426.9327 1442.9912 L
1445.8303 1442.9912 L
1464.7279 1461.8888 L
1483.6256 1442.9912 L
1502.5232 1442.9912 L
1521.4208 1461.8888 L
1521.4208 1518.5817 L
S
0.0000 1.0000 0.2902 XA
0.0000 1.0000 0.2902 Xa
0 i 1 J 1 j 1.0000 w 4 M []0 d
0 D
1294.6492 1518.5817 m
1275.7516 1499.6841 L
1256.8539 1499.6841 L
1237.9563 1518.5817 L
1219.0586 1499.6841 L
1200.1610 1499.6841 L
1181.2634 1518.5817 L
1162.3657 1537.4793 L
1162.3657 1556.3770 L
1181.2634 1575.2746 L
1200.1610 1594.1723 L
1219.0586 1594.1723 L
1237.9563 1575.2746 L
1256.8539 1594.1723 L
1275.7516 1594.1723 L
1294.6492 1575.2746 L
1313.5468 1594.1723 L
1332.4445 1594.1723 L
1351.3421 1575.2746 L
1370.2397 1594.1723 L
1389.1374 1594.1723 L
1408.0350 1575.2746 L
1408.0350 1518.5817 L
1426.9327 1537.4793 L
1445.8303 1537.4793 L
1464.7279 1518.5817 L
1464.7279 1575.2746 L
1483.6256 1594.1723 L
1502.5232 1594.1723 L
1521.4208 1575.2746 L
1540.3185 1594.1723 L
1559.2161 1594.1723 L
1578.1138 1575.2746 L
1597.0114 1556.3770 L
1559.2161 1594.1723 L
S
0.0000 1.0000 0.2902 XA
0.0000 1.0000 0.2902 Xa
0 i 1 J 1 j 1.0000 w 4 M []0 d
0 D
0.0000 53.8583 m
0.0000 72.7559 L
18.8976 91.6535 L
0.0000 110.5512 L
0.0000 129.4488 L
18.8976 148.3465 L
0.0000 167.2441 L
0.0000 186.1417 L
18.8976 205.0394 L
0.0000 223.9370 L
0.0000 242.8346 L
18.8976 261.7323 L
0.0000 280.6299 L
0.0000 299.5276 L
18.8976 318.4252 L
0.0000 337.3228 L
0.0000 356.2205 L
18.8976 375.1181 L
75.5906 375.1181 L
56.6929 394.0157 L
56.6929 412.9134 L
75.5906 431.8110 L
56.6929 450.7087 L
56.6929 469.6063 L
75.5906 488.5039 L
18.8976 488.5039 L
0.0000 507.4016 L
0.0000 526.2992 L
18.8976 545.1969 L
0.0000 564.0945 L
0.0000 582.9921 L
18.8976 601.8898 L
0.0000 620.7874 L
0.0000 639.6850 L
18.8976 658.5827 L
0.0000 677.4803 L
0.0000 696.3780 L
18.8976 715.2756 L
37.7953 734.1732 L
56.6929 734.1732 L
75.5906 715.2756 L
56.6929 734.1732 L
56.6929 753.0709 L
75.5906 771.9685 L
56.6929 790.8661 L
56.6929 809.7638 L
75.5906 828.6614 L
56.6929 847.5591 L
56.6929 866.4567 L
75.5906 885.3543 L
56.6929 904.2520 L
56.6929 923.1496 L
75.5906 942.0472 L
56.6929 923.1496 L
37.7953 923.1496 L
18.8976 942.0472 L
0.0000 960.9449 L
0.0000 979.8425 L
18.8976 998.7402 L
37.7953 1017.6378 L
56.6929 1017.6378 L
75.5906 998.7402 L
94.4882 1017.6378 L
113.3858 1017.6378 L
132.2835 998.7402 L
151.1811 979.8425 L
151.1811 960.9449 L
132.2835 942.0472 L
151.1811 923.1496 L
151.1811 904.2520 L
132.2835 885.3543 L
151.1811 866.4567 L
151.1811 847.5591 L
132.2835 828.6614 L
151.1811 809.7638 L
151.1811 790.8661 L
132.2835 771.9685 L
151.1811 753.0709 L
151.1811 734.1732 L
132.2835 715.2756 L
151.1811 696.3780 L
151.1811 677.4803 L
132.2835 658.5827 L
75.5906 658.5827 L
94.4882 639.6850 L
94.4882 620.7874 L
75.5906 601.8898 L
94.4882 582.9921 L
94.4882 564.0945 L
75.5906 545.1969 L
132.2835 545.1969 L
151.1811 526.2992 L
151.1811 507.4016 L
132.2835 488.5039 L
151.1811 469.6063 L
151.1811 450.7087 L
132.2835 431.8110 L
151.1811 412.9134 L
151.1811 394.0157 L
132.2835 375.1181 L
151.1811 356.2205 L
151.1811 337.3228 L
132.2835 318.4252 L
113.3858 299.5276 L
94.4882 299.5276 L
75.5906 318.4252 L
94.4882 299.5276 L
94.4882 280.6299 L
75.5906 261.7323 L
94.4882 242.8346 L
94.4882 223.9370 L
75.5906 205.0394 L
94.4882 186.1417 L
94.4882 167.2441 L
75.5906 148.3465 L
S
0.0000 1.0000 0.2902 XA
0.0000 1.0000 0.2902 Xa
0 i 1 J 1 j 1.0000 w 4 M []0 d
0 D
1256.7723 233.4652 m
1313.4652 233.4652 L
1332.3628 252.3628 L
1332.3628 271.2605 L
1313.4652 290.1581 L
1294.5676 309.0558 L
1275.6699 309.0558 L
1256.7723 290.1581 L
1237.8747 309.0558 L
1218.9770 309.0558 L
1200.0794 290.1581 L
1181.1817 309.0558 L
1162.2841 309.0558 L
1143.3865 290.1581 L
1124.4888 309.0558 L
1105.5912 309.0558 L
1086.6936 290.1581 L
1086.6936 233.4652 L
S
0.0000 1.0000 0.2902 XA
0.0000 1.0000 0.2902 Xa
0 i 1 J 1 j 1.0000 w 4 M []0 d
0 D
1313.4652 233.4652 m
1332.3628 252.3628 L
1351.2605 252.3628 L
1370.1581 233.4652 L
1389.0558 252.3628 L
1407.9534 252.3628 L
1426.8510 233.4652 L
1445.7487 214.5676 L
1445.7487 195.6699 L
1426.8510 176.7723 L
1407.9534 157.8747 L
1389.0558 157.8747 L
1370.1581 176.7723 L
1351.2605 157.8747 L
1332.3628 157.8747 L
1313.4652 176.7723 L
1294.5676 157.8747 L
1275.6699 157.8747 L
1256.7723 176.7723 L
1237.8747 157.8747 L
1218.9770 157.8747 L
1200.0794 176.7723 L
1200.0794 233.4652 L
1181.1817 214.5676 L
1162.2841 214.5676 L
1143.3865 233.4652 L
1143.3865 176.7723 L
1124.4888 157.8747 L
1105.5912 157.8747 L
1086.6936 176.7723 L
1067.7959 157.8747 L
1048.8983 157.8747 L
1030.0006 176.7723 L
1011.1030 195.6699 L
1048.8983 157.8747 L
S
0.0000 1.0000 0.2902 XA
0.0000 1.0000 0.2902 Xa
0 i 1 J 1 j 1.0000 w 4 M []0 d
0 D
1011.1030 195.6699 m
1011.1030 214.5676 L
1030.0006 233.4652 L
1011.1030 252.3628 L
1011.1030 271.2605 L
1030.0006 290.1581 L
1011.1030 309.0558 L
1011.1030 327.9534 L
1030.0006 346.8510 L
1011.1030 365.7487 L
1011.1030 384.6463 L
1030.0006 403.5439 L
1011.1030 422.4416 L
1011.1030 441.3392 L
1030.0006 460.2369 L
1011.1030 479.1345 L
1011.1030 498.0321 L
1030.0006 516.9298 L
1086.6936 516.9298 L
1067.7959 535.8274 L
1067.7959 554.7250 L
1086.6936 573.6227 L
1067.7959 592.5203 L
1067.7959 611.4180 L
1086.6936 630.3156 L
1030.0006 630.3156 L
1011.1030 649.2132 L
1011.1030 668.1109 L
1030.0006 687.0085 L
1011.1030 705.9061 L
1011.1030 724.8038 L
1030.0006 743.7014 L
1011.1030 762.5991 L
1011.1030 781.4967 L
1030.0006 800.3943 L
1011.1030 819.2920 L
1011.1030 838.1896 L
1030.0006 857.0873 L
1048.8983 875.9849 L
1067.7959 875.9849 L
1086.6936 857.0873 L
1067.7959 875.9849 L
1067.7959 894.8825 L
1086.6936 913.7802 L
1067.7959 932.6778 L
1067.7959 951.5754 L
1086.6936 970.4731 L
1067.7959 989.3707 L
1067.7959 1008.2684 L
1086.6936 1027.1660 L
1067.7959 1046.0636 L
1067.7959 1064.9613 L
1086.6936 1083.8589 L
1067.7959 1064.9613 L
1048.8983 1064.9613 L
1030.0006 1083.8589 L
1011.1030 1102.7565 L
1011.1030 1121.6542 L
1030.0006 1140.5518 L
1048.8983 1159.4495 L
1067.7959 1159.4495 L
1086.6936 1140.5518 L
1105.5912 1159.4495 L
1124.4888 1159.4495 L
1143.3865 1140.5518 L
1162.2841 1121.6542 L
1162.2841 1102.7565 L
1143.3865 1083.8589 L
1162.2841 1064.9613 L
1162.2841 1046.0636 L
1143.3865 1027.1660 L
1162.2841 1008.2684 L
1162.2841 989.3707 L
1143.3865 970.4731 L
1162.2841 951.5754 L
1162.2841 932.6778 L
1143.3865 913.7802 L
1162.2841 894.8825 L
1162.2841 875.9849 L
1143.3865 857.0873 L
1162.2841 838.1896 L
1162.2841 819.2920 L
1143.3865 800.3943 L
1086.6936 800.3943 L
1105.5912 781.4967 L
1105.5912 762.5991 L
1086.6936 743.7014 L
1105.5912 724.8038 L
1105.5912 705.9061 L
1086.6936 687.0085 L
1143.3865 687.0085 L
1162.2841 668.1109 L
1162.2841 649.2132 L
1143.3865 630.3156 L
1162.2841 611.4180 L
1162.2841 592.5203 L
1143.3865 573.6227 L
1162.2841 554.7250 L
1162.2841 535.8274 L
1143.3865 516.9298 L
1162.2841 498.0321 L
1162.2841 479.1345 L
1143.3865 460.2369 L
1124.4888 441.3392 L
1105.5912 441.3392 L
1086.6936 460.2369 L
1105.5912 441.3392 L
1105.5912 422.4416 L
1086.6936 403.5439 L
1105.5912 384.6463 L
1105.5912 365.7487 L
1086.6936 346.8510 L
1105.5912 327.9534 L
1105.5912 309.0558 L
1086.6936 290.1581 L
S
0.0000 1.0000 0.2902 XA
0.0000 1.0000 0.2902 Xa
0 i 1 J 1 j 1.0000 w 4 M []0 d
0 D
1058.3493 1225.5889 m
1001.6564 1225.5889 L
982.7588 1206.6913 L
982.7588 1187.7937 L
1001.6564 1168.8960 L
1020.5541 1149.9984 L
1039.4517 1149.9984 L
1058.3493 1168.8960 L
1077.2470 1149.9984 L
1096.1446 1149.9984 L
1115.0423 1168.8960 L
1133.9399 1149.9984 L
1152.8375 1149.9984 L
1171.7352 1168.8960 L
1190.6328 1149.9984 L
1209.5304 1149.9984 L
1228.4281 1168.8960 L
1228.4281 1225.5889 L
S
0.0000 1.0000 0.2902 XA
0.0000 1.0000 0.2902 Xa
0 i 1 J 1 j 1.0000 w 4 M []0 d
0 D
1001.6564 1225.5889 m
982.7588 1206.6913 L
963.8612 1206.6913 L
944.9635 1225.5889 L
926.0659 1206.6913 L
907.1682 1206.6913 L
888.2706 1225.5889 L
869.3730 1244.4866 L
869.3730 1263.3842 L
888.2706 1282.2819 L
907.1682 1301.1795 L
926.0659 1301.1795 L
944.9635 1282.2819 L
963.8612 1301.1795 L
982.7588 1301.1795 L
1001.6564 1282.2819 L
1020.5541 1301.1795 L
1039.4517 1301.1795 L
1058.3493 1282.2819 L
1077.2470 1301.1795 L
1096.1446 1301.1795 L
1115.0423 1282.2819 L
1115.0423 1225.5889 L
1133.9399 1244.4866 L
1152.8375 1244.4866 L
1171.7352 1225.5889 L
1171.7352 1282.2819 L
1190.6328 1301.1795 L
1209.5304 1301.1795 L
1228.4281 1282.2819 L
1247.3257 1301.1795 L
1266.2234 1301.1795 L
1285.1210 1282.2819 L
1304.0186 1263.3842 L
1266.2234 1301.1795 L
S
0.0000 1.0000 0.2902 XA
0.0000 1.0000 0.2902 Xa
0 i 1 J 1 j 1.0000 w 4 M []0 d
0 D
1304.0186 1263.3842 m
1304.0186 1244.4866 L
1285.1210 1225.5889 L
1304.0186 1206.6913 L
1304.0186 1187.7937 L
1285.1210 1168.8960 L
1304.0186 1149.9984 L
1304.0186 1131.1008 L
1285.1210 1112.2031 L
1304.0186 1093.3055 L
1304.0186 1074.4078 L
1285.1210 1055.5102 L
1304.0186 1036.6126 L
1304.0186 1017.7149 L
1285.1210 998.8173 L
1304.0186 979.9196 L
1304.0186 961.0220 L
1285.1210 942.1244 L
1228.4281 942.1244 L
1247.3257 923.2267 L
1247.3257 904.3291 L
1228.4281 885.4315 L
1247.3257 866.5338 L
1247.3257 847.6362 L
1228.4281 828.7385 L
1285.1210 828.7385 L
1304.0186 809.8409 L
1304.0186 790.9433 L
1285.1210 772.0456 L
1304.0186 753.1480 L
1304.0186 734.2504 L
1285.1210 715.3527 L
1304.0186 696.4551 L
1304.0186 677.5574 L
1285.1210 658.6598 L
1304.0186 639.7622 L
1304.0186 620.8645 L
1285.1210 601.9669 L
1266.2234 583.0693 L
1247.3257 583.0693 L
1228.4281 601.9669 L
1247.3257 583.0693 L
1247.3257 564.1716 L
1228.4281 545.2740 L
1247.3257 526.3763 L
1247.3257 507.4787 L
1228.4281 488.5811 L
1247.3257 469.6834 L
1247.3257 450.7858 L
1228.4281 431.8882 L
1247.3257 412.9905 L
1247.3257 394.0929 L
1228.4281 375.1952 L
1247.3257 394.0929 L
1266.2234 394.0929 L
1285.1210 375.1952 L
1304.0186 356.2976 L
1304.0186 337.4000 L
1285.1210 318.5023 L
1266.2234 299.6047 L
1247.3257 299.6047 L
1228.4281 318.5023 L
1209.5304 299.6047 L
1190.6328 299.6047 L
1171.7352 318.5023 L
1152.8375 337.4000 L
1152.8375 356.2976 L
1171.7352 375.1952 L
1152.8375 394.0929 L
1152.8375 412.9905 L
1171.7352 431.8882 L
1152.8375 450.7858 L
1152.8375 469.6834 L
1171.7352 488.5811 L
1152.8375 507.4787 L
1152.8375 526.3763 L
1171.7352 545.2740 L
1152.8375 564.1716 L
1152.8375 583.0693 L
1171.7352 601.9669 L
1152.8375 620.8645 L
1152.8375 639.7622 L
1171.7352 658.6598 L
1228.4281 658.6598 L
1209.5304 677.5574 L
1209.5304 696.4551 L
1228.4281 715.3527 L
1209.5304 734.2504 L
1209.5304 753.1480 L
1228.4281 772.0456 L
1171.7352 772.0456 L
1152.8375 790.9433 L
1152.8375 809.8409 L
1171.7352 828.7385 L
1152.8375 847.6362 L
1152.8375 866.5338 L
1171.7352 885.4315 L
1152.8375 904.3291 L
1152.8375 923.2267 L
1171.7352 942.1244 L
1152.8375 961.0220 L
1152.8375 979.9196 L
1171.7352 998.8173 L
1190.6328 1017.7149 L
1209.5304 1017.7149 L
1228.4281 998.8173 L
1209.5304 1017.7149 L
1209.5304 1036.6126 L
1228.4281 1055.5102 L
1209.5304 1074.4078 L
1209.5304 1093.3055 L
1228.4281 1112.2031 L
1209.5304 1131.1008 L
1209.5304 1149.9984 L
1228.4281 1168.8960 L
S
0.0000 1.0000 0.2902 XA
0.0000 1.0000 0.2902 Xa
0 i 1 J 1 j 1.0000 w 4 M []0 d
0 D
1445.8303 1405.1959 m
1445.8303 1386.2982 L
1426.9327 1367.4006 L
1445.8303 1348.5030 L
1445.8303 1329.6053 L
1426.9327 1310.7077 L
1445.8303 1291.8100 L
1445.8303 1272.9124 L
1426.9327 1254.0148 L
1445.8303 1235.1171 L
1445.8303 1216.2195 L
1426.9327 1197.3219 L
1445.8303 1178.4242 L
1445.8303 1159.5266 L
1426.9327 1140.6289 L
1445.8303 1121.7313 L
1445.8303 1102.8337 L
1426.9327 1083.9360 L
1370.2397 1083.9360 L
1389.1374 1065.0384 L
1389.1374 1046.1408 L
1370.2397 1027.2431 L
1389.1374 1008.3455 L
1389.1374 989.4478 L
1370.2397 970.5502 L
1426.9327 970.5502 L
1445.8303 951.6526 L
1445.8303 932.7549 L
1426.9327 913.8573 L
1445.8303 894.9597 L
1445.8303 876.0620 L
1426.9327 857.1644 L
1445.8303 838.2667 L
1445.8303 819.3691 L
1426.9327 800.4715 L
1445.8303 781.5738 L
1445.8303 762.6762 L
1426.9327 743.7786 L
1408.0350 724.8809 L
1389.1374 724.8809 L
1370.2397 743.7786 L
1389.1374 724.8809 L
1389.1374 705.9833 L
1370.2397 687.0856 L
1389.1374 668.1880 L
1389.1374 649.2904 L
1370.2397 630.3927 L
1389.1374 611.4951 L
1389.1374 592.5975 L
1370.2397 573.6998 L
1389.1374 554.8022 L
1389.1374 535.9045 L
1370.2397 517.0069 L
1389.1374 535.9045 L
1408.0350 535.9045 L
1426.9327 517.0069 L
1445.8303 498.1093 L
1445.8303 479.2116 L
1426.9327 460.3140 L
1408.0350 441.4163 L
1389.1374 441.4163 L
1370.2397 460.3140 L
1351.3421 441.4163 L
1332.4445 441.4163 L
1313.5468 460.3140 L
1294.6492 479.2116 L
1294.6492 498.1093 L
1313.5468 517.0069 L
1294.6492 535.9045 L
1294.6492 554.8022 L
1313.5468 573.6998 L
1294.6492 592.5975 L
1294.6492 611.4951 L
1313.5468 630.3927 L
1294.6492 649.2904 L
1294.6492 668.1880 L
1313.5468 687.0856 L
1294.6492 705.9833 L
1294.6492 724.8809 L
1313.5468 743.7786 L
1294.6492 762.6762 L
1294.6492 781.5738 L
1313.5468 800.4715 L
1370.2397 800.4715 L
1351.3421 819.3691 L
1351.3421 838.2667 L
1370.2397 857.1644 L
1351.3421 876.0620 L
1351.3421 894.9597 L
1370.2397 913.8573 L
1313.5468 913.8573 L
1294.6492 932.7549 L
1294.6492 951.6526 L
1313.5468 970.5502 L
1294.6492 989.4478 L
1294.6492 1008.3455 L
1313.5468 1027.2431 L
1294.6492 1046.1408 L
1294.6492 1065.0384 L
1313.5468 1083.9360 L
1294.6492 1102.8337 L
1294.6492 1121.7313 L
1313.5468 1140.6289 L
1332.4445 1159.5266 L
1351.3421 1159.5266 L
1370.2397 1140.6289 L
1351.3421 1159.5266 L
1351.3421 1178.4242 L
1370.2397 1197.3219 L
1351.3421 1216.2195 L
1351.3421 1235.1171 L
1370.2397 1254.0148 L
1351.3421 1272.9124 L
1351.3421 1291.8100 L
1370.2397 1310.7077 L
S
0.0000 1.0000 0.2902 XA
0.0000 1.0000 0.2902 Xa
0 i 1 J 1 j 1.0000 w 4 M []0 d
0 D
1143.4681 1367.4006 m
1124.5705 1348.5030 L
1105.6728 1348.5030 L
1086.7752 1367.4006 L
1067.8775 1348.5030 L
1048.9799 1348.5030 L
1030.0823 1367.4006 L
1011.1846 1386.2982 L
1011.1846 1405.1959 L
1030.0823 1424.0935 L
1048.9799 1442.9912 L
1067.8775 1442.9912 L
1086.7752 1424.0935 L
1105.6728 1442.9912 L
1124.5705 1442.9912 L
1143.4681 1424.0935 L
1162.3657 1442.9912 L
1181.2634 1442.9912 L
1200.1610 1424.0935 L
1219.0586 1442.9912 L
1237.9563 1442.9912 L
1256.8539 1424.0935 L
1256.8539 1367.4006 L
1275.7516 1386.2982 L
1294.6492 1386.2982 L
1313.5468 1367.4006 L
1313.5468 1424.0935 L
1332.4445 1442.9912 L
1351.3421 1442.9912 L
1370.2397 1424.0935 L
1389.1374 1442.9912 L
1408.0350 1442.9912 L
1426.9327 1424.0935 L
1445.8303 1405.1959 L
1408.0350 1442.9912 L
S
0.0000 1.0000 0.2902 XA
0.0000 1.0000 0.2902 Xa
0 i 1 J 1 j 1.0000 w 4 M []0 d
0 D
1200.1610 1367.4006 m
1143.4681 1367.4006 L
1124.5705 1348.5030 L
1124.5705 1329.6053 L
1143.4681 1310.7077 L
1162.3657 1291.8100 L
1181.2634 1291.8100 L
1200.1610 1310.7077 L
1219.0586 1291.8100 L
1237.9563 1291.8100 L
1256.8539 1310.7077 L
1275.7516 1291.8100 L
1294.6492 1291.8100 L
1313.5468 1310.7077 L
1332.4445 1291.8100 L
1351.3421 1291.8100 L
1370.2397 1310.7077 L
1370.2397 1367.4006 L
S
0.0000 1.0000 0.2902 XA
0.0000 1.0000 0.2902 Xa
0 i 1 J 1 j 1.0000 w 4 M []0 d
0 D
869.2913 53.8583 m
869.2913 72.7559 L
888.1890 91.6535 L
869.2913 110.5512 L
869.2913 129.4488 L
888.1890 148.3465 L
869.2913 167.2441 L
869.2913 186.1417 L
888.1890 205.0394 L
869.2913 223.9370 L
869.2913 242.8346 L
888.1890 261.7323 L
869.2913 280.6299 L
869.2913 299.5276 L
888.1890 318.4252 L
869.2913 337.3228 L
869.2913 356.2205 L
888.1890 375.1181 L
944.8819 375.1181 L
925.9843 394.0157 L
925.9843 412.9134 L
944.8819 431.8110 L
925.9843 450.7087 L
925.9843 469.6063 L
944.8819 488.5039 L
888.1890 488.5039 L
869.2913 507.4016 L
869.2913 526.2992 L
888.1890 545.1969 L
869.2913 564.0945 L
869.2913 582.9921 L
888.1890 601.8898 L
869.2913 620.7874 L
869.2913 639.6850 L
888.1890 658.5827 L
869.2913 677.4803 L
869.2913 696.3780 L
888.1890 715.2756 L
907.0866 734.1732 L
925.9843 734.1732 L
944.8819 715.2756 L
925.9843 734.1732 L
925.9843 753.0709 L
944.8819 771.9685 L
925.9843 790.8661 L
925.9843 809.7638 L
944.8819 828.6614 L
925.9843 847.5591 L
925.9843 866.4567 L
944.8819 885.3543 L
925.9843 904.2520 L
925.9843 923.1496 L
944.8819 942.0472 L
925.9843 923.1496 L
907.0866 923.1496 L
888.1890 942.0472 L
869.2913 960.9449 L
869.2913 979.8425 L
888.1890 998.7402 L
907.0866 1017.6378 L
925.9843 1017.6378 L
944.8819 998.7402 L
963.7795 1017.6378 L
982.6772 1017.6378 L
1001.5748 998.7402 L
1020.4724 979.8425 L
1020.4724 960.9449 L
1001.5748 942.0472 L
1020.4724 923.1496 L
1020.4724 904.2520 L
1001.5748 885.3543 L
1020.4724 866.4567 L
1020.4724 847.5591 L
1001.5748 828.6614 L
1020.4724 809.7638 L
1020.4724 790.8661 L
1001.5748 771.9685 L
1020.4724 753.0709 L
1020.4724 734.1732 L
1001.5748 715.2756 L
1020.4724 696.3780 L
1020.4724 677.4803 L
1001.5748 658.5827 L
944.8819 658.5827 L
963.7795 639.6850 L
963.7795 620.7874 L
944.8819 601.8898 L
963.7795 582.9921 L
963.7795 564.0945 L
944.8819 545.1969 L
1001.5748 545.1969 L
1020.4724 526.2992 L
1020.4724 507.4016 L
1001.5748 488.5039 L
1020.4724 469.6063 L
1020.4724 450.7087 L
1001.5748 431.8110 L
1020.4724 412.9134 L
1020.4724 394.0157 L
1001.5748 375.1181 L
1020.4724 356.2205 L
1020.4724 337.3228 L
1001.5748 318.4252 L
982.6772 299.5276 L
963.7795 299.5276 L
944.8819 318.4252 L
963.7795 299.5276 L
963.7795 280.6299 L
944.8819 261.7323 L
963.7795 242.8346 L
963.7795 223.9370 L
944.8819 205.0394 L
963.7795 186.1417 L
963.7795 167.2441 L
944.8819 148.3465 L
S
0.0000 1.0000 0.2902 XA
0.0000 1.0000 0.2902 Xa
0 i 1 J 1 j 1.0000 w 4 M []0 d
0 D
1171.6535 91.6535 m
1190.5512 110.5512 L
1209.4488 110.5512 L
1228.3465 91.6535 L
1247.2441 110.5512 L
1266.1417 110.5512 L
1285.0394 91.6535 L
1303.9370 72.7559 L
1303.9370 53.8583 L
1285.0394 34.9606 L
1266.1417 16.0630 L
1247.2441 16.0630 L
1228.3465 34.9606 L
1209.4488 16.0630 L
1190.5512 16.0630 L
1171.6535 34.9606 L
1152.7559 16.0630 L
1133.8583 16.0630 L
1114.9606 34.9606 L
1096.0630 16.0630 L
1077.1654 16.0630 L
1058.2677 34.9606 L
1058.2677 91.6535 L
1039.3701 72.7559 L
1020.4724 72.7559 L
1001.5748 91.6535 L
1001.5748 34.9606 L
982.6772 16.0630 L
963.7795 16.0630 L
944.8819 34.9606 L
925.9843 16.0630 L
907.0866 16.0630 L
888.1890 34.9606 L
869.2913 53.8583 L
907.0866 16.0630 L
S
0.0000 1.0000 0.2902 XA
0.0000 1.0000 0.2902 Xa
0 i 1 J 1 j 1.0000 w 4 M []0 d
0 D
1114.9606 91.6535 m
1171.6535 91.6535 L
1190.5512 110.5512 L
1190.5512 129.4488 L
1171.6535 148.3465 L
1152.7559 167.2441 L
1133.8583 167.2441 L
1114.9606 148.3465 L
1096.0630 167.2441 L
1077.1654 167.2441 L
1058.2677 148.3465 L
1039.3701 167.2441 L
1020.4724 167.2441 L
1001.5748 148.3465 L
982.6772 167.2441 L
963.7795 167.2441 L
944.8819 148.3465 L
944.8819 91.6535 L
S
0.0000 1.0000 0.2902 XA
0.0000 1.0000 0.2902 Xa
0 i 1 J 1 j 1.0000 w 4 M []0 d
0 D
576.3590 1121.5558 m
576.3590 1102.6582 L
595.2566 1083.7606 L
576.3590 1064.8629 L
576.3590 1045.9653 L
595.2566 1027.0677 L
576.3590 1008.1700 L
576.3590 989.2724 L
595.2566 970.3747 L
576.3590 951.4771 L
576.3590 932.5795 L
595.2566 913.6818 L
576.3590 894.7842 L
576.3590 875.8865 L
595.2566 856.9889 L
576.3590 838.0913 L
576.3590 819.1936 L
595.2566 800.2960 L
651.9495 800.2960 L
633.0519 781.3984 L
633.0519 762.5007 L
651.9495 743.6031 L
633.0519 724.7054 L
633.0519 705.8078 L
651.9495 686.9102 L
595.2566 686.9102 L
576.3590 668.0125 L
576.3590 649.1149 L
595.2566 630.2173 L
576.3590 611.3196 L
576.3590 592.4220 L
595.2566 573.5243 L
576.3590 554.6267 L
576.3590 535.7291 L
595.2566 516.8314 L
576.3590 497.9338 L
576.3590 479.0362 L
595.2566 460.1385 L
614.1543 441.2409 L
633.0519 441.2409 L
651.9495 460.1385 L
633.0519 441.2409 L
633.0519 422.3432 L
651.9495 403.4456 L
633.0519 384.5480 L
633.0519 365.6503 L
651.9495 346.7527 L
633.0519 327.8551 L
633.0519 308.9574 L
651.9495 290.0598 L
633.0519 271.1621 L
633.0519 252.2645 L
651.9495 233.3669 L
633.0519 252.2645 L
614.1543 252.2645 L
595.2566 233.3669 L
576.3590 214.4692 L
576.3590 195.5716 L
595.2566 176.6740 L
614.1543 157.7763 L
633.0519 157.7763 L
651.9495 176.6740 L
670.8472 157.7763 L
689.7448 157.7763 L
708.6425 176.6740 L
727.5401 195.5716 L
727.5401 214.4692 L
708.6425 233.3669 L
727.5401 252.2645 L
727.5401 271.1621 L
708.6425 290.0598 L
727.5401 308.9574 L
727.5401 327.8551 L
708.6425 346.7527 L
727.5401 365.6503 L
727.5401 384.5480 L
708.6425 403.4456 L
727.5401 422.3432 L
727.5401 441.2409 L
708.6425 460.1385 L
727.5401 479.0362 L
727.5401 497.9338 L
708.6425 516.8314 L
651.9495 516.8314 L
670.8472 535.7291 L
670.8472 554.6267 L
651.9495 573.5243 L
670.8472 592.4220 L
670.8472 611.3196 L
651.9495 630.2173 L
708.6425 630.2173 L
727.5401 649.1149 L
727.5401 668.0125 L
708.6425 686.9102 L
727.5401 705.8078 L
727.5401 724.7054 L
708.6425 743.6031 L
727.5401 762.5007 L
727.5401 781.3984 L
708.6425 800.2960 L
727.5401 819.1936 L
727.5401 838.0913 L
708.6425 856.9889 L
689.7448 875.8865 L
670.8472 875.8865 L
651.9495 856.9889 L
670.8472 875.8865 L
670.8472 894.7842 L
651.9495 913.6818 L
670.8472 932.5795 L
670.8472 951.4771 L
651.9495 970.3747 L
670.8472 989.2724 L
670.8472 1008.1700 L
651.9495 1027.0677 L
S
0.0000 1.0000 0.2902 XA
0.0000 1.0000 0.2902 Xa
0 i 1 J 1 j 1.0000 w 4 M []0 d
0 D
878.7212 1083.7606 m
897.6188 1064.8629 L
916.5165 1064.8629 L
935.4141 1083.7606 L
954.3117 1064.8629 L
973.2094 1064.8629 L
992.1070 1083.7606 L
1011.0047 1102.6582 L
1011.0047 1121.5558 L
992.1070 1140.4535 L
973.2094 1159.3511 L
954.3117 1159.3511 L
935.4141 1140.4535 L
916.5165 1159.3511 L
897.6188 1159.3511 L
878.7212 1140.4535 L
859.8236 1159.3511 L
840.9259 1159.3511 L
822.0283 1140.4535 L
803.1306 1159.3511 L
784.2330 1159.3511 L
765.3354 1140.4535 L
765.3354 1083.7606 L
746.4377 1102.6582 L
727.5401 1102.6582 L
708.6425 1083.7606 L
708.6425 1140.4535 L
689.7448 1159.3511 L
670.8472 1159.3511 L
651.9495 1140.4535 L
633.0519 1159.3511 L
614.1543 1159.3511 L
595.2566 1140.4535 L
576.3590 1121.5558 L
614.1543 1159.3511 L
S
0.0000 1.0000 0.2902 XA
0.0000 1.0000 0.2902 Xa
0 i 1 J 1 j 1.0000 w 4 M []0 d
0 D
822.0283 1083.7606 m
878.7212 1083.7606 L
897.6188 1064.8629 L
897.6188 1045.9653 L
878.7212 1027.0677 L
859.8236 1008.1700 L
840.9259 1008.1700 L
822.0283 1027.0677 L
803.1306 1008.1700 L
784.2330 1008.1700 L
765.3354 1027.0677 L
746.4377 1008.1700 L
727.5401 1008.1700 L
708.6425 1027.0677 L
689.7448 1008.1700 L
670.8472 1008.1700 L
651.9495 1027.0677 L
651.9495 1083.7606 L
S
0.0000 1.0000 0.2902 XA
0.0000 1.0000 0.2902 Xa
0 i 1 J 1 j 1.0000 w 4 M []0 d
0 D
869.2913 53.8583 m
869.2913 72.7559 L
850.3937 91.6535 L
869.2913 110.5512 L
869.2913 129.4488 L
850.3937 148.3465 L
869.2913 167.2441 L
869.2913 186.1417 L
850.3937 205.0394 L
869.2913 223.9370 L
869.2913 242.8346 L
850.3937 261.7323 L
869.2913 280.6299 L
869.2913 299.5276 L
850.3937 318.4252 L
869.2913 337.3228 L
869.2913 356.2205 L
850.3937 375.1181 L
793.7008 375.1181 L
812.5984 394.0157 L
812.5984 412.9134 L
793.7008 431.8110 L
812.5984 450.7087 L
812.5984 469.6063 L
793.7008 488.5039 L
850.3937 488.5039 L
869.2913 507.4016 L
869.2913 526.2992 L
850.3937 545.1969 L
869.2913 564.0945 L
869.2913 582.9921 L
850.3937 601.8898 L
869.2913 620.7874 L
869.2913 639.6850 L
850.3937 658.5827 L
869.2913 677.4803 L
869.2913 696.3780 L
850.3937 715.2756 L
831.4961 734.1732 L
812.5984 734.1732 L
793.7008 715.2756 L
812.5984 734.1732 L
812.5984 753.0709 L
793.7008 771.9685 L
812.5984 790.8661 L
812.5984 809.7638 L
793.7008 828.6614 L
812.5984 847.5591 L
812.5984 866.4567 L
793.7008 885.3543 L
812.5984 904.2520 L
812.5984 923.1496 L
793.7008 942.0472 L
812.5984 923.1496 L
831.4961 923.1496 L
850.3937 942.0472 L
869.2913 960.9449 L
869.2913 979.8425 L
850.3937 998.7402 L
831.4961 1017.6378 L
812.5984 1017.6378 L
793.7008 998.7402 L
774.8031 1017.6378 L
755.9055 1017.6378 L
737.0079 998.7402 L
718.1102 979.8425 L
718.1102 960.9449 L
737.0079 942.0472 L
718.1102 923.1496 L
718.1102 904.2520 L
737.0079 885.3543 L
718.1102 866.4567 L
718.1102 847.5591 L
737.0079 828.6614 L
718.1102 809.7638 L
718.1102 790.8661 L
737.0079 771.9685 L
718.1102 753.0709 L
718.1102 734.1732 L
737.0079 715.2756 L
718.1102 696.3780 L
718.1102 677.4803 L
737.0079 658.5827 L
793.7008 658.5827 L
774.8031 639.6850 L
774.8031 620.7874 L
793.7008 601.8898 L
774.8031 582.9921 L
774.8031 564.0945 L
793.7008 545.1969 L
737.0079 545.1969 L
718.1102 526.2992 L
718.1102 507.4016 L
737.0079 488.5039 L
718.1102 469.6063 L
718.1102 450.7087 L
737.0079 431.8110 L
718.1102 412.9134 L
718.1102 394.0157 L
737.0079 375.1181 L
718.1102 356.2205 L
718.1102 337.3228 L
737.0079 318.4252 L
755.9055 299.5276 L
774.8031 299.5276 L
793.7008 318.4252 L
774.8031 299.5276 L
774.8031 280.6299 L
793.7008 261.7323 L
774.8031 242.8346 L
774.8031 223.9370 L
793.7008 205.0394 L
774.8031 186.1417 L
774.8031 167.2441 L
793.7008 148.3465 L
S
0.0000 1.0000 0.2902 XA
0.0000 1.0000 0.2902 Xa
0 i 1 J 1 j 1.0000 w 4 M []0 d
0 D
566.9291 91.6535 m
548.0315 110.5512 L
529.1339 110.5512 L
510.2362 91.6535 L
491.3386 110.5512 L
472.4409 110.5512 L
453.5433 91.6535 L
434.6457 72.7559 L
434.6457 53.8583 L
453.5433 34.9606 L
472.4409 16.0630 L
491.3386 16.0630 L
510.2362 34.9606 L
529.1339 16.0630 L
548.0315 16.0630 L
566.9291 34.9606 L
585.8268 16.0630 L
604.7244 16.0630 L
623.6220 34.9606 L
642.5197 16.0630 L
661.4173 16.0630 L
680.3150 34.9606 L
680.3150 91.6535 L
699.2126 72.7559 L
718.1102 72.7559 L
737.0079 91.6535 L
737.0079 34.9606 L
755.9055 16.0630 L
774.8031 16.0630 L
793.7008 34.9606 L
812.5984 16.0630 L
831.4961 16.0630 L
850.3937 34.9606 L
869.2913 53.8583 L
831.4961 16.0630 L
S
0.0000 1.0000 0.2902 XA
0.0000 1.0000 0.2902 Xa
0 i 1 J 1 j 1.0000 w 4 M []0 d
0 D
623.6220 91.6535 m
566.9291 91.6535 L
548.0315 110.5512 L
548.0315 129.4488 L
566.9291 148.3465 L
585.8268 167.2441 L
604.7244 167.2441 L
623.6220 148.3465 L
642.5197 167.2441 L
661.4173 167.2441 L
680.3150 148.3465 L
699.2126 167.2441 L
718.1102 167.2441 L
737.0079 148.3465 L
755.9055 167.2441 L
774.8031 167.2441 L
793.7008 148.3465 L
793.7008 91.6535 L
S
0.0000 1.0000 0.2902 XA
0.0000 1.0000 0.2902 Xa
0 i 1 J 1 j 1.0000 w 4 M []0 d
0 D
387.4810 233.4652 m
444.1739 233.4652 L
463.0715 252.3628 L
463.0715 271.2605 L
444.1739 290.1581 L
425.2762 309.0558 L
406.3786 309.0558 L
387.4810 290.1581 L
368.5833 309.0558 L
349.6857 309.0558 L
330.7880 290.1581 L
311.8904 309.0558 L
292.9928 309.0558 L
274.0951 290.1581 L
255.1975 309.0558 L
236.2998 309.0558 L
217.4022 290.1581 L
217.4022 233.4652 L
S
0.0000 1.0000 0.2902 XA
0.0000 1.0000 0.2902 Xa
0 i 1 J 1 j 1.0000 w 4 M []0 d
0 D
444.1739 233.4652 m
463.0715 252.3628 L
481.9691 252.3628 L
500.8668 233.4652 L
519.7644 252.3628 L
538.6621 252.3628 L
557.5597 233.4652 L
576.4573 214.5676 L
576.4573 195.6699 L
557.5597 176.7723 L
538.6621 157.8747 L
519.7644 157.8747 L
500.8668 176.7723 L
481.9691 157.8747 L
463.0715 157.8747 L
444.1739 176.7723 L
425.2762 157.8747 L
406.3786 157.8747 L
387.4810 176.7723 L
368.5833 157.8747 L
349.6857 157.8747 L
330.7880 176.7723 L
330.7880 233.4652 L
311.8904 214.5676 L
292.9928 214.5676 L
274.0951 233.4652 L
274.0951 176.7723 L
255.1975 157.8747 L
236.2998 157.8747 L
217.4022 176.7723 L
198.5046 157.8747 L
179.6069 157.8747 L
160.7093 176.7723 L
141.8117 195.6699 L
179.6069 157.8747 L
S
0.0000 1.0000 0.2902 XA
0.0000 1.0000 0.2902 Xa
0 i 1 J 1 j 1.0000 w 4 M []0 d
0 D
141.8117 195.6699 m
141.8117 214.5676 L
160.7093 233.4652 L
141.8117 252.3628 L
141.8117 271.2605 L
160.7093 290.1581 L
141.8117 309.0558 L
141.8117 327.9534 L
160.7093 346.8510 L
141.8117 365.7487 L
141.8117 384.6463 L
160.7093 403.5439 L
141.8117 422.4416 L
141.8117 441.3392 L
160.7093 460.2369 L
141.8117 479.1345 L
141.8117 498.0321 L
160.7093 516.9298 L
217.4022 516.9298 L
198.5046 535.8274 L
198.5046 554.7250 L
217.4022 573.6227 L
198.5046 592.5203 L
198.5046 611.4180 L
217.4022 630.3156 L
160.7093 630.3156 L
141.8117 649.2132 L
141.8117 668.1109 L
160.7093 687.0085 L
141.8117 705.9061 L
141.8117 724.8038 L
160.7093 743.7014 L
141.8117 762.5991 L
141.8117 781.4967 L
160.7093 800.3943 L
141.8117 819.2920 L
141.8117 838.1896 L
160.7093 857.0873 L
179.6069 875.9849 L
198.5046 875.9849 L
217.4022 857.0873 L
198.5046 875.9849 L
198.5046 894.8825 L
217.4022 913.7802 L
198.5046 932.6778 L
198.5046 951.5754 L
217.4022 970.4731 L
198.5046 989.3707 L
198.5046 1008.2684 L
217.4022 1027.1660 L
198.5046 1046.0636 L
198.5046 1064.9613 L
217.4022 1083.8589 L
198.5046 1064.9613 L
179.6069 1064.9613 L
160.7093 1083.8589 L
141.8117 1102.7565 L
141.8117 1121.6542 L
160.7093 1140.5518 L
179.6069 1159.4495 L
198.5046 1159.4495 L
217.4022 1140.5518 L
236.2998 1159.4495 L
255.1975 1159.4495 L
274.0951 1140.5518 L
292.9928 1121.6542 L
292.9928 1102.7565 L
274.0951 1083.8589 L
292.9928 1064.9613 L
292.9928 1046.0636 L
274.0951 1027.1660 L
292.9928 1008.2684 L
292.9928 989.3707 L
274.0951 970.4731 L
292.9928 951.5754 L
292.9928 932.6778 L
274.0951 913.7802 L
292.9928 894.8825 L
292.9928 875.9849 L
274.0951 857.0873 L
292.9928 838.1896 L
292.9928 819.2920 L
274.0951 800.3943 L
217.4022 800.3943 L
236.2998 781.4967 L
236.2998 762.5991 L
217.4022 743.7014 L
236.2998 724.8038 L
236.2998 705.9061 L
217.4022 687.0085 L
274.0951 687.0085 L
292.9928 668.1109 L
292.9928 649.2132 L
274.0951 630.3156 L
292.9928 611.4180 L
292.9928 592.5203 L
274.0951 573.6227 L
292.9928 554.7250 L
292.9928 535.8274 L
274.0951 516.9298 L
292.9928 498.0321 L
292.9928 479.1345 L
274.0951 460.2369 L
255.1975 441.3392 L
236.2998 441.3392 L
217.4022 460.2369 L
236.2998 441.3392 L
236.2998 422.4416 L
217.4022 403.5439 L
236.2998 384.6463 L
236.2998 365.7487 L
217.4022 346.8510 L
236.2998 327.9534 L
236.2998 309.0558 L
217.4022 290.1581 L
S
0.0000 1.0000 0.2902 XA
0.0000 1.0000 0.2902 Xa
0 i 1 J 1 j 1.0000 w 4 M []0 d
0 D
189.0580 1225.5889 m
132.3651 1225.5889 L
113.4675 1206.6913 L
113.4675 1187.7937 L
132.3651 1168.8960 L
151.2627 1149.9984 L
170.1604 1149.9984 L
189.0580 1168.8960 L
207.9556 1149.9984 L
226.8533 1149.9984 L
245.7509 1168.8960 L
264.6486 1149.9984 L
283.5462 1149.9984 L
302.4438 1168.8960 L
321.3415 1149.9984 L
340.2391 1149.9984 L
359.1367 1168.8960 L
359.1367 1225.5889 L
S
0.0000 1.0000 0.2902 XA
0.0000 1.0000 0.2902 Xa
0 i 1 J 1 j 1.0000 w 4 M []0 d
0 D
132.3651 1225.5889 m
113.4675 1206.6913 L
94.5698 1206.6913 L
75.6722 1225.5889 L
56.7745 1206.6913 L
37.8769 1206.6913 L
18.9793 1225.5889 L
0.0816 1244.4866 L
0.0816 1263.3842 L
18.9793 1282.2819 L
37.8769 1301.1795 L
56.7745 1301.1795 L
75.6722 1282.2819 L
94.5698 1301.1795 L
113.4675 1301.1795 L
132.3651 1282.2819 L
151.2627 1301.1795 L
170.1604 1301.1795 L
189.0580 1282.2819 L
207.9556 1301.1795 L
226.8533 1301.1795 L
245.7509 1282.2819 L
245.7509 1225.5889 L
264.6486 1244.4866 L
283.5462 1244.4866 L
302.4438 1225.5889 L
302.4438 1282.2819 L
321.3415 1301.1795 L
340.2391 1301.1795 L
359.1367 1282.2819 L
378.0344 1301.1795 L
396.9320 1301.1795 L
415.8297 1282.2819 L
434.7273 1263.3842 L
396.9320 1301.1795 L
S
0.0000 1.0000 0.2902 XA
0.0000 1.0000 0.2902 Xa
0 i 1 J 1 j 1.0000 w 4 M []0 d
0 D
434.7273 1263.3842 m
434.7273 1244.4866 L
415.8297 1225.5889 L
434.7273 1206.6913 L
434.7273 1187.7937 L
415.8297 1168.8960 L
434.7273 1149.9984 L
434.7273 1131.1008 L
415.8297 1112.2031 L
434.7273 1093.3055 L
434.7273 1074.4078 L
415.8297 1055.5102 L
434.7273 1036.6126 L
434.7273 1017.7149 L
415.8297 998.8173 L
434.7273 979.9196 L
434.7273 961.0220 L
415.8297 942.1244 L
359.1367 942.1244 L
378.0344 923.2267 L
378.0344 904.3291 L
359.1367 885.4315 L
378.0344 866.5338 L
378.0344 847.6362 L
359.1367 828.7385 L
415.8297 828.7385 L
434.7273 809.8409 L
434.7273 790.9433 L
415.8297 772.0456 L
434.7273 753.1480 L
434.7273 734.2504 L
415.8297 715.3527 L
434.7273 696.4551 L
434.7273 677.5574 L
415.8297 658.6598 L
434.7273 639.7622 L
434.7273 620.8645 L
415.8297 601.9669 L
396.9320 583.0693 L
378.0344 583.0693 L
359.1367 601.9669 L
378.0344 583.0693 L
378.0344 564.1716 L
359.1367 545.2740 L
378.0344 526.3763 L
378.0344 507.4787 L
359.1367 488.5811 L
378.0344 469.6834 L
378.0344 450.7858 L
359.1367 431.8882 L
378.0344 412.9905 L
378.0344 394.0929 L
359.1367 375.1952 L
378.0344 394.0929 L
396.9320 394.0929 L
415.8297 375.1952 L
434.7273 356.2976 L
434.7273 337.4000 L
415.8297 318.5023 L
396.9320 299.6047 L
378.0344 299.6047 L
359.1367 318.5023 L
340.2391 299.6047 L
321.3415 299.6047 L
302.4438 318.5023 L
283.5462 337.4000 L
283.5462 356.2976 L
302.4438 375.1952 L
283.5462 394.0929 L
283.5462 412.9905 L
302.4438 431.8882 L
283.5462 450.7858 L
283.5462 469.6834 L
302.4438 488.5811 L
283.5462 507.4787 L
283.5462 526.3763 L
302.4438 545.2740 L
283.5462 564.1716 L
283.5462 583.0693 L
302.4438 601.9669 L
283.5462 620.8645 L
283.5462 639.7622 L
302.4438 658.6598 L
359.1367 658.6598 L
340.2391 677.5574 L
340.2391 696.4551 L
359.1367 715.3527 L
340.2391 734.2504 L
340.2391 753.1480 L
359.1367 772.0456 L
302.4438 772.0456 L
283.5462 790.9433 L
283.5462 809.8409 L
302.4438 828.7385 L
283.5462 847.6362 L
283.5462 866.5338 L
302.4438 885.4315 L
283.5462 904.3291 L
283.5462 923.2267 L
302.4438 942.1244 L
283.5462 961.0220 L
283.5462 979.9196 L
302.4438 998.8173 L
321.3415 1017.7149 L
340.2391 1017.7149 L
359.1367 998.8173 L
340.2391 1017.7149 L
340.2391 1036.6126 L
359.1367 1055.5102 L
340.2391 1074.4078 L
340.2391 1093.3055 L
359.1367 1112.2031 L
340.2391 1131.1008 L
340.2391 1149.9984 L
359.1367 1168.8960 L
S
0.0000 1.0000 0.2902 XA
0.0000 1.0000 0.2902 Xa
0 i 1 J 1 j 1.0000 w 4 M []0 d
0 D
576.5390 1405.1959 m
576.5390 1386.2982 L
557.6413 1367.4006 L
576.5390 1348.5030 L
576.5390 1329.6053 L
557.6413 1310.7077 L
576.5390 1291.8100 L
576.5390 1272.9124 L
557.6413 1254.0148 L
576.5390 1235.1171 L
576.5390 1216.2195 L
557.6413 1197.3219 L
576.5390 1178.4242 L
576.5390 1159.5266 L
557.6413 1140.6289 L
576.5390 1121.7313 L
576.5390 1102.8337 L
557.6413 1083.9360 L
500.9484 1083.9360 L
519.8460 1065.0384 L
519.8460 1046.1408 L
500.9484 1027.2431 L
519.8460 1008.3455 L
519.8460 989.4478 L
500.9484 970.5502 L
557.6413 970.5502 L
576.5390 951.6526 L
576.5390 932.7549 L
557.6413 913.8573 L
576.5390 894.9597 L
576.5390 876.0620 L
557.6413 857.1644 L
576.5390 838.2667 L
576.5390 819.3691 L
557.6413 800.4715 L
576.5390 781.5738 L
576.5390 762.6762 L
557.6413 743.7786 L
538.7437 724.8809 L
519.8460 724.8809 L
500.9484 743.7786 L
519.8460 724.8809 L
519.8460 705.9833 L
500.9484 687.0856 L
519.8460 668.1880 L
519.8460 649.2904 L
500.9484 630.3927 L
519.8460 611.4951 L
519.8460 592.5975 L
500.9484 573.6998 L
519.8460 554.8022 L
519.8460 535.9045 L
500.9484 517.0069 L
519.8460 535.9045 L
538.7437 535.9045 L
557.6413 517.0069 L
576.5390 498.1093 L
576.5390 479.2116 L
557.6413 460.3140 L
538.7437 441.4163 L
519.8460 441.4163 L
500.9484 460.3140 L
482.0508 441.4163 L
463.1531 441.4163 L
444.2555 460.3140 L
425.3579 479.2116 L
425.3579 498.1093 L
444.2555 517.0069 L
425.3579 535.9045 L
425.3579 554.8022 L
444.2555 573.6998 L
425.3579 592.5975 L
425.3579 611.4951 L
444.2555 630.3927 L
425.3579 649.2904 L
425.3579 668.1880 L
444.2555 687.0856 L
425.3579 705.9833 L
425.3579 724.8809 L
444.2555 743.7786 L
425.3579 762.6762 L
425.3579 781.5738 L
444.2555 800.4715 L
500.9484 800.4715 L
482.0508 819.3691 L
482.0508 838.2667 L
500.9484 857.1644 L
482.0508 876.0620 L
482.0508 894.9597 L
500.9484 913.8573 L
444.2555 913.8573 L
425.3579 932.7549 L
425.3579 951.6526 L
444.2555 970.5502 L
425.3579 989.4478 L
425.3579 1008.3455 L
444.2555 1027.2431 L
425.3579 1046.1408 L
425.3579 1065.0384 L
444.2555 1083.9360 L
425.3579 1102.8337 L
425.3579 1121.7313 L
444.2555 1140.6289 L
463.1531 1159.5266 L
482.0508 1159.5266 L
500.9484 1140.6289 L
482.0508 1159.5266 L
482.0508 1178.4242 L
500.9484 1197.3219 L
482.0508 1216.2195 L
482.0508 1235.1171 L
500.9484 1254.0148 L
482.0508 1272.9124 L
482.0508 1291.8100 L
500.9484 1310.7077 L
S
0.0000 1.0000 0.2902 XA
0.0000 1.0000 0.2902 Xa
0 i 1 J 1 j 1.0000 w 4 M []0 d
0 D
274.1768 1367.4006 m
255.2791 1348.5030 L
236.3815 1348.5030 L
217.4838 1367.4006 L
198.5862 1348.5030 L
179.6886 1348.5030 L
160.7909 1367.4006 L
141.8933 1386.2982 L
141.8933 1405.1959 L
160.7909 1424.0935 L
179.6886 1442.9912 L
198.5862 1442.9912 L
217.4838 1424.0935 L
236.3815 1442.9912 L
255.2791 1442.9912 L
274.1768 1424.0935 L
293.0744 1442.9912 L
311.9720 1442.9912 L
330.8697 1424.0935 L
349.7673 1442.9912 L
368.6649 1442.9912 L
387.5626 1424.0935 L
387.5626 1367.4006 L
406.4602 1386.2982 L
425.3579 1386.2982 L
444.2555 1367.4006 L
444.2555 1424.0935 L
463.1531 1442.9912 L
482.0508 1442.9912 L
500.9484 1424.0935 L
519.8460 1442.9912 L
538.7437 1442.9912 L
557.6413 1424.0935 L
576.5390 1405.1959 L
538.7437 1442.9912 L
S
0.0000 1.0000 0.2902 XA
0.0000 1.0000 0.2902 Xa
0 i 1 J 1 j 1.0000 w 4 M []0 d
0 D
330.8697 1367.4006 m
274.1768 1367.4006 L
255.2791 1348.5030 L
255.2791 1329.6053 L
274.1768 1310.7077 L
293.0744 1291.8100 L
311.9720 1291.8100 L
330.8697 1310.7077 L
349.7673 1291.8100 L
368.6649 1291.8100 L
387.5626 1310.7077 L
406.4602 1291.8100 L
425.3579 1291.8100 L
444.2555 1310.7077 L
463.1531 1291.8100 L
482.0508 1291.8100 L
500.9484 1310.7077 L
500.9484 1367.4006 L
S
0.0000 1.0000 0.2902 XA
0.0000 1.0000 0.2902 Xa
0 i 1 J 1 j 1.0000 w 4 M []0 d
0 D
302.3622 91.6535 m
321.2598 110.5512 L
340.1575 110.5512 L
359.0551 91.6535 L
377.9528 110.5512 L
396.8504 110.5512 L
415.7480 91.6535 L
434.6457 72.7559 L
434.6457 53.8583 L
415.7480 34.9606 L
396.8504 16.0630 L
377.9528 16.0630 L
359.0551 34.9606 L
340.1575 16.0630 L
321.2598 16.0630 L
302.3622 34.9606 L
283.4646 16.0630 L
264.5669 16.0630 L
245.6693 34.9606 L
226.7717 16.0630 L
207.8740 16.0630 L
188.9764 34.9606 L
188.9764 91.6535 L
170.0787 72.7559 L
151.1811 72.7559 L
132.2835 91.6535 L
132.2835 34.9606 L
113.3858 16.0630 L
94.4882 16.0630 L
75.5906 34.9606 L
56.6929 16.0630 L
37.7953 16.0630 L
18.8976 34.9606 L
0.0000 53.8583 L
37.7953 16.0630 L
S
0.0000 1.0000 0.2902 XA
0.0000 1.0000 0.2902 Xa
0 i 1 J 1 j 1.0000 w 4 M []0 d
0 D
245.6693 91.6535 m
302.3622 91.6535 L
321.2598 110.5512 L
321.2598 129.4488 L
302.3622 148.3465 L
283.4646 167.2441 L
264.5669 167.2441 L
245.6693 148.3465 L
226.7717 167.2441 L
207.8740 167.2441 L
188.9764 148.3465 L
170.0787 167.2441 L
151.1811 167.2441 L
132.2835 148.3465 L
113.3858 167.2441 L
94.4882 167.2441 L
75.5906 148.3465 L
75.5906 91.6535 L
S
LB
%AI5_EndLayer--
%%PageTrailer
gsave annotatepage grestore showpage
%%Trailer
Adobe_IllustratorA_AI3 /terminate get exec
Adobe_typography_AI3 /terminate get exec
Adobe_customcolor /terminate get exec
Adobe_cshow /terminate get exec
Adobe_cmykcolor /terminate get exec
Adobe_packedarray /terminate get exec
%%EOF
