%!PS-Adobe-3.0
%%Creator: Rhinoceros
%%Title: (v_cutter_phone.AI)
%%BoundingBox: 62 366 382 448
%%DocumentProcessColors: Black
%%DocumentNeededResources: procset Adobe_packedarray 2.0 0
%%+ procset Adobe_cmykcolor 1.1 0
%%+ procset Adobe_cshow 1.1 0
%%+ procset Adobe_customcolor 1.0 0
%%+ procset Adobe_typography_AI3 1.0 0
%%+ procset Adobe_IllustratorA_AI3 1.0 0
%AI3_ColorUsage: Color
%AI3_TemplateBox: 288 384 288 384
%AI3_TileBox: 0 0 576 768
%AI3_DocumentPreview: None
%%Template:
%%PageOrigin:0 0
%%EndComments
%%BeginProlog
%%IncludeResource: procset Adobe_packedarray 2.0 0
Adobe_packedarray /initialize get exec
%%IncludeResource: procset Adobe_cmykcolor 1.1 0
%%IncludeResource: procset Adobe_cshow 1.1 0
%%IncludeResource: procset Adobe_customcolor 1.0 0
%%IncludeResource: procset Adobe_typography_AI3 1.0 0
%%IncludeResource: procset Adobe_IllustratorA_AI3 1.0 0
%%EndProlog
%%BeginSetup
Adobe_cmykcolor /initialize get exec
Adobe_cshow /initialize get exec
Adobe_customcolor /initialize get exec
Adobe_typography_AI3 /initialize get exec
Adobe_IllustratorA_AI3 /initialize get exec
%%EndSetup
%AI5_BeginLayer
1 1 1 1 0 0 -1 255 0 0 Lb
(Default) Ln
0 A
0 R
1.0000 0.0000 0.0000 XA
1.0000 0.0000 0.0000 Xa
0 i 1 J 1 j 1.0000 w 4 M []0 d
0 D
116.5500 367.2912 m
125.6336 367.2912 134.7171 367.2912 143.8007 367.2912 c
147.3815 367.2912 150.9719 369.8067 150.9719 373.6750 c
150.9719 395.5929 150.9719 417.5108 150.9719 439.4287 c
150.9719 443.2970 147.3815 445.8125 143.8007 445.8125 c
134.7171 445.8125 125.6336 445.8125 116.5500 445.8125 c
112.9692 445.8125 109.3787 443.2970 109.3787 439.4287 c
109.3787 417.5108 109.3787 395.5929 109.3787 373.6750 c
109.3787 369.8068 112.9692 367.2912 116.5500 367.2912 C
s
1.0000 0.0000 0.0000 XA
1.0000 0.0000 0.0000 Xa
0 i 1 J 1 j 1.0000 w 4 M []0 d
0 D
186.2054 446.9024 m
182.7102 446.8993 179.2165 446.9676 175.7204 446.8319 c
175.1739 446.8106 174.6344 446.7628 174.0958 446.6608 c
173.3659 446.5225 172.6461 446.3543 171.9338 446.1417 c
169.7583 445.4925 167.9189 444.6362 166.3188 442.9220 c
165.6414 442.1963 165.0992 441.4074 164.6387 440.5307 c
163.8252 438.9819 163.8562 437.4303 163.7982 435.7977 c
163.4580 426.2311 163.5774 416.6683 163.5668 407.1024 c
163.5561 397.5374 163.4692 387.9738 163.6664 378.4083 c
163.6968 376.9362 163.6996 375.5446 164.3935 374.1471 c
164.7904 373.3476 165.2559 372.6117 165.8241 371.9213 c
167.5023 369.8823 169.4360 368.8156 171.9264 368.1202 c
172.6492 367.9184 173.3781 367.7543 174.1162 367.6197 c
174.6232 367.5272 175.1308 367.4710 175.6455 367.4465 c
179.1667 367.2790 182.6851 367.3545 186.2054 367.3479 c
189.7251 367.3545 193.2429 367.2792 196.7636 367.4464 c
197.2784 367.4709 197.7862 367.5270 198.2933 367.6195 c
199.0310 367.7540 199.7595 367.9179 200.4820 368.1196 c
202.9729 368.8148 204.9073 369.8812 206.5861 371.9206 c
207.1544 372.6110 207.6200 373.3470 208.0171 374.1466 c
208.7108 375.5436 208.7140 376.9348 208.7444 378.4065 c
208.9417 387.9721 208.8547 397.5357 208.8440 407.1007 c
208.8334 416.6653 208.9525 426.2270 208.6128 435.7923 c
208.5548 437.4263 208.5867 438.9793 207.7726 440.5297 c
207.3123 441.4063 206.7702 442.1952 206.0930 442.9210 c
204.4934 444.6352 202.6544 445.4916 200.4794 446.1410 c
199.7667 446.3538 199.0465 446.5221 198.3163 446.6605 c
197.7778 446.7626 197.2385 446.8105 196.6922 446.8318 c
193.1956 446.9678 189.7012 446.8993 186.2054 446.9024 C
s
1.0000 0.0000 0.0000 XA
1.0000 0.0000 0.0000 Xa
0 i 1 J 1 j 1.0000 w 4 M []0 d
0 D
218.5135 367.2912 m
260.4462 367.2912 L
260.4462 446.0666 L
218.5135 446.0666 L
218.5135 367.2912 L
s
1.0000 0.0000 0.0000 XA
1.0000 0.0000 0.0000 Xa
0 i 1 J 1 j 1.0000 w 4 M []0 d
0 D
355.6129 368.1974 m
370.8883 368.1974 381.1981 382.0673 381.1981 396.3886 c
381.1981 403.8880 381.1981 411.3873 381.1981 418.8867 c
381.1981 433.2081 370.8883 447.0779 355.6129 447.0779 c
340.3376 447.0779 330.0278 433.2081 330.0278 418.8867 c
330.0278 411.3873 330.0278 403.8880 330.0278 396.3886 c
330.0278 382.0672 340.3376 368.1974 355.6129 368.1974 C
s
1.0000 0.0000 0.0000 XA
1.0000 0.0000 0.0000 Xa
0 i 1 J 1 j 1.0000 w 4 M []0 d
0 D
295.7357 368.1974 m
311.3053 368.1974 323.9270 380.8190 323.9270 396.3886 c
323.9270 403.8880 323.9270 411.3873 323.9270 418.8867 c
323.9270 434.4563 311.3053 447.0779 295.7357 447.0779 c
280.1661 447.0779 267.5445 434.4563 267.5445 418.8867 c
267.5445 411.3873 267.5445 403.8880 267.5445 396.3886 c
267.5445 380.8190 280.1661 368.1974 295.7357 368.1974 C
s
1.0000 0.0000 0.0000 XA
1.0000 0.0000 0.0000 Xa
0 i 1 J 1 j 1.0000 w 4 M []0 d
0 D
70.0534 367.2912 m
78.1396 367.2912 86.2258 367.2912 94.3120 367.2912 c
97.8377 367.2912 100.6959 370.1493 100.6959 373.6750 c
100.6959 395.5929 100.6959 417.5108 100.6959 439.4287 c
100.6959 442.9544 97.8377 445.8125 94.3120 445.8125 c
86.2258 445.8125 78.1396 445.8125 70.0534 445.8125 c
66.5277 445.8125 63.6695 442.9544 63.6695 439.4287 c
63.6695 417.5108 63.6695 395.5929 63.6695 373.6750 c
63.6695 370.1493 66.5277 367.2912 70.0534 367.2912 C
s
LB
%AI5_EndLayer--
%%PageTrailer
gsave annotatepage grestore showpage
%%Trailer
Adobe_IllustratorA_AI3 /terminate get exec
Adobe_typography_AI3 /terminate get exec
Adobe_customcolor /terminate get exec
Adobe_cshow /terminate get exec
Adobe_cmykcolor /terminate get exec
Adobe_packedarray /terminate get exec
%%EOF
