<?xml version="1.0" encoding="UTF-8" standalone="no"?>
<!-- Created with Inkscape (http://www.inkscape.org/) -->

<svg
   xmlns:dc="http://purl.org/dc/elements/1.1/"
   xmlns:cc="http://creativecommons.org/ns#"
   xmlns:rdf="http://www.w3.org/1999/02/22-rdf-syntax-ns#"
   xmlns:svg="http://www.w3.org/2000/svg"
   xmlns="http://www.w3.org/2000/svg"
   xmlns:sodipodi="http://sodipodi.sourceforge.net/DTD/sodipodi-0.dtd"
   xmlns:inkscape="http://www.inkscape.org/namespaces/inkscape"
   width="297mm"
   height="210mm"
   viewBox="0 0 297 210"
   version="1.1"
   id="svg8"
   inkscape:version="0.92.4 (5da689c313, 2019-01-14)"
   sodipodi:docname="drawing.svg">
  <defs
     id="defs2" />
  <sodipodi:namedview
     id="base"
     pagecolor="#ffffff"
     bordercolor="#666666"
     borderopacity="1.0"
     inkscape:pageopacity="0.0"
     inkscape:pageshadow="2"
     inkscape:zoom="0.98994949"
     inkscape:cx="570.63869"
     inkscape:cy="412.7629"
     inkscape:document-units="mm"
     inkscape:current-layer="layer1"
     showgrid="false"
     inkscape:window-width="1920"
     inkscape:window-height="1001"
     inkscape:window-x="-9"
     inkscape:window-y="-9"
     inkscape:window-maximized="1" />
  <metadata
     id="metadata5">
    <rdf:RDF>
      <cc:Work
         rdf:about="">
        <dc:format>image/svg+xml</dc:format>
        <dc:type
           rdf:resource="http://purl.org/dc/dcmitype/StillImage" />
        <dc:title></dc:title>
      </cc:Work>
    </rdf:RDF>
  </metadata>
  <g
     inkscape:label="Layer 1"
     inkscape:groupmode="layer"
     id="layer1"
     transform="translate(0,-87)">
    <path
       style="fill:none;stroke:#000000;stroke-width:0.2681624px;stroke-linecap:butt;stroke-linejoin:miter;stroke-opacity:1"
       d="M 7.2162772,189.02311 H 289.45379"
       id="path10"
       inkscape:connector-curvature="0" />
    <flowRoot
       xml:space="preserve"
       id="flowRoot23"
       style="font-style:normal;font-weight:normal;font-size:13.33333397px;line-height:1.25;font-family:sans-serif;letter-spacing:0px;word-spacing:0px;fill:#000000;fill-opacity:1;stroke:none"
       transform="matrix(0.26458333,0,0,0.26458333,-36.081387,103.30344)"><flowRegion
         id="flowRegion25"
         style="font-size:13.33333397px"><rect
           id="rect27"
           width="182.83762"
           height="44.446712"
           x="179.80716"
           y="297.71591"
           style="font-size:13.33333397px" /></flowRegion><flowPara
         id="flowPara29">Basics</flowPara><flowPara
         id="flowPara31" /></flowRoot>    <flowRoot
       xml:space="preserve"
       id="flowRoot23-9"
       style="font-style:normal;font-weight:normal;font-size:13.33333397px;line-height:1.25;font-family:sans-serif;letter-spacing:0px;word-spacing:0px;fill:#000000;fill-opacity:1;stroke:none"
       transform="matrix(0.26458333,0,0,0.26458333,7.6860945,103.10073)"><flowRegion
         id="flowRegion25-4"
         style="font-size:13.33333397px"><rect
           id="rect27-1"
           width="182.83762"
           height="44.446712"
           x="179.80716"
           y="297.71591"
           style="font-size:13.33333397px" /></flowRegion><flowPara
         id="flowPara29-9">Materials</flowPara><flowPara
         id="flowPara31-4" /></flowRoot>    <flowRoot
       xml:space="preserve"
       id="flowRoot23-0"
       style="font-style:normal;font-weight:normal;font-size:13.33333397px;line-height:1.25;font-family:sans-serif;letter-spacing:0px;word-spacing:0px;fill:#000000;fill-opacity:1;stroke:none"
       transform="matrix(0.26458333,0,0,0.26458333,53.389182,103.36799)"
       inkscape:transform-center-x="7.2162772"
       inkscape:transform-center-y="1.3363428"><flowRegion
         id="flowRegion25-41"
         style="font-size:13.33333397px"><rect
           id="rect27-12"
           width="182.83762"
           height="44.446712"
           x="179.80716"
           y="297.71591"
           style="font-size:13.33333397px" /></flowRegion><flowPara
         id="flowPara29-99">Processes</flowPara><flowPara
         id="flowPara31-5" /></flowRoot>    <flowRoot
       xml:space="preserve"
       id="flowRoot23-93"
       style="font-style:normal;font-weight:normal;font-size:13.33333397px;line-height:1.25;font-family:sans-serif;letter-spacing:0px;word-spacing:0px;fill:#000000;fill-opacity:1;stroke:none"
       transform="matrix(0.26458333,0,0,0.26458333,109.51578,103.368)"><flowRegion
         id="flowRegion25-8"
         style="font-size:13.33333397px"><rect
           id="rect27-4"
           width="182.83762"
           height="44.446712"
           x="179.80716"
           y="297.71591"
           style="font-size:13.33333397px" /></flowRegion><flowPara
         id="flowPara29-1">3d printers</flowPara><flowPara
         id="flowPara31-9" /></flowRoot>    <flowRoot
       xml:space="preserve"
       id="flowRoot23-3"
       style="font-style:normal;font-weight:normal;font-size:13.33333397px;line-height:1.25;font-family:sans-serif;letter-spacing:0px;word-spacing:0px;fill:#000000;fill-opacity:1;stroke:none"
       transform="matrix(0.26458333,0,0,0.26458333,217.49268,102.83346)"><flowRegion
         id="flowRegion25-3"
         style="font-size:13.33333397px"><rect
           id="rect27-9"
           width="182.83762"
           height="44.446712"
           x="179.80716"
           y="297.71591"
           style="font-size:13.33333397px" /></flowRegion><flowPara
         id="flowPara29-4">programms</flowPara><flowPara
         id="flowPara31-53" /></flowRoot>    <flowRoot
       xml:space="preserve"
       id="flowRoot23-8"
       style="font-style:normal;font-weight:normal;font-size:13.33333397px;line-height:1.25;font-family:sans-serif;letter-spacing:0px;word-spacing:0px;fill:#000000;fill-opacity:1;stroke:none"
       transform="matrix(0.26458333,0,0,0.26458333,166.17693,103.368)"><flowRegion
         id="flowRegion25-2"
         style="font-size:13.33333397px"><rect
           id="rect27-43"
           width="182.83762"
           height="44.446712"
           x="179.80716"
           y="297.71591"
           style="font-size:13.33333397px" /></flowRegion><flowPara
         id="flowPara29-3">3dscanning</flowPara><flowPara
         id="flowPara31-91" /></flowRoot>    <path
       style="fill:none;stroke:#000000;stroke-width:0.26458332px;stroke-linecap:butt;stroke-linejoin:miter;stroke-opacity:1"
       d="m 16.570711,186.61769 -0.26727,23.78699"
       id="path116"
       inkscape:connector-curvature="0" />
    <path
       style="fill:none;stroke:#000000;stroke-width:0.26458332px;stroke-linecap:butt;stroke-linejoin:miter;stroke-opacity:1"
       d="m 64.144686,186.35042 -0.267269,9.88897 -26.726954,-0.53454 0.267271,-31.5378"
       id="path118"
       inkscape:connector-curvature="0" />
    <path
       style="fill:none;stroke:#000000;stroke-width:0.26458332px;stroke-linecap:butt;stroke-linejoin:miter;stroke-opacity:1"
       d="m 110.91685,186.88496 v 14.69982"
       id="path120"
       inkscape:connector-curvature="0" />
    <path
       style="fill:none;stroke:#000000;stroke-width:0.26832709px;stroke-linecap:butt;stroke-linejoin:miter;stroke-opacity:1"
       d="m 167.5741,186.39009 v 7.71126 l -24.58084,-0.25705 0.57164,-26.73238"
       id="path122"
       inkscape:connector-curvature="0" />
    <path
       style="fill:none;stroke:#000000;stroke-width:0.26458332px;stroke-linecap:butt;stroke-linejoin:miter;stroke-opacity:1"
       d="m 225.57548,186.88496 v 11.49259"
       id="path124"
       inkscape:connector-curvature="0" />
    <path
       style="fill:none;stroke:#000000;stroke-width:0.26458332px;stroke-linecap:butt;stroke-linejoin:miter;stroke-opacity:1"
       d="m 275.02035,186.35042 -0.26728,10.42351 18.44159,0.26727 -0.26726,-26.99422 -43.56494,-0.26727 v -6.94901"
       id="path126"
       inkscape:connector-curvature="0" />
    <flowRoot
       xml:space="preserve"
       id="flowRoot128"
       style="font-style:normal;font-variant:normal;font-weight:normal;font-stretch:normal;font-size:13.33333397px;line-height:1.25;font-family:sans-serif;-inkscape-font-specification:sans-serif;letter-spacing:0px;word-spacing:0px;fill:#000000;fill-opacity:1;stroke:none"
       transform="matrix(0.23340572,0,0,0.26458333,4.1713515,58.402161)"><flowRegion
         id="flowRegion130"
         style="font-style:normal;font-variant:normal;font-weight:normal;font-stretch:normal;font-size:13.33333397px;font-family:sans-serif;-inkscape-font-specification:sans-serif"><rect
           id="rect132"
           width="255.56859"
           height="263.64984"
           x="125.25892"
           y="185.58897"
           style="font-style:normal;font-variant:normal;font-weight:normal;font-stretch:normal;font-size:13.33333397px;font-family:sans-serif;-inkscape-font-specification:sans-serif" /></flowRegion><flowPara
         id="flowPara134">PLA vs. ABS</flowPara><flowPara
         id="flowPara136" /><flowPara
         id="flowPara138">pla: is a biodegradable  thermoplastic  derived from renewable resources</flowPara><flowPara
         id="flowPara144"
         style="font-style:normal;font-variant:normal;font-weight:normal;font-stretch:normal;font-family:sans-serif;-inkscape-font-specification:sans-serif"><flowSpan
   style="font-style:italic;font-variant:normal;font-weight:normal;font-stretch:normal;font-family:sans-serif;-inkscape-font-specification:'sans-serif Italic'"
   id="flowSpan146">properties</flowSpan></flowPara><flowPara
         style="font-style:normal;font-variant:normal;font-weight:normal;font-stretch:normal;font-family:sans-serif;-inkscape-font-specification:sans-serif"
         id="flowPara148">- easy to extrude </flowPara><flowPara
         id="flowPara140" /><flowPara
         id="flowPara142">abs: is a thermoplastic derived from petroleum</flowPara><flowPara
         id="flowPara150"><flowSpan
   style="font-style:italic;font-variant:normal;font-weight:normal;font-stretch:normal;font-family:sans-serif;-inkscape-font-specification:'sans-serif Italic'"
   id="flowSpan154">properties</flowSpan> </flowPara><flowPara
         id="flowPara152">-  more flexibility, strenght and durability</flowPara></flowRoot>    <flowRoot
       xml:space="preserve"
       id="flowRoot164"
       style="font-style:normal;font-weight:normal;font-size:21.33333397px;line-height:1.25;font-family:sans-serif;letter-spacing:0px;word-spacing:0px;fill:#000000;fill-opacity:1;stroke:none"
       transform="matrix(0.26458333,0,0,0.26458333,2.6726953,84.060035)"><flowRegion
         id="flowRegion166"
         style="font-size:21.33333397px"><rect
           id="rect168"
           width="180.81731"
           height="49.497475"
           x="126.26907"
           y="451.25909"
           style="font-size:21.33333397px" /></flowRegion><flowPara
         id="flowPara170"
         style="font-size:13.3333335px">Which one? </flowPara></flowRoot>  </g>
</svg>
