EESchema Schematic File Version 4
LIBS:MyTouchpad-cache
EELAYER 26 0
EELAYER END
$Descr A4 11693 8268
encoding utf-8
Sheet 1 1
Title ""
Date ""
Rev ""
Comp ""
Comment1 ""
Comment2 ""
Comment3 ""
Comment4 ""
$EndDescr
$Comp
L fab:ATTINY44-SSU IC1
U 1 1 5CA33322
P 2300 2750
F 0 "IC1" H 3150 3604 45  0000 C CNN
F 1 "ATTINY44-SSU" H 3150 3520 45  0000 C CNN
F 2 "fab-SOIC14" H 2330 2900 20  0001 C CNN
F 3 "" H 2300 2750 50  0001 C CNN
	1    2300 2750
	1    0    0    -1  
$EndComp
$Comp
L fab:FTDI-SMD-HEADER M1
U 1 1 5CA33392
P 6150 2450
F 0 "M1" H 6150 2450 45  0001 C CNN
F 1 "FTDI-SMD-HEADER" H 6150 2450 45  0001 C CNN
F 2 "fab-1X06SMD" H 6180 2600 20  0001 C CNN
F 3 "" H 6150 2450 50  0001 C CNN
	1    6150 2450
	1    0    0    -1  
$EndComp
$Comp
L fab:PINHD-2X2-SMD M4
U 1 1 5CA333D9
P 9200 2700
F 0 "M4" H 9150 3054 45  0000 C CNN
F 1 "PINHD-2X2-SMD" H 9150 2970 45  0000 C CNN
F 2 "fab-2X02SMD" H 9230 2850 20  0001 C CNN
F 3 "" H 9200 2700 50  0001 C CNN
	1    9200 2700
	1    0    0    -1  
$EndComp
$Comp
L fab:PINHD-2X2-SMD M3
U 1 1 5CA334BB
P 9200 2050
F 0 "M3" H 9150 2404 45  0000 C CNN
F 1 "PINHD-2X2-SMD" H 9150 2320 45  0000 C CNN
F 2 "fab-2X02SMD" H 9230 2200 20  0001 C CNN
F 3 "" H 9200 2050 50  0001 C CNN
	1    9200 2050
	1    0    0    -1  
$EndComp
$Comp
L fab:PINHD-2X2-SMD M5
U 1 1 5CA33501
P 9200 3350
F 0 "M5" H 9150 3704 45  0000 C CNN
F 1 "PINHD-2X2-SMD" H 9150 3620 45  0000 C CNN
F 2 "fab-2X02SMD" H 9230 3500 20  0001 C CNN
F 3 "" H 9200 3350 50  0001 C CNN
	1    9200 3350
	1    0    0    -1  
$EndComp
$Comp
L fab:CAP-UNPOLARIZED C1
U 1 1 5CA33701
P 1600 3050
F 0 "C1" H 1550 3264 45  0000 C CNN
F 1 "1Uf" H 1550 3180 45  0000 C CNN
F 2 "fab-C1206" H 1630 3200 20  0001 C CNN
F 3 "" H 1600 3050 50  0001 C CNN
	1    1600 3050
	0    -1   -1   0   
$EndComp
$Comp
L fab:RES-US1206FAB R1
U 1 1 5CA34E54
P 3200 4300
F 0 "R1" H 3200 4494 45  0000 C CNN
F 1 "10M" H 3200 4410 45  0000 C CNN
F 2 "fab-R1206FAB" H 3230 4450 20  0001 C CNN
F 3 "" H 3200 4300 50  0001 C CNN
	1    3200 4300
	1    0    0    -1  
$EndComp
$Comp
L fab:RES-US1206FAB R2
U 1 1 5CA34EB0
P 3200 4650
F 0 "R2" H 3200 4844 45  0000 C CNN
F 1 "10M" H 3200 4760 45  0000 C CNN
F 2 "fab-R1206FAB" H 3230 4800 20  0001 C CNN
F 3 "" H 3200 4650 50  0001 C CNN
	1    3200 4650
	1    0    0    -1  
$EndComp
$Comp
L fab:RES-US1206FAB R3
U 1 1 5CA34EEE
P 3200 5000
F 0 "R3" H 3200 5194 45  0000 C CNN
F 1 "10M" H 3200 5110 45  0000 C CNN
F 2 "fab-R1206FAB" H 3230 5150 20  0001 C CNN
F 3 "" H 3200 5000 50  0001 C CNN
	1    3200 5000
	1    0    0    -1  
$EndComp
$Comp
L fab:RES-US1206FAB R4
U 1 1 5CA34F3C
P 3200 5300
F 0 "R4" H 3200 5494 45  0000 C CNN
F 1 "10M" H 3200 5410 45  0000 C CNN
F 2 "fab-R1206FAB" H 3230 5450 20  0001 C CNN
F 3 "" H 3200 5300 50  0001 C CNN
	1    3200 5300
	1    0    0    -1  
$EndComp
$Comp
L fab:RES-US1206FAB R7
U 1 1 5CA34F8C
P 5300 4300
F 0 "R7" H 5300 4494 45  0000 C CNN
F 1 "10M" H 5300 4410 45  0000 C CNN
F 2 "fab-R1206FAB" H 5330 4450 20  0001 C CNN
F 3 "" H 5300 4300 50  0001 C CNN
	1    5300 4300
	1    0    0    -1  
$EndComp
$Comp
L fab:RES-US1206FAB R6
U 1 1 5CA35002
P 5250 4650
F 0 "R6" H 5250 4844 45  0000 C CNN
F 1 "10M" H 5250 4760 45  0000 C CNN
F 2 "fab-R1206FAB" H 5280 4800 20  0001 C CNN
F 3 "" H 5250 4650 50  0001 C CNN
	1    5250 4650
	1    0    0    -1  
$EndComp
$Comp
L fab:RES-US1206FAB R8
U 1 1 5CA35064
P 5300 4950
F 0 "R8" H 5300 5144 45  0000 C CNN
F 1 "10M" H 5300 5060 45  0000 C CNN
F 2 "fab-R1206FAB" H 5330 5100 20  0001 C CNN
F 3 "" H 5300 4950 50  0001 C CNN
	1    5300 4950
	1    0    0    -1  
$EndComp
$Comp
L fab:RES-US1206FAB R9
U 1 1 5CA350B4
P 5300 5250
F 0 "R9" H 5300 5444 45  0000 C CNN
F 1 "10M" H 5300 5360 45  0000 C CNN
F 2 "fab-R1206FAB" H 5330 5400 20  0001 C CNN
F 3 "" H 5300 5250 50  0001 C CNN
	1    5300 5250
	1    0    0    -1  
$EndComp
Text GLabel 5950 1950 0    50   Input ~ 0
GND
Text GLabel 1250 3350 0    50   Input ~ 0
GND
Text GLabel 1250 2850 0    50   Input ~ 0
VCC
Wire Wire Line
	2000 2850 1600 2850
Wire Wire Line
	2000 3350 1600 3350
Wire Wire Line
	1600 3250 1600 3350
Connection ~ 1600 3350
Wire Wire Line
	1600 3350 1250 3350
Wire Wire Line
	1600 2950 1600 2850
Connection ~ 1600 2850
Wire Wire Line
	1600 2850 1250 2850
Text GLabel 4500 2150 2    50   Input ~ 0
RST
Text GLabel 5950 3450 0    50   Input ~ 0
RST
Text GLabel 5950 3350 0    50   Input ~ 0
S4-SCK
Text GLabel 5950 3250 0    50   Input ~ 0
S3-MISO
Text GLabel 6900 3250 2    50   Input ~ 0
VCC
Text GLabel 6900 3350 2    50   Input ~ 0
S2-MOSI
Text GLabel 6900 3450 2    50   Input ~ 0
GND
Text GLabel 5950 2150 0    50   Input ~ 0
VCC
Text GLabel 5950 2250 0    50   Input ~ 0
TX
Text GLabel 5950 2350 0    50   Input ~ 0
RX
Text GLabel 4500 2250 2    50   Input ~ 0
STEP
Text GLabel 4500 2350 2    50   Input ~ 0
RX
Text GLabel 4500 2650 2    50   Input ~ 0
S1
Text GLabel 4500 2750 2    50   Input ~ 0
S2-MOSI
Text GLabel 4500 2850 2    50   Input ~ 0
S3-MISO
Text GLabel 4500 2950 2    50   Input ~ 0
S4-SCK
Text GLabel 4500 3050 2    50   Input ~ 0
S5
Text GLabel 4500 3150 2    50   Input ~ 0
S6
Text GLabel 4500 3250 2    50   Input ~ 0
S7
Text GLabel 4500 3350 2    50   Input ~ 0
S8
Text GLabel 8650 1950 0    50   Input ~ 0
STEP
Text GLabel 9650 1950 2    50   Input ~ 0
STEP
Text GLabel 8650 2050 0    50   Input ~ 0
GND
Text GLabel 9650 2050 2    50   Input ~ 0
GND
Text GLabel 8650 2600 0    50   Input ~ 0
S2-MOSI
Text GLabel 9650 2600 2    50   Input ~ 0
S4-SCK
Text GLabel 8650 2700 0    50   Input ~ 0
S1
Text GLabel 9650 2700 2    50   Input ~ 0
S3-MISO
Text GLabel 8650 3250 0    50   Input ~ 0
S5
Text GLabel 8650 3350 0    50   Input ~ 0
S8
Text GLabel 9650 3250 2    50   Input ~ 0
S6
Text GLabel 9650 3350 2    50   Input ~ 0
S7
Wire Wire Line
	8650 1950 9000 1950
Wire Wire Line
	9000 2050 8650 2050
Wire Wire Line
	9300 1950 9650 1950
Wire Wire Line
	9650 2050 9300 2050
Wire Wire Line
	8650 2600 9000 2600
Wire Wire Line
	8650 2700 9000 2700
Wire Wire Line
	9300 2600 9650 2600
Wire Wire Line
	9650 2700 9300 2700
Wire Wire Line
	8650 3250 9000 3250
Wire Wire Line
	9300 3250 9650 3250
Wire Wire Line
	9650 3350 9300 3350
Wire Wire Line
	9000 3350 8650 3350
Wire Wire Line
	5950 1950 6150 1950
Wire Wire Line
	5950 2150 6150 2150
Wire Wire Line
	5950 2250 6150 2250
Wire Wire Line
	5950 2350 6150 2350
Wire Wire Line
	4300 2250 4500 2250
Wire Wire Line
	4300 2350 4500 2350
Wire Wire Line
	4300 2650 4500 2650
Wire Wire Line
	4300 2750 4500 2750
Wire Wire Line
	4300 2850 4500 2850
Wire Wire Line
	4300 2950 4500 2950
Wire Wire Line
	4300 3050 4500 3050
Wire Wire Line
	4500 3150 4300 3150
Wire Wire Line
	4300 3250 4500 3250
Wire Wire Line
	4500 3350 4300 3350
Wire Wire Line
	5950 3250 6250 3250
Wire Wire Line
	6250 3350 5950 3350
Wire Wire Line
	5950 3450 6250 3450
Wire Wire Line
	6550 3250 6900 3250
Wire Wire Line
	6900 3350 6550 3350
Wire Wire Line
	6550 3450 6900 3450
Text GLabel 2800 4300 0    50   Input ~ 0
STEP
Text GLabel 2800 4650 0    50   Input ~ 0
STEP
Text GLabel 2800 5000 0    50   Input ~ 0
STEP
Text GLabel 2800 5300 0    50   Input ~ 0
STEP
Text GLabel 4850 4300 0    50   Input ~ 0
STEP
Text GLabel 4850 4650 0    50   Input ~ 0
STEP
Text GLabel 4850 4950 0    50   Input ~ 0
STEP
Text GLabel 4850 5250 0    50   Input ~ 0
STEP
Text GLabel 4450 1450 1    50   Input ~ 0
VCC
$Comp
L fab:RES-US1206FAB R5
U 1 1 5CA43519
P 4450 1750
F 0 "R5" V 4408 1818 45  0000 L CNN
F 1 "10K" V 4492 1818 45  0000 L CNN
F 2 "fab-R1206FAB" H 4480 1900 20  0001 C CNN
F 3 "" H 4450 1750 50  0001 C CNN
	1    4450 1750
	0    1    1    0   
$EndComp
Wire Wire Line
	4450 1450 4450 1550
Wire Wire Line
	4450 1950 4450 2150
Text GLabel 3700 4300 2    50   Input ~ 0
S1
Text GLabel 3700 4650 2    50   Input ~ 0
S2-MOSI
Text GLabel 3700 5000 2    50   Input ~ 0
S3-MISO
Text GLabel 3700 5300 2    50   Input ~ 0
S4-SCK
Text GLabel 5750 4300 2    50   Input ~ 0
S5
Text GLabel 5750 4650 2    50   Input ~ 0
S6
Text GLabel 5750 4950 2    50   Input ~ 0
S7
Text GLabel 5750 5250 2    50   Input ~ 0
S8
Wire Wire Line
	2800 4300 3000 4300
Wire Wire Line
	3400 4300 3700 4300
Wire Wire Line
	2800 4650 3000 4650
Wire Wire Line
	3400 4650 3700 4650
Wire Wire Line
	2800 5000 3000 5000
Wire Wire Line
	3400 5000 3700 5000
Wire Wire Line
	3700 5300 3400 5300
Wire Wire Line
	3000 5300 2800 5300
Wire Wire Line
	4850 4300 5100 4300
Wire Wire Line
	4850 4650 5050 4650
Wire Wire Line
	4850 4950 5100 4950
Wire Wire Line
	4850 5250 5100 5250
Wire Wire Line
	5500 5250 5750 5250
Wire Wire Line
	5750 4950 5500 4950
Wire Wire Line
	5450 4650 5750 4650
Wire Wire Line
	5750 4300 5500 4300
Wire Wire Line
	4450 2150 4500 2150
Wire Wire Line
	4300 2150 4450 2150
Connection ~ 4450 2150
$Comp
L fab:AVRISPSMD M2
U 1 1 5CA606A6
P 6350 3350
F 0 "M2" H 6448 3704 45  0000 C CNN
F 1 "AVRISPSMD" H 6448 3620 45  0000 C CNN
F 2 "fab-2X03SMD" H 6380 3500 20  0001 C CNN
F 3 "" H 6350 3350 50  0001 C CNN
	1    6350 3350
	1    0    0    -1  
$EndComp
$Comp
L fab:RES-US1206FAB R10
U 1 1 5CA6095F
P 7200 4300
F 0 "R10" H 7200 4494 45  0000 C CNN
F 1 "0" H 7200 4410 45  0000 C CNN
F 2 "fab-R1206FAB" H 7230 4450 20  0001 C CNN
F 3 "" H 7200 4300 50  0001 C CNN
	1    7200 4300
	1    0    0    -1  
$EndComp
$Comp
L fab:RES-US1206FAB R11
U 1 1 5CA609B1
P 7200 4700
F 0 "R11" H 7200 4894 45  0000 C CNN
F 1 "0" H 7200 4810 45  0000 C CNN
F 2 "fab-R1206FAB" H 7230 4850 20  0001 C CNN
F 3 "" H 7200 4700 50  0001 C CNN
	1    7200 4700
	1    0    0    -1  
$EndComp
Text GLabel 6800 4300 0    50   Input ~ 0
STEP
Text GLabel 6800 4700 0    50   Input ~ 0
STEP
Text GLabel 7650 4300 2    50   Input ~ 0
STEP
Text GLabel 7600 4700 2    50   Input ~ 0
STEP
Wire Wire Line
	6800 4300 7000 4300
Wire Wire Line
	7400 4300 7650 4300
Wire Wire Line
	7600 4700 7400 4700
Wire Wire Line
	7000 4700 6800 4700
$Comp
L fab:LEDFAB1206 M6
U 1 1 5CA4B357
P 9000 4950
F 0 "M6" H 9077 5042 45  0000 L CNN
F 1 "LEDFAB1206" H 9077 4958 45  0000 L CNN
F 2 "fab-LED1206FAB" H 9030 5100 20  0001 C CNN
F 3 "" H 9000 4950 50  0001 C CNN
	1    9000 4950
	1    0    0    -1  
$EndComp
$Comp
L fab:RES-US1206FAB R12
U 1 1 5CA4B3F9
P 9000 4350
F 0 "R12" V 8958 4418 45  0000 L CNN
F 1 "RES-US1206FAB" V 9042 4418 45  0000 L CNN
F 2 "fab-R1206FAB" H 9030 4500 20  0001 C CNN
F 3 "" H 9000 4350 50  0001 C CNN
	1    9000 4350
	0    1    1    0   
$EndComp
Text GLabel 9000 3900 1    50   Input ~ 0
VCC
Text GLabel 9000 5250 3    50   Input ~ 0
GND
Wire Wire Line
	9000 3900 9000 4150
Wire Wire Line
	9000 4550 9000 4750
Wire Wire Line
	9000 5050 9000 5250
$EndSCHEMATC
