ISO-10303-21;
HEADER;
/* Generated by software containing ST-Developer
 * from STEP Tools, Inc. (www.steptools.com) 
 */

FILE_DESCRIPTION(
/* description */ (''),
/* implementation_level */ '2;1');

FILE_NAME(
/* name */ 'C:/Users/Gabi/Downloads/lamp.step',
/* time_stamp */ '2019-04-24T15:15:07+02:00',
/* author */ ('gabriela.martinez.pinheiro'),
/* organization */ (''),
/* preprocessor_version */ 'ST-DEVELOPER v17.2',
/* originating_system */ 'Autodesk Translation Framework v7.6.0.251',
/* authorisation */ '');

FILE_SCHEMA (('AUTOMOTIVE_DESIGN { 1 0 10303 214 3 1 1 }'));
ENDSEC;

DATA;
#10=MECHANICAL_DESIGN_GEOMETRIC_PRESENTATION_REPRESENTATION('',(#15,#16,
#17,#18),#402);
#11=SHAPE_REPRESENTATION_RELATIONSHIP('SRR','None',#409,#12);
#12=ADVANCED_BREP_SHAPE_REPRESENTATION('',(#19,#20,#21,#22),#401);
#13=SPHERICAL_SURFACE('',#256,25.);
#14=SPHERICAL_SURFACE('',#261,25.);
#15=STYLED_ITEM('',(#419),#19);
#16=STYLED_ITEM('',(#420),#20);
#17=STYLED_ITEM('',(#420),#21);
#18=STYLED_ITEM('',(#420),#22);
#19=MANIFOLD_SOLID_BREP('Base',#221);
#20=MANIFOLD_SOLID_BREP('Body2',#222);
#21=MANIFOLD_SOLID_BREP('Body4',#223);
#22=MANIFOLD_SOLID_BREP('Body5',#224);
#23=CIRCLE('',#240,25.);
#24=CIRCLE('',#241,25.);
#25=CIRCLE('',#244,25.);
#26=CIRCLE('',#245,25.);
#27=CIRCLE('',#249,25.);
#28=CIRCLE('',#251,25.);
#29=CIRCLE('',#255,25.);
#30=CIRCLE('',#257,25.);
#31=CIRCLE('',#258,25.);
#32=CIRCLE('',#259,25.);
#33=CIRCLE('',#262,25.);
#34=CIRCLE('',#263,25.);
#35=CYLINDRICAL_SURFACE('',#239,25.);
#36=CYLINDRICAL_SURFACE('',#243,25.);
#37=CYLINDRICAL_SURFACE('',#250,25.);
#38=FACE_OUTER_BOUND('',#54,.T.);
#39=FACE_OUTER_BOUND('',#55,.T.);
#40=FACE_OUTER_BOUND('',#56,.T.);
#41=FACE_OUTER_BOUND('',#57,.T.);
#42=FACE_OUTER_BOUND('',#58,.T.);
#43=FACE_OUTER_BOUND('',#59,.T.);
#44=FACE_OUTER_BOUND('',#60,.T.);
#45=FACE_OUTER_BOUND('',#61,.T.);
#46=FACE_OUTER_BOUND('',#62,.T.);
#47=FACE_OUTER_BOUND('',#63,.T.);
#48=FACE_OUTER_BOUND('',#64,.T.);
#49=FACE_OUTER_BOUND('',#65,.T.);
#50=FACE_OUTER_BOUND('',#66,.T.);
#51=FACE_OUTER_BOUND('',#67,.T.);
#52=FACE_OUTER_BOUND('',#68,.T.);
#53=FACE_OUTER_BOUND('',#69,.T.);
#54=EDGE_LOOP('',(#142,#143,#144,#145));
#55=EDGE_LOOP('',(#146,#147,#148,#149));
#56=EDGE_LOOP('',(#150,#151,#152,#153));
#57=EDGE_LOOP('',(#154,#155,#156,#157));
#58=EDGE_LOOP('',(#158,#159,#160,#161));
#59=EDGE_LOOP('',(#162,#163,#164,#165));
#60=EDGE_LOOP('',(#166,#167));
#61=EDGE_LOOP('',(#168,#169,#170,#171));
#62=EDGE_LOOP('',(#172,#173));
#63=EDGE_LOOP('',(#174,#175,#176,#177));
#64=EDGE_LOOP('',(#178,#179));
#65=EDGE_LOOP('',(#180,#181,#182,#183,#184));
#66=EDGE_LOOP('',(#185,#186,#187));
#67=EDGE_LOOP('',(#188,#189));
#68=EDGE_LOOP('',(#190,#191));
#69=EDGE_LOOP('',(#192,#193));
#70=LINE('',#342,#84);
#71=LINE('',#344,#85);
#72=LINE('',#346,#86);
#73=LINE('',#347,#87);
#74=LINE('',#353,#88);
#75=LINE('',#356,#89);
#76=LINE('',#358,#90);
#77=LINE('',#359,#91);
#78=LINE('',#368,#92);
#79=LINE('',#372,#93);
#80=LINE('',#375,#94);
#81=LINE('',#377,#95);
#82=LINE('',#382,#96);
#83=LINE('',#397,#97);
#84=VECTOR('',#270,10.);
#85=VECTOR('',#271,10.);
#86=VECTOR('',#272,10.);
#87=VECTOR('',#273,10.);
#88=VECTOR('',#280,10.);
#89=VECTOR('',#283,10.);
#90=VECTOR('',#284,10.);
#91=VECTOR('',#285,10.);
#92=VECTOR('',#298,10.);
#93=VECTOR('',#303,10.);
#94=VECTOR('',#306,10.);
#95=VECTOR('',#309,10.);
#96=VECTOR('',#314,10.);
#97=VECTOR('',#335,10.);
#98=VERTEX_POINT('',#340);
#99=VERTEX_POINT('',#341);
#100=VERTEX_POINT('',#343);
#101=VERTEX_POINT('',#345);
#102=VERTEX_POINT('',#349);
#103=VERTEX_POINT('',#351);
#104=VERTEX_POINT('',#355);
#105=VERTEX_POINT('',#357);
#106=VERTEX_POINT('',#366);
#107=VERTEX_POINT('',#367);
#108=VERTEX_POINT('',#371);
#109=VERTEX_POINT('',#373);
#110=VERTEX_POINT('',#380);
#111=VERTEX_POINT('',#381);
#112=VERTEX_POINT('',#385);
#113=VERTEX_POINT('',#388);
#114=VERTEX_POINT('',#392);
#115=VERTEX_POINT('',#393);
#116=EDGE_CURVE('',#98,#99,#70,.T.);
#117=EDGE_CURVE('',#98,#100,#71,.T.);
#118=EDGE_CURVE('',#101,#100,#72,.T.);
#119=EDGE_CURVE('',#99,#101,#73,.T.);
#120=EDGE_CURVE('',#102,#99,#23,.T.);
#121=EDGE_CURVE('',#103,#101,#24,.T.);
#122=EDGE_CURVE('',#102,#103,#74,.T.);
#123=EDGE_CURVE('',#102,#104,#75,.T.);
#124=EDGE_CURVE('',#105,#103,#76,.T.);
#125=EDGE_CURVE('',#104,#105,#77,.T.);
#126=EDGE_CURVE('',#98,#104,#25,.T.);
#127=EDGE_CURVE('',#100,#105,#26,.T.);
#128=EDGE_CURVE('',#106,#107,#78,.T.);
#129=EDGE_CURVE('',#107,#106,#27,.T.);
#130=EDGE_CURVE('',#108,#106,#79,.T.);
#131=EDGE_CURVE('',#109,#108,#28,.T.);
#132=EDGE_CURVE('',#107,#109,#80,.T.);
#133=EDGE_CURVE('',#109,#108,#81,.T.);
#134=EDGE_CURVE('',#110,#111,#82,.T.);
#135=EDGE_CURVE('',#110,#111,#29,.T.);
#136=EDGE_CURVE('',#111,#112,#30,.T.);
#137=EDGE_CURVE('',#112,#110,#31,.T.);
#138=EDGE_CURVE('',#113,#112,#32,.T.);
#139=EDGE_CURVE('',#114,#115,#33,.T.);
#140=EDGE_CURVE('',#115,#114,#34,.T.);
#141=EDGE_CURVE('',#115,#114,#83,.T.);
#142=ORIENTED_EDGE('',*,*,#116,.F.);
#143=ORIENTED_EDGE('',*,*,#117,.T.);
#144=ORIENTED_EDGE('',*,*,#118,.F.);
#145=ORIENTED_EDGE('',*,*,#119,.F.);
#146=ORIENTED_EDGE('',*,*,#120,.T.);
#147=ORIENTED_EDGE('',*,*,#119,.T.);
#148=ORIENTED_EDGE('',*,*,#121,.F.);
#149=ORIENTED_EDGE('',*,*,#122,.F.);
#150=ORIENTED_EDGE('',*,*,#123,.F.);
#151=ORIENTED_EDGE('',*,*,#122,.T.);
#152=ORIENTED_EDGE('',*,*,#124,.F.);
#153=ORIENTED_EDGE('',*,*,#125,.F.);
#154=ORIENTED_EDGE('',*,*,#126,.T.);
#155=ORIENTED_EDGE('',*,*,#125,.T.);
#156=ORIENTED_EDGE('',*,*,#127,.F.);
#157=ORIENTED_EDGE('',*,*,#117,.F.);
#158=ORIENTED_EDGE('',*,*,#127,.T.);
#159=ORIENTED_EDGE('',*,*,#124,.T.);
#160=ORIENTED_EDGE('',*,*,#121,.T.);
#161=ORIENTED_EDGE('',*,*,#118,.T.);
#162=ORIENTED_EDGE('',*,*,#126,.F.);
#163=ORIENTED_EDGE('',*,*,#116,.T.);
#164=ORIENTED_EDGE('',*,*,#120,.F.);
#165=ORIENTED_EDGE('',*,*,#123,.T.);
#166=ORIENTED_EDGE('',*,*,#128,.F.);
#167=ORIENTED_EDGE('',*,*,#129,.F.);
#168=ORIENTED_EDGE('',*,*,#130,.F.);
#169=ORIENTED_EDGE('',*,*,#131,.F.);
#170=ORIENTED_EDGE('',*,*,#132,.F.);
#171=ORIENTED_EDGE('',*,*,#129,.T.);
#172=ORIENTED_EDGE('',*,*,#133,.F.);
#173=ORIENTED_EDGE('',*,*,#131,.T.);
#174=ORIENTED_EDGE('',*,*,#132,.T.);
#175=ORIENTED_EDGE('',*,*,#133,.T.);
#176=ORIENTED_EDGE('',*,*,#130,.T.);
#177=ORIENTED_EDGE('',*,*,#128,.T.);
#178=ORIENTED_EDGE('',*,*,#134,.F.);
#179=ORIENTED_EDGE('',*,*,#135,.T.);
#180=ORIENTED_EDGE('',*,*,#136,.F.);
#181=ORIENTED_EDGE('',*,*,#135,.F.);
#182=ORIENTED_EDGE('',*,*,#137,.F.);
#183=ORIENTED_EDGE('',*,*,#138,.F.);
#184=ORIENTED_EDGE('',*,*,#138,.T.);
#185=ORIENTED_EDGE('',*,*,#136,.T.);
#186=ORIENTED_EDGE('',*,*,#137,.T.);
#187=ORIENTED_EDGE('',*,*,#134,.T.);
#188=ORIENTED_EDGE('',*,*,#139,.F.);
#189=ORIENTED_EDGE('',*,*,#140,.F.);
#190=ORIENTED_EDGE('',*,*,#141,.F.);
#191=ORIENTED_EDGE('',*,*,#140,.T.);
#192=ORIENTED_EDGE('',*,*,#139,.T.);
#193=ORIENTED_EDGE('',*,*,#141,.T.);
#194=PLANE('',#238);
#195=PLANE('',#242);
#196=PLANE('',#246);
#197=PLANE('',#247);
#198=PLANE('',#248);
#199=PLANE('',#252);
#200=PLANE('',#253);
#201=PLANE('',#254);
#202=PLANE('',#260);
#203=PLANE('',#264);
#204=PLANE('',#265);
#205=ADVANCED_FACE('',(#38),#194,.T.);
#206=ADVANCED_FACE('',(#39),#35,.T.);
#207=ADVANCED_FACE('',(#40),#195,.T.);
#208=ADVANCED_FACE('',(#41),#36,.T.);
#209=ADVANCED_FACE('',(#42),#196,.T.);
#210=ADVANCED_FACE('',(#43),#197,.F.);
#211=ADVANCED_FACE('',(#44),#198,.F.);
#212=ADVANCED_FACE('',(#45),#37,.T.);
#213=ADVANCED_FACE('',(#46),#199,.T.);
#214=ADVANCED_FACE('',(#47),#200,.T.);
#215=ADVANCED_FACE('',(#48),#201,.T.);
#216=ADVANCED_FACE('',(#49),#13,.T.);
#217=ADVANCED_FACE('',(#50),#202,.T.);
#218=ADVANCED_FACE('',(#51),#14,.T.);
#219=ADVANCED_FACE('',(#52),#203,.T.);
#220=ADVANCED_FACE('',(#53),#204,.T.);
#221=CLOSED_SHELL('',(#205,#206,#207,#208,#209,#210));
#222=CLOSED_SHELL('',(#211,#212,#213,#214));
#223=CLOSED_SHELL('',(#215,#216,#217));
#224=CLOSED_SHELL('',(#218,#219,#220));
#225=DERIVED_UNIT_ELEMENT(#227,1.);
#226=DERIVED_UNIT_ELEMENT(#404,3.);
#227=(
MASS_UNIT()
NAMED_UNIT(*)
SI_UNIT(.KILO.,.GRAM.)
);
#228=DERIVED_UNIT((#225,#226));
#229=MEASURE_REPRESENTATION_ITEM('density measure',
POSITIVE_RATIO_MEASURE(7850.),#228);
#230=PROPERTY_DEFINITION_REPRESENTATION(#235,#232);
#231=PROPERTY_DEFINITION_REPRESENTATION(#236,#233);
#232=REPRESENTATION('material name',(#234),#401);
#233=REPRESENTATION('density',(#229),#401);
#234=DESCRIPTIVE_REPRESENTATION_ITEM('Steel','Steel');
#235=PROPERTY_DEFINITION('material property','material name',#411);
#236=PROPERTY_DEFINITION('material property','density of part',#411);
#237=AXIS2_PLACEMENT_3D('placement',#338,#266,#267);
#238=AXIS2_PLACEMENT_3D('',#339,#268,#269);
#239=AXIS2_PLACEMENT_3D('',#348,#274,#275);
#240=AXIS2_PLACEMENT_3D('',#350,#276,#277);
#241=AXIS2_PLACEMENT_3D('',#352,#278,#279);
#242=AXIS2_PLACEMENT_3D('',#354,#281,#282);
#243=AXIS2_PLACEMENT_3D('',#360,#286,#287);
#244=AXIS2_PLACEMENT_3D('',#361,#288,#289);
#245=AXIS2_PLACEMENT_3D('',#362,#290,#291);
#246=AXIS2_PLACEMENT_3D('',#363,#292,#293);
#247=AXIS2_PLACEMENT_3D('',#364,#294,#295);
#248=AXIS2_PLACEMENT_3D('',#365,#296,#297);
#249=AXIS2_PLACEMENT_3D('',#369,#299,#300);
#250=AXIS2_PLACEMENT_3D('',#370,#301,#302);
#251=AXIS2_PLACEMENT_3D('',#374,#304,#305);
#252=AXIS2_PLACEMENT_3D('',#376,#307,#308);
#253=AXIS2_PLACEMENT_3D('',#378,#310,#311);
#254=AXIS2_PLACEMENT_3D('',#379,#312,#313);
#255=AXIS2_PLACEMENT_3D('',#383,#315,#316);
#256=AXIS2_PLACEMENT_3D('',#384,#317,#318);
#257=AXIS2_PLACEMENT_3D('',#386,#319,#320);
#258=AXIS2_PLACEMENT_3D('',#387,#321,#322);
#259=AXIS2_PLACEMENT_3D('',#389,#323,#324);
#260=AXIS2_PLACEMENT_3D('',#390,#325,#326);
#261=AXIS2_PLACEMENT_3D('',#391,#327,#328);
#262=AXIS2_PLACEMENT_3D('',#394,#329,#330);
#263=AXIS2_PLACEMENT_3D('',#395,#331,#332);
#264=AXIS2_PLACEMENT_3D('',#396,#333,#334);
#265=AXIS2_PLACEMENT_3D('',#398,#336,#337);
#266=DIRECTION('axis',(0.,0.,1.));
#267=DIRECTION('refdir',(1.,0.,0.));
#268=DIRECTION('center_axis',(0.,0.,1.));
#269=DIRECTION('ref_axis',(1.,0.,0.));
#270=DIRECTION('',(-1.,0.,0.));
#271=DIRECTION('',(0.,1.,0.));
#272=DIRECTION('',(1.,0.,0.));
#273=DIRECTION('',(0.,1.,0.));
#274=DIRECTION('center_axis',(0.,1.,0.));
#275=DIRECTION('ref_axis',(0.,0.,-1.));
#276=DIRECTION('center_axis',(0.,1.,0.));
#277=DIRECTION('ref_axis',(0.,0.,-1.));
#278=DIRECTION('center_axis',(0.,1.,0.));
#279=DIRECTION('ref_axis',(0.,0.,-1.));
#280=DIRECTION('',(0.,1.,0.));
#281=DIRECTION('center_axis',(0.,0.,-1.));
#282=DIRECTION('ref_axis',(-1.,0.,0.));
#283=DIRECTION('',(1.,0.,0.));
#284=DIRECTION('',(-1.,0.,0.));
#285=DIRECTION('',(0.,1.,0.));
#286=DIRECTION('center_axis',(0.,1.,0.));
#287=DIRECTION('ref_axis',(0.,0.,1.));
#288=DIRECTION('center_axis',(0.,1.,0.));
#289=DIRECTION('ref_axis',(0.,0.,1.));
#290=DIRECTION('center_axis',(0.,1.,0.));
#291=DIRECTION('ref_axis',(0.,0.,1.));
#292=DIRECTION('center_axis',(0.,1.,0.));
#293=DIRECTION('ref_axis',(1.,0.,0.));
#294=DIRECTION('center_axis',(0.,1.,0.));
#295=DIRECTION('ref_axis',(1.,0.,0.));
#296=DIRECTION('center_axis',(1.,0.,0.));
#297=DIRECTION('ref_axis',(0.,0.,-1.));
#298=DIRECTION('',(0.,0.,-1.));
#299=DIRECTION('center_axis',(1.,0.,0.));
#300=DIRECTION('ref_axis',(0.,1.,0.));
#301=DIRECTION('center_axis',(1.,0.,0.));
#302=DIRECTION('ref_axis',(0.,1.,0.));
#303=DIRECTION('',(-1.,0.,0.));
#304=DIRECTION('center_axis',(1.,0.,0.));
#305=DIRECTION('ref_axis',(0.,1.,0.));
#306=DIRECTION('',(1.,0.,0.));
#307=DIRECTION('center_axis',(1.,0.,0.));
#308=DIRECTION('ref_axis',(0.,0.,-1.));
#309=DIRECTION('',(0.,0.,1.));
#310=DIRECTION('center_axis',(0.,-1.,0.));
#311=DIRECTION('ref_axis',(0.,0.,-1.));
#312=DIRECTION('center_axis',(-1.,0.,0.));
#313=DIRECTION('ref_axis',(0.,0.,1.));
#314=DIRECTION('',(0.,0.,-1.));
#315=DIRECTION('center_axis',(-1.,0.,0.));
#316=DIRECTION('ref_axis',(0.,0.,-1.));
#317=DIRECTION('center_axis',(0.577350269189626,0.577350269189626,0.577350269189626));
#318=DIRECTION('ref_axis',(-0.707106781186548,0.,0.707106781186548));
#319=DIRECTION('center_axis',(0.,-1.,0.));
#320=DIRECTION('ref_axis',(0.,0.,1.));
#321=DIRECTION('center_axis',(0.,-1.,0.));
#322=DIRECTION('ref_axis',(0.,0.,1.));
#323=DIRECTION('center_axis',(-0.408248290463863,0.816496580927726,-0.408248290463863));
#324=DIRECTION('ref_axis',(0.707106781186548,8.88178419700125E-17,-0.707106781186548));
#325=DIRECTION('center_axis',(0.,-1.,0.));
#326=DIRECTION('ref_axis',(0.,0.,-1.));
#327=DIRECTION('center_axis',(0.577350269189626,0.577350269189626,0.577350269189626));
#328=DIRECTION('ref_axis',(-0.707106781186548,0.,0.707106781186548));
#329=DIRECTION('center_axis',(0.,-1.,0.));
#330=DIRECTION('ref_axis',(0.,0.,1.));
#331=DIRECTION('center_axis',(1.,0.,0.));
#332=DIRECTION('ref_axis',(0.,0.,1.));
#333=DIRECTION('center_axis',(1.,0.,0.));
#334=DIRECTION('ref_axis',(0.,0.,-1.));
#335=DIRECTION('',(0.,0.,1.));
#336=DIRECTION('center_axis',(0.,-1.,0.));
#337=DIRECTION('ref_axis',(0.,0.,-1.));
#338=CARTESIAN_POINT('',(0.,0.,0.));
#339=CARTESIAN_POINT('Origin',(25.,0.,50.));
#340=CARTESIAN_POINT('',(125.,0.,50.));
#341=CARTESIAN_POINT('',(25.,0.,50.));
#342=CARTESIAN_POINT('',(125.,0.,50.));
#343=CARTESIAN_POINT('',(125.,15.,50.));
#344=CARTESIAN_POINT('',(125.,0.,50.));
#345=CARTESIAN_POINT('',(25.,15.,50.));
#346=CARTESIAN_POINT('',(125.,15.,50.));
#347=CARTESIAN_POINT('',(25.,0.,50.));
#348=CARTESIAN_POINT('Origin',(25.,0.,25.));
#349=CARTESIAN_POINT('',(25.,0.,0.));
#350=CARTESIAN_POINT('Origin',(25.,0.,25.));
#351=CARTESIAN_POINT('',(25.,15.,0.));
#352=CARTESIAN_POINT('Origin',(25.,15.,25.));
#353=CARTESIAN_POINT('',(25.,0.,0.));
#354=CARTESIAN_POINT('Origin',(125.,0.,0.));
#355=CARTESIAN_POINT('',(125.,0.,0.));
#356=CARTESIAN_POINT('',(25.,0.,0.));
#357=CARTESIAN_POINT('',(125.,15.,0.));
#358=CARTESIAN_POINT('',(25.,15.,0.));
#359=CARTESIAN_POINT('',(125.,0.,0.));
#360=CARTESIAN_POINT('Origin',(125.,0.,25.));
#361=CARTESIAN_POINT('Origin',(125.,0.,25.));
#362=CARTESIAN_POINT('Origin',(125.,15.,25.));
#363=CARTESIAN_POINT('Origin',(75.,15.,25.));
#364=CARTESIAN_POINT('Origin',(75.,0.,25.));
#365=CARTESIAN_POINT('Origin',(25.,15.,25.));
#366=CARTESIAN_POINT('',(25.,15.,50.));
#367=CARTESIAN_POINT('',(25.,15.,0.));
#368=CARTESIAN_POINT('',(25.,15.,25.));
#369=CARTESIAN_POINT('Origin',(25.,15.,25.));
#370=CARTESIAN_POINT('Origin',(25.,15.,25.));
#371=CARTESIAN_POINT('',(125.,15.,50.));
#372=CARTESIAN_POINT('',(25.,15.,50.));
#373=CARTESIAN_POINT('',(125.,15.,0.));
#374=CARTESIAN_POINT('Origin',(125.,15.,25.));
#375=CARTESIAN_POINT('',(25.,15.,0.));
#376=CARTESIAN_POINT('Origin',(125.,15.,25.));
#377=CARTESIAN_POINT('',(125.,15.,25.));
#378=CARTESIAN_POINT('Origin',(75.,15.,25.));
#379=CARTESIAN_POINT('Origin',(125.,15.,25.));
#380=CARTESIAN_POINT('',(125.,15.,50.));
#381=CARTESIAN_POINT('',(125.,15.,0.));
#382=CARTESIAN_POINT('',(125.,15.,25.));
#383=CARTESIAN_POINT('Origin',(125.,15.,25.));
#384=CARTESIAN_POINT('Origin',(125.,15.,25.));
#385=CARTESIAN_POINT('',(142.677669529664,15.,7.32233047033631));
#386=CARTESIAN_POINT('Origin',(125.,15.,25.));
#387=CARTESIAN_POINT('Origin',(125.,15.,25.));
#388=CARTESIAN_POINT('',(139.433756729741,29.4337567297406,39.4337567297406));
#389=CARTESIAN_POINT('Origin',(125.,15.,25.));
#390=CARTESIAN_POINT('Origin',(137.5,15.,25.));
#391=CARTESIAN_POINT('Origin',(25.,15.,25.));
#392=CARTESIAN_POINT('',(25.,15.,50.));
#393=CARTESIAN_POINT('',(25.,15.,0.));
#394=CARTESIAN_POINT('Origin',(25.,15.,25.));
#395=CARTESIAN_POINT('Origin',(25.,15.,25.));
#396=CARTESIAN_POINT('Origin',(25.,15.,25.));
#397=CARTESIAN_POINT('',(25.,15.,25.));
#398=CARTESIAN_POINT('Origin',(12.5,15.,25.));
#399=UNCERTAINTY_MEASURE_WITH_UNIT(LENGTH_MEASURE(0.01),#403,
'DISTANCE_ACCURACY_VALUE',
'Maximum model space distance between geometric entities at asserted c
onnectivities');
#400=UNCERTAINTY_MEASURE_WITH_UNIT(LENGTH_MEASURE(0.01),#403,
'DISTANCE_ACCURACY_VALUE',
'Maximum model space distance between geometric entities at asserted c
onnectivities');
#401=(
GEOMETRIC_REPRESENTATION_CONTEXT(3)
GLOBAL_UNCERTAINTY_ASSIGNED_CONTEXT((#399))
GLOBAL_UNIT_ASSIGNED_CONTEXT((#403,#405,#406))
REPRESENTATION_CONTEXT('','3D')
);
#402=(
GEOMETRIC_REPRESENTATION_CONTEXT(3)
GLOBAL_UNCERTAINTY_ASSIGNED_CONTEXT((#400))
GLOBAL_UNIT_ASSIGNED_CONTEXT((#403,#405,#406))
REPRESENTATION_CONTEXT('','3D')
);
#403=(
LENGTH_UNIT()
NAMED_UNIT(*)
SI_UNIT(.MILLI.,.METRE.)
);
#404=(
LENGTH_UNIT()
NAMED_UNIT(*)
SI_UNIT($,.METRE.)
);
#405=(
NAMED_UNIT(*)
PLANE_ANGLE_UNIT()
SI_UNIT($,.RADIAN.)
);
#406=(
NAMED_UNIT(*)
SI_UNIT($,.STERADIAN.)
SOLID_ANGLE_UNIT()
);
#407=SHAPE_DEFINITION_REPRESENTATION(#408,#409);
#408=PRODUCT_DEFINITION_SHAPE('',$,#411);
#409=SHAPE_REPRESENTATION('',(#237),#401);
#410=PRODUCT_DEFINITION_CONTEXT('part definition',#415,'design');
#411=PRODUCT_DEFINITION('Lamp2','Lamp2 v2',#412,#410);
#412=PRODUCT_DEFINITION_FORMATION('',$,#417);
#413=PRODUCT_RELATED_PRODUCT_CATEGORY('Lamp2 v2','Lamp2 v2',(#417));
#414=APPLICATION_PROTOCOL_DEFINITION('international standard',
'automotive_design',2009,#415);
#415=APPLICATION_CONTEXT(
'Core Data for Automotive Mechanical Design Process');
#416=PRODUCT_CONTEXT('part definition',#415,'mechanical');
#417=PRODUCT('Lamp2','Lamp2 v2',$,(#416));
#418=PRESENTATION_STYLE_ASSIGNMENT((#421));
#419=PRESENTATION_STYLE_ASSIGNMENT((#422));
#420=PRESENTATION_STYLE_ASSIGNMENT((#423));
#421=SURFACE_STYLE_USAGE(.BOTH.,#424);
#422=SURFACE_STYLE_USAGE(.BOTH.,#425);
#423=SURFACE_STYLE_USAGE(.BOTH.,#426);
#424=SURFACE_SIDE_STYLE('',(#427));
#425=SURFACE_SIDE_STYLE('',(#428));
#426=SURFACE_SIDE_STYLE('',(#429));
#427=SURFACE_STYLE_FILL_AREA(#430);
#428=SURFACE_STYLE_FILL_AREA(#431);
#429=SURFACE_STYLE_FILL_AREA(#432);
#430=FILL_AREA_STYLE('Steel - Satin',(#433));
#431=FILL_AREA_STYLE('Rubber - Soft',(#434));
#432=FILL_AREA_STYLE('Plastic - Translucent Glossy (Gray)',(#435));
#433=FILL_AREA_STYLE_COLOUR('Steel - Satin',#436);
#434=FILL_AREA_STYLE_COLOUR('Rubber - Soft',#437);
#435=FILL_AREA_STYLE_COLOUR('Plastic - Translucent Glossy (Gray)',#438);
#436=COLOUR_RGB('Steel - Satin',0.627450980392157,0.627450980392157,0.627450980392157);
#437=COLOUR_RGB('Rubber - Soft',0.152941176470588,0.152941176470588,0.152941176470588);
#438=COLOUR_RGB('Plastic - Translucent Glossy (Gray)',0.701960784313725,
0.701960784313725,0.701960784313725);
ENDSEC;
END-ISO-10303-21;
