EESchema Schematic File Version 4
LIBS:numid-cache
EELAYER 29 0
EELAYER END
$Descr A4 11693 8268
encoding utf-8
Sheet 1 1
Title ""
Date ""
Rev ""
Comp ""
Comment1 ""
Comment2 ""
Comment3 ""
Comment4 ""
$EndDescr
$Comp
L fab:NMOSFETSOT23 T1
U 1 1 5CEEEE05
P 4500 3250
F 0 "T1" H 4608 3292 45  0000 L CNN
F 1 "NMOSFETSOT23" H 4608 3208 45  0000 L CNN
F 2 "fab-SOT-23" H 4530 3400 20  0001 C CNN
F 3 "" H 4500 3250 50  0001 C CNN
	1    4500 3250
	1    0    0    -1  
$EndComp
$Comp
L Connector:Conn_01x02_Male battery1
U 1 1 5CEE645C
P 1700 2100
F 0 "battery1" V 1762 2144 50  0000 L CNN
F 1 "Conn_01x02_Male" V 1853 2144 50  0000 L CNN
F 2 "fab:fab-LED1206FAB" H 1700 2100 50  0001 C CNN
F 3 "~" H 1700 2100 50  0001 C CNN
	1    1700 2100
	0    1    1    0   
$EndComp
$Comp
L fab:RES-US1206FAB R1
U 1 1 5CEEAA63
P 1550 4900
F 0 "R1" H 1550 5094 45  0000 C CNN
F 1 "RES-US1206FAB" H 1550 5010 45  0000 C CNN
F 2 "fab-R1206FAB" H 1580 5050 20  0001 C CNN
F 3 "" H 1550 4900 50  0001 C CNN
	1    1550 4900
	1    0    0    -1  
$EndComp
$Comp
L fab:CAP-UNPOLARIZEDFAB C1
U 1 1 5CEEBB8C
P 1500 3550
F 0 "C1" H 1450 3764 45  0000 C CNN
F 1 "CAP-UNPOLARIZEDFAB" H 1450 3680 45  0000 C CNN
F 2 "fab-C1206FAB" H 1530 3700 20  0001 C CNN
F 3 "" H 1500 3550 50  0001 C CNN
	1    1500 3550
	0    -1   -1   0   
$EndComp
$Comp
L fab:AVRISPSMD FABISP1
U 1 1 5CEED2B1
P 7400 4200
F 0 "FABISP1" H 7498 4554 45  0000 C CNN
F 1 "AVRISPSMD" H 7498 4470 45  0000 C CNN
F 2 "fab-2X03SMD" H 7430 4350 20  0001 C CNN
F 3 "" H 7400 4200 50  0001 C CNN
	1    7400 4200
	1    0    0    -1  
$EndComp
$Comp
L Connector:Conn_01x02_Male airpump1
U 1 1 5CEEECFB
P 4550 2000
F 0 "airpump1" V 4612 2044 50  0000 L CNN
F 1 "Conn_01x02_Male" V 4703 2044 50  0000 L CNN
F 2 "fab:fab-LED1206FAB" H 4550 2000 50  0001 C CNN
F 3 "~" H 4550 2000 50  0001 C CNN
	1    4550 2000
	0    1    1    0   
$EndComp
$Comp
L fab:ATTINY45SI M2
U 1 1 5CEE4DDC
P 4900 4250
F 0 "M2" H 4550 4615 45  0000 C CNN
F 1 "ATTINY45SI" H 4900 4250 45  0001 L BNN
F 2 "fab-SOIC8" H 4930 4400 20  0001 C CNN
F 3 "" H 4900 4250 50  0001 C CNN
	1    4900 4250
	1    0    0    -1  
$EndComp
Wire Wire Line
	7300 4100 6700 4100
Wire Wire Line
	6700 4100 6700 4250
Wire Wire Line
	6700 4250 6300 4250
Wire Wire Line
	7300 4200 6300 4200
Wire Wire Line
	6300 4200 6300 4150
Wire Wire Line
	7600 4100 7600 3700
Wire Wire Line
	7600 3700 6450 3700
Wire Wire Line
	6450 3700 6450 3750
Wire Wire Line
	6450 4050 6300 4050
Wire Wire Line
	7600 4300 7600 4650
Wire Wire Line
	7600 4650 2800 4650
Wire Wire Line
	2800 4650 2800 4350
Wire Wire Line
	7300 4300 6850 4300
Wire Wire Line
	6850 4300 6850 4750
Wire Wire Line
	6850 4750 2400 4750
Wire Wire Line
	2400 4750 2400 4050
Wire Wire Line
	2400 4050 2800 4050
Wire Wire Line
	7600 4200 7750 4200
Wire Wire Line
	7750 4200 7750 4900
Wire Wire Line
	7750 4900 6550 4900
Wire Wire Line
	6550 4900 6550 4350
Wire Wire Line
	6550 4350 6300 4350
Wire Wire Line
	2150 4800 2150 4050
Wire Wire Line
	2150 4050 2400 4050
Connection ~ 2400 4050
Wire Wire Line
	2150 4800 2000 4800
Wire Wire Line
	2000 4800 2000 4900
Wire Wire Line
	2000 4900 1750 4900
Wire Wire Line
	1350 4900 1100 4900
Wire Wire Line
	1100 4900 1100 3750
Wire Wire Line
	1100 3750 1500 3750
Connection ~ 6450 3750
Wire Wire Line
	6450 3750 6450 4050
Connection ~ 1500 3750
Wire Wire Line
	1500 3750 2600 3750
Text GLabel 2800 4450 0    50   Input ~ 0
ground
Text GLabel 2150 3750 0    50   Input ~ 0
vcc
Text GLabel 1500 3450 0    50   Input ~ 0
ground
Text GLabel 4500 3450 0    50   Input ~ 0
ground
Wire Wire Line
	6300 4250 5100 4250
Wire Wire Line
	4200 2600 4200 3350
Wire Wire Line
	4200 3350 4300 3350
Connection ~ 6300 4250
Wire Wire Line
	4500 3050 4550 3050
Wire Wire Line
	5100 2600 4200 2600
Wire Wire Line
	2300 4150 2800 4150
Wire Wire Line
	1600 3050 2600 3050
Wire Wire Line
	2600 3050 2600 3750
Wire Wire Line
	1600 2300 1600 3050
Connection ~ 2600 3750
Wire Wire Line
	2600 3750 2950 3750
Wire Wire Line
	1700 2750 3800 2750
Wire Wire Line
	3800 2750 3800 3550
Wire Wire Line
	3800 3550 4500 3550
Wire Wire Line
	4500 3550 4500 3450
Wire Wire Line
	1700 2300 1700 2750
Wire Wire Line
	4450 2200 2950 2200
Wire Wire Line
	2950 2200 2950 3750
Connection ~ 2950 3750
Wire Wire Line
	2950 3750 6450 3750
Wire Wire Line
	4550 2200 4550 3050
$Comp
L fab:RES-US1206FAB jumper1
U 1 1 5CF2FB71
P 1050 5600
F 0 "jumper1" H 1050 5794 45  0000 C CNN
F 1 "RES-US1206FAB" H 1050 5710 45  0000 C CNN
F 2 "fab-R1206FAB" H 1080 5750 20  0001 C CNN
F 3 "" H 1050 5600 50  0001 C CNN
	1    1050 5600
	0    1    1    0   
$EndComp
Wire Wire Line
	5100 2600 5100 2800
$Comp
L fab:RES-US1206FAB jumper2
U 1 1 5CF2FFF4
P 5100 3000
F 0 "jumper2" V 5058 3068 45  0000 L CNN
F 1 "RES-US1206FAB" V 5142 3068 45  0000 L CNN
F 2 "fab-R1206FAB" H 5130 3150 20  0001 C CNN
F 3 "" H 5100 3000 50  0001 C CNN
	1    5100 3000
	0    1    1    0   
$EndComp
Wire Wire Line
	5100 3200 5100 4250
Text GLabel 1050 5800 0    50   Input ~ 0
ground
Text GLabel 1050 5400 0    50   Input ~ 0
ground
Wire Wire Line
	2250 5800 2250 5950
Connection ~ 2250 5800
Wire Wire Line
	2250 5650 2250 5800
Wire Wire Line
	2250 6350 2250 6450
Text GLabel 2250 6450 0    50   Input ~ 0
ground
Wire Wire Line
	2250 5100 2250 5350
Text GLabel 2250 5100 0    50   Input ~ 0
vcc
$Comp
L Sensor_Optical:LDR03 R2
U 1 1 5CF4A009
P 2250 5500
F 0 "R2" H 2320 5546 50  0000 L CNN
F 1 "LDR03" H 2320 5455 50  0000 L CNN
F 2 "fab:fab-R1206FAB" V 2425 5500 50  0001 C CNN
F 3 "http://www.elektronica-componenten.nl/WebRoot/StoreNL/Shops/61422969/54F1/BA0C/C664/31B9/2173/C0A8/2AB9/2AEF/LDR03IMP.pdf" H 2250 5450 50  0001 C CNN
	1    2250 5500
	1    0    0    -1  
$EndComp
$Comp
L fab:RES-US1206FAB R3
U 1 1 5CEEB214
P 2250 6150
F 0 "R3" H 2250 6344 45  0000 C CNN
F 1 "RES-US1206FAB" H 2250 6260 45  0000 C CNN
F 2 "fab-R1206FAB" H 2280 6300 20  0001 C CNN
F 3 "" H 2250 6150 50  0001 C CNN
	1    2250 6150
	0    -1   -1   0   
$EndComp
Wire Wire Line
	2300 4150 2300 5000
Wire Wire Line
	2300 5000 2700 5000
Wire Wire Line
	2700 5000 2700 5800
Wire Wire Line
	2250 5800 2700 5800
$EndSCHEMATC
