{
  "JupyterApp": {
    "kernel_spec_manager_class": "nb_conda_kernels.CondaKernelSpecManager"
  },
  "CondaKernelSpecManager": {
    "name_format": "{display_name} {1}",
    "conda_only": true 
  }
}
