{
 "argv": [
  "/opt/conda/envs/kernel-creation/bin/envkernel",
  "singularity",
  "run",
  "--connection-file",
  "{connection_file}",
  "/home/jasbru/code/scisw/jupyterhub/jnbv/apptainer/sif-img-files/hdf5-kernel.sif",
  "--nv",
  "--",
  "python",
  "-m",
  "ipykernel_launcher",
  "-f",
  "{connection_file}"
 ],
 "display_name": "Display Name Goes Here",
 "language": "python"
}