digraph G {
"map" -> "odom"[label="Broadcaster: /map_to_odom\nAverage rate: 33.338 Hz\nMost recent transform: 1702503952.416 ( -0.023 sec old)\nBuffer length: 4.949 sec\n"];
"base_link" -> "laser_frame"[label="Broadcaster: /base_link_to_laser\nAverage rate: 33.334 Hz\nMost recent transform: 1702503952.396 ( -0.003 sec old)\nBuffer length: 4.920 sec\n"];
"base_footprint" -> "base_link"[label="Broadcaster: /base_link_broadcaster\nAverage rate: 33.340 Hz\nMost recent transform: 1702503952.397 ( -0.005 sec old)\nBuffer length: 4.919 sec\n"];
edge [style=invis];
 subgraph cluster_legend { style=bold; color=black; label ="view_frames Result";
"Recorded at time: 1702503952.393"[ shape=plaintext ] ;
 }->"map";
edge [style=invis];
 subgraph cluster_legend { style=bold; color=black; label ="view_frames Result";
"Recorded at time: 1702503952.393"[ shape=plaintext ] ;
 }->"base_footprint";
}