{
    "layout": {
      "direction": "row",
      "first": {
        "first": "3D Panel!309p5r8",
        "second": {
          "first": "RosOut!3j8mhuh",
          "second": "DiagnosticStatusPanel!49o9wd0",
          "direction": "row"
        },
        "direction": "column"
      },
      "second": {
        "direction": "column",
        "second": {
          "direction": "row",
          "first": {
            "direction": "column",
            "first": {
              "first": "RawMessages!ccfryf",
              "second": "RawMessages!2lzrjgq",
              "direction": "row",
              "splitPercentage": 20.028015749394264
            },
            "second": {
              "first": "RawMessages!dkknw6",
              "second": "RawMessages!31f2gvt",
              "direction": "row"
            }
          },
          "second": {
            "direction": "row",
            "first": {
              "direction": "column",
              "first": "RawMessages!4h1ystt",
              "second": "RawMessages!1try5iw"
            },
            "second": {
              "direction": "column",
              "first": "RawMessages!dih3yh",
              "second": "RawMessages!pyiitu"
            }
          }
        },
        "first": {
          "direction": "row",
          "first": "ImageViewPanel!vn68db",
          "second": "ImageViewPanel!11znhpo"
        },
        "splitPercentage": 67.01112877583466
      },
      "splitPercentage": 51.091924834941594
    },
    "savedProps": {
      "3D Panel!309p5r8": {
        "checkedNodes": [
          "/cloud_nodelet/parameter_descriptions",
          "/cloud_nodelet/parameter_updates",
          "/diagnostics",
          "/diagnostics_agg",
          "/diagnostics_toplevel_state",
          "/rosout",
          "/tf",
          "name:TF",
          "name:Topics",
          "t:/scan",
          "x:TF.base_link",
          "x:TF.laser_link"
        ],
        "expandedNodes": [
          "name:TF",
          "name:Topics"
        ],
        "followTf": "base_link",
        "cameraState": {
          "targetOffset": [
            0.4035268031306699,
            0.6222230536499633,
            0
          ],
          "distance": 2.209083871250775,
          "perspective": true,
          "phi": 0.9406585884381743,
          "thetaOffset": -3.5205119587615714,
          "fovy": 0.7853981633974483,
          "near": 0.01,
          "far": 5000
        },
        "modifiedNamespaceTopics": [],
        "pinTopics": false,
        "topicSettings": {
          "/velodyne_points": {
            "colorField": "ring",
            "pointShape": "circle",
            "colorMode": {
              "mode": "rainbow",
              "colorField": "ring"
            },
            "pointSize": 2
          }
        },
        "followOrientation": false
      },
      "RosOut!3j8mhuh": {
        "searchTerms": [],
        "minLogLevel": 1,
        "topicToRender": "/rosout"
      },
      "DiagnosticStatusPanel!49o9wd0": {
        "topicToRender": "/diagnostics",
        "selectedHardwareId": "",
        "selectedName": "rosserial_python",
        "splitFraction": 0.5949617346938776
      },
      "ImageViewPanel!vn68db": {
        "cameraTopic": "/camera/processed0",
        "enabledMarkerNames": [],
        "scale": 0.2,
        "transformMarkers": true,
        "synchronize": false,
        "mode": "fit",
        "zoomPercentage": 73.4375,
        "offset": [
          -0.46875,
          123.75
        ]
      },
      "ImageViewPanel!11znhpo": {
        "cameraTopic": "/camera/processed1",
        "enabledMarkerNames": [],
        "scale": 0.2,
        "transformMarkers": true,
        "synchronize": false,
        "mode": "fit",
        "zoomPercentage": 73.4375,
        "offset": [
          -0.46875,
          123.75
        ]
      },
      "RawMessages!ccfryf": {
        "topicName": "/motors/left/control/speed",
        "diffTopicName": ""
      },
      "RawMessages!2lzrjgq": {
        "topicName": "/motors/left/feedback/encoder",
        "diffTopicName": ""
      },
      "RawMessages!dkknw6": {
        "topicName": "/motors/right/control/speed",
        "diffTopicName": ""
      },
      "RawMessages!31f2gvt": {
        "topicName": "/motors/right/feedback/encoder",
        "diffTopicName": ""
      },
      "RawMessages!4h1ystt": {
        "topicName": "/motors/left/control/vel_target",
        "diffTopicName": ""
      },
      "RawMessages!1try5iw": {
        "topicName": "/motors/right/control/vel_target",
        "diffTopicName": ""
      },
      "RawMessages!dih3yh": {
        "topicName": "/motors/left/control/vel",
        "diffTopicName": ""
      },
      "RawMessages!pyiitu": {
        "topicName": "/motors/right/control/vel",
        "diffTopicName": ""
      }
    },
    "globalVariables": {},
    "userNodes": {},
    "linkedGlobalVariables": [],
    "playbackConfig": {
      "speed": 0.5
    }
  }