{
  "name": "MAI Robotics DEV",

  // Sets the run context to one level up instead of the .devcontainer folder.
  "context": "..",

  // Update the 'dockerFile' property if you aren't using the standard 'Dockerfile' filename.
  "dockerFile": "Dockerfile",

  "runArgs": [
    "--cap-add=SYS_PTRACE",
    "--security-opt",
    "seccomp=unconfined",
    "-e DISPLAY=$DISPLAY",
    "--network=ros"
  ],

  // Uncomment the next line to use Docker from inside the container. See https://aka.ms/vscode-remote/samples/docker-in-docker for details.
  "mounts": [
    "source=/var/run/docker.sock,target=/var/run/docker.sock,type=bind",
    "source=${localEnv:HOME}/.ssh,target=/root/.ssh,type=bind,consistency=cached"
  ],

  "settings": {},

  // Use 'appPort' to create a container with published ports. If the port isn't working, be sure
  // your server accepts connections from all interfaces (0.0.0.0 or '*'), not just localhost.
  "appPort": [],

  // Add the IDs of extensions you want installed when the container is created in the array below.
  "extensions": [
    "hookyqr.beautify",
    "michelemelluso.code-beautifier",
    "ms-vscode.cpptools",
    "jaycetyle.vscode-gnu-global",
    "austin.code-gnu-global",
    "twxs.cmake",
    "go2sh.cmake-integration-vscode",
    "ms-vscode.cmake-tools",
    "maddouri.cmake-tools-helper",
    "cheshirekow.cmake-format",
    "dizoft.format-astyle",
    "donjayamanne.githistory",
    "felipecaputo.git-project-manager",
    "eamodio.gitlens",
    "ecmel.vscode-html-css",
    "esbenp.prettier-vscode",
    "ms-python.python",
    "ms-iot.vscode-ros"
  ]
}
