#-----------------------------------------------------------
# Webtalk v2018.2 (64-bit)
# SW Build 2258646 on Thu Jun 14 20:02:38 MDT 2018
# IP Build 2256618 on Thu Jun 14 22:10:49 MDT 2018
# Start of session at: Sun Mar 31 20:21:05 2019
# Process ID: 3037
# Current directory: /home/tanisha/Downloads/ext_count4/ext_count4.sim/sim_1/behav/xsim
# Command line: wbtcv -mode batch -source /home/tanisha/Downloads/ext_count4/ext_count4.sim/sim_1/behav/xsim/xsim.dir/fsmsim_behav/webtalk/xsim_webtalk.tcl -notrace
# Log file: /home/tanisha/Downloads/ext_count4/ext_count4.sim/sim_1/behav/xsim/webtalk.log
# Journal file: /home/tanisha/Downloads/ext_count4/ext_count4.sim/sim_1/behav/xsim/webtalk.jou
#-----------------------------------------------------------
source /home/tanisha/Downloads/ext_count4/ext_count4.sim/sim_1/behav/xsim/xsim.dir/fsmsim_behav/webtalk/xsim_webtalk.tcl -notrace
webtalk_transmit: Time (s): cpu = 00:00:00.68 ; elapsed = 00:00:06 . Memory (MB): peak = 302.852 ; gain = 0.000 ; free physical = 11971 ; free virtual = 29513
INFO: [Common 17-206] Exiting Webtalk at Sun Mar 31 20:21:11 2019...
