%!PS-Adobe-3.0 EPSF-3.0
%%Creator: (Apache XML Graphics Commons: EPS Generator for Java2D)
%%CreationDate: 2017-05-06T15:52:37
%%Pages: (atend)
%%BoundingBox: 0 0 610 460
%%LanguageLevel: 3
%%EndComments
%%BeginProlog
%%BeginResource: procset (Apache XML Graphics Std ProcSet) 1.2 0
%%Version: 1.2 0
%%Copyright: (Copyright 2001-2003,2010 The Apache Software Foundation. License terms: http://www.apache.org/licenses/LICENSE-2.0)
%%Title: (Basic set of procedures used by the XML Graphics project \(Batik and FOP\))
/bd{bind def}bind def
/ld{load def}bd
/GR/grestore ld
/GS/gsave ld
/RM/rmoveto ld
/C/curveto ld
/t/show ld
/L/lineto ld
/ML/setmiterlimit ld
/CT/concat ld
/f/fill ld
/N/newpath ld
/S/stroke ld
/CC/setcmykcolor ld
/A/ashow ld
/cp/closepath ld
/RC/setrgbcolor ld
/LJ/setlinejoin ld
/GC/setgray ld
/LW/setlinewidth ld
/M/moveto ld
/re {4 2 roll M
1 index 0 rlineto
0 exch rlineto
neg 0 rlineto
cp } bd
/_ctm matrix def
/_tm matrix def
/BT { _ctm currentmatrix pop matrix _tm copy pop 0 0 moveto } bd
/ET { _ctm setmatrix } bd
/iTm { _ctm setmatrix _tm concat } bd
/Tm { _tm astore pop iTm 0 0 moveto } bd
/ux 0.0 def
/uy 0.0 def
/F {
  /Tp exch def
  /Tf exch def
  Tf findfont Tp scalefont setfont
  /cf Tf def  /cs Tp def
} bd
/ULS {currentpoint /uy exch def /ux exch def} bd
/ULE {
  /Tcx currentpoint pop def
  gsave
  newpath
  cf findfont cs scalefont dup
  /FontMatrix get 0 get /Ts exch def /FontInfo get dup
  /UnderlinePosition get Ts mul /To exch def
  /UnderlineThickness get Ts mul /Tt exch def
  ux uy To add moveto  Tcx uy To add lineto
  Tt setlinewidth stroke
  grestore
} bd
/OLE {
  /Tcx currentpoint pop def
  gsave
  newpath
  cf findfont cs scalefont dup
  /FontMatrix get 0 get /Ts exch def /FontInfo get dup
  /UnderlinePosition get Ts mul /To exch def
  /UnderlineThickness get Ts mul /Tt exch def
  ux uy To add cs add moveto Tcx uy To add cs add lineto
  Tt setlinewidth stroke
  grestore
} bd
/SOE {
  /Tcx currentpoint pop def
  gsave
  newpath
  cf findfont cs scalefont dup
  /FontMatrix get 0 get /Ts exch def /FontInfo get dup
  /UnderlinePosition get Ts mul /To exch def
  /UnderlineThickness get Ts mul /Tt exch def
  ux uy To add cs 10 mul 26 idiv add moveto Tcx uy To add cs 10 mul 26 idiv add lineto
  Tt setlinewidth stroke
  grestore
} bd
/QT {
/Y22 exch store
/X22 exch store
/Y21 exch store
/X21 exch store
currentpoint
/Y21 load 2 mul add 3 div exch
/X21 load 2 mul add 3 div exch
/X21 load 2 mul /X22 load add 3 div
/Y21 load 2 mul /Y22 load add 3 div
/X22 load /Y22 load curveto
} bd
/SSPD {
dup length /d exch dict def
{
/v exch def
/k exch def
currentpagedevice k known {
/cpdv currentpagedevice k get def
v cpdv ne {
/upd false def
/nullv v type /nulltype eq def
/nullcpdv cpdv type /nulltype eq def
nullv nullcpdv or
{
/upd true def
} {
/sametype v type cpdv type eq def
sametype {
v type /arraytype eq {
/vlen v length def
/cpdvlen cpdv length def
vlen cpdvlen eq {
0 1 vlen 1 sub {
/i exch def
/obj v i get def
/cpdobj cpdv i get def
obj cpdobj ne {
/upd true def
exit
} if
} for
} {
/upd true def
} ifelse
} {
v type /dicttype eq {
v {
/dv exch def
/dk exch def
/cpddv cpdv dk get def
dv cpddv ne {
/upd true def
exit
} if
} forall
} {
/upd true def
} ifelse
} ifelse
} if
} ifelse
upd true eq {
d k v put
} if
} if
} if
} forall
d length 0 gt {
d setpagedevice
} if
} bd
/RE { % /NewFontName [NewEncodingArray] /FontName RE -
  findfont dup length dict begin
  {
    1 index /FID ne
    {def} {pop pop} ifelse
  } forall
  /Encoding exch def
  /FontName 1 index def
  currentdict definefont pop
  end
} bind def
%%EndResource
%%BeginResource: procset (Apache XML Graphics EPS ProcSet) 1.0 0
%%Version: 1.0 0
%%Copyright: (Copyright 2002-2003 The Apache Software Foundation. License terms: http://www.apache.org/licenses/LICENSE-2.0)
%%Title: (EPS procedures used by the Apache XML Graphics project \(Batik and FOP\))
/BeginEPSF { %def
/b4_Inc_state save def         % Save state for cleanup
/dict_count countdictstack def % Count objects on dict stack
/op_count count 1 sub def      % Count objects on operand stack
userdict begin                 % Push userdict on dict stack
/showpage { } def              % Redefine showpage, { } = null proc
0 setgray 0 setlinecap         % Prepare graphics state
1 setlinewidth 0 setlinejoin
10 setmiterlimit [ ] 0 setdash newpath
/languagelevel where           % If level not equal to 1 then
{pop languagelevel             % set strokeadjust and
1 ne                           % overprint to their defaults.
{false setstrokeadjust false setoverprint
} if
} if
} bd
/EndEPSF { %def
count op_count sub {pop} repeat            % Clean up stacks
countdictstack dict_count sub {end} repeat
b4_Inc_state restore
} bd
%%EndResource
%%EndProlog
%%Page: 1 1
%%PageBoundingBox: 0 0 610 460
%%BeginPageSetup
%%PageOrientation: Portrait
/ReEncode { /MyEncoding exch def exch findfont dup length dict begin {def} forall /Encoding MyEncoding def currentdict end definefont } def
/Helvetica /HelveticaLatin1 ISOLatin1Encoding ReEncode
/Times /TimesLatin1 ISOLatin1Encoding ReEncode
/DP {/Points exch def Points 0 get Points 1 get M 2 2 Points length 1 sub {/i exch def Points i get Points i 1 add get L}for} def
[1 0 0 -1 0 460] CT
%%EndPageSetup
GS
1 GC
N
0 0 610 460 re
f
GR
GS
1 GC
N
533.75 57.5 M
533.75 402.5 L
76.25 57.5 L
cp
f
GR
GS
1 GC
N
533.75 402.5 M
76.25 402.5 L
76.25 57.5 L
cp
f
GR
GS
1 GC
N
533.75 57.5 M
533.75 402.5 L
533.75 402.5 L
cp
f
GR
GS
1 GC
N
76.25 57.5 M
76.25 402.5 L
76.25 402.5 L
cp
f
GR
GS
1 GC
N
/f-1296051243{533.75 57.5 M
533.75 402.5 L
76.25 57.5 L
cp}def
f-1296051243
f
GR
GS
1 GC
N
/f-1921456228{533.75 402.5 M
76.25 402.5 L
76.25 57.5 L
cp}def
f-1921456228
f
GR
GS
1 GC
N
/f2146031872{533.75 57.5 M
533.75 57.5 L
533.75 402.5 L
cp}def
f2146031872
f
GR
GS
1 GC
N
/f-1836069955{76.25 57.5 M
76.25 57.5 L
76.25 402.5 L
cp}def
f-1836069955
f
GR
GS
1 GC
N
/f778255765{533.75 57.5 M
76.25 57.5 L
533.75 57.5 L
cp}def
f778255765
f
GR
GS
1 GC
N
/f-1907896102{76.25 57.5 M
76.25 57.5 L
533.75 57.5 L
cp}def
f-1907896102
f
GR
GS
1 GC
N
/f554099999{533.75 402.5 M
76.25 402.5 L
533.75 402.5 L
cp}def
f554099999
f
GR
GS
1 GC
N
/f1234489274{76.25 402.5 M
76.25 402.5 L
533.75 402.5 L
cp}def
f1234489274
f
GR
0 GC
/HelveticaLatin1 10 F
GS
[1 0 0 1 72.25 411.5] CT
-0.656 9.282 M 1 -1 scale
(0) t
GR
/HelveticaLatin1 10 F
GS
[1 0 0 1 252.75 411.5] CT
-0.734 9.282 M 1 -1 scale
(20) t
GR
/HelveticaLatin1 10 F
GS
[1 0 0 1 435.25 411.5] CT
-0.484 9.282 M 1 -1 scale
(40) t
GR
/HelveticaLatin1 10 F
GS
[1 0 0 1 161.25 411.5] CT
-1.094 9.282 M 1 -1 scale
(10) t
GR
/HelveticaLatin1 10 F
GS
[1 0 0 1 344.25 411.5] CT
-0.766 9.282 M 1 -1 scale
(30) t
GR
/HelveticaLatin1 10 F
GS
[1 0 0 1 527.25 411.5] CT
-0.766 9.282 M 1 -1 scale
(50) t
GR
/HelveticaLatin1 10 F
GS
[1 0 0 1 118.5 411.5] CT
-0.766 9.282 M 1 -1 scale
(5) t
GR
/HelveticaLatin1 10 F
GS
[1 0 0 1 207 411.5] CT
-1.094 9.282 M 1 -1 scale
(15) t
GR
/HelveticaLatin1 10 F
GS
[1 0 0 1 298.5 411.5] CT
-0.734 9.282 M 1 -1 scale
(25) t
GR
/HelveticaLatin1 10 F
GS
[1 0 0 1 390 411.5] CT
-0.766 9.282 M 1 -1 scale
(35) t
GR
/HelveticaLatin1 10 F
GS
[1 0 0 1 481.5 411.5] CT
-0.484 9.282 M 1 -1 scale
(45) t
GR
GS
10.0 ML
N
[76.25 402.5 76.25 408.5] DP
S
GR
GS
10.0 ML
N
[122 402.5 122 408.5] DP
S
GR
GS
10.0 ML
N
[167.75 402.5 167.75 408.5] DP
S
GR
GS
10.0 ML
N
[213.5 402.5 213.5 408.5] DP
S
GR
GS
10.0 ML
N
[259.25 402.5 259.25 408.5] DP
S
GR
GS
10.0 ML
N
[305 402.5 305 408.5] DP
S
GR
GS
10.0 ML
N
[350.75 402.5 350.75 408.5] DP
S
GR
GS
10.0 ML
N
[396.5 402.5 396.5 408.5] DP
S
GR
GS
10.0 ML
N
[442.25 402.5 442.25 408.5] DP
S
GR
GS
10.0 ML
N
[488 402.5 488 408.5] DP
S
GR
GS
10.0 ML
N
[533.75 402.5 533.75 408.5] DP
S
GR
GS
10.0 ML
N
[76.25 402.5 76.25 405.5] DP
S
GR
GS
10.0 ML
N
[85.4 402.5 85.4 405.5] DP
S
GR
GS
10.0 ML
N
[94.55 402.5 94.55 405.5] DP
S
GR
GS
10.0 ML
N
[103.7 402.5 103.7 405.5] DP
S
GR
GS
10.0 ML
N
[112.85 402.5 112.85 405.5] DP
S
GR
GS
10.0 ML
N
[122 402.5 122 405.5] DP
S
GR
GS
10.0 ML
N
[131.15 402.5 131.15 405.5] DP
S
GR
GS
10.0 ML
N
[140.3 402.5 140.3 405.5] DP
S
GR
GS
10.0 ML
N
[149.45 402.5 149.45 405.5] DP
S
GR
GS
10.0 ML
N
[158.6 402.5 158.6 405.5] DP
S
GR
GS
10.0 ML
N
[167.75 402.5 167.75 405.5] DP
S
GR
GS
10.0 ML
N
[176.9 402.5 176.9 405.5] DP
S
GR
GS
10.0 ML
N
[186.05 402.5 186.05 405.5] DP
S
GR
GS
10.0 ML
N
[195.2 402.5 195.2 405.5] DP
S
GR
GS
10.0 ML
N
[204.35 402.5 204.35 405.5] DP
S
GR
GS
10.0 ML
N
[213.5 402.5 213.5 405.5] DP
S
GR
GS
10.0 ML
N
[222.65 402.5 222.65 405.5] DP
S
GR
GS
10.0 ML
N
[231.8 402.5 231.8 405.5] DP
S
GR
GS
10.0 ML
N
[240.95 402.5 240.95 405.5] DP
S
GR
GS
10.0 ML
N
[250.1 402.5 250.1 405.5] DP
S
GR
GS
10.0 ML
N
[259.25 402.5 259.25 405.5] DP
S
GR
GS
10.0 ML
N
[268.4 402.5 268.4 405.5] DP
S
GR
GS
10.0 ML
N
[277.55 402.5 277.55 405.5] DP
S
GR
GS
10.0 ML
N
[286.7 402.5 286.7 405.5] DP
S
GR
GS
10.0 ML
N
[295.85 402.5 295.85 405.5] DP
S
GR
GS
10.0 ML
N
[305 402.5 305 405.5] DP
S
GR
GS
10.0 ML
N
[314.15 402.5 314.15 405.5] DP
S
GR
GS
10.0 ML
N
[323.3 402.5 323.3 405.5] DP
S
GR
GS
10.0 ML
N
[332.45 402.5 332.45 405.5] DP
S
GR
GS
10.0 ML
N
[341.6 402.5 341.6 405.5] DP
S
GR
GS
10.0 ML
N
[350.75 402.5 350.75 405.5] DP
S
GR
GS
10.0 ML
N
[359.9 402.5 359.9 405.5] DP
S
GR
GS
10.0 ML
N
[369.05 402.5 369.05 405.5] DP
S
GR
GS
10.0 ML
N
[378.2 402.5 378.2 405.5] DP
S
GR
GS
10.0 ML
N
[387.35 402.5 387.35 405.5] DP
S
GR
GS
10.0 ML
N
[396.5 402.5 396.5 405.5] DP
S
GR
GS
10.0 ML
N
[405.65 402.5 405.65 405.5] DP
S
GR
GS
10.0 ML
N
[414.8 402.5 414.8 405.5] DP
S
GR
GS
10.0 ML
N
[423.95 402.5 423.95 405.5] DP
S
GR
GS
10.0 ML
N
[433.1 402.5 433.1 405.5] DP
S
GR
GS
10.0 ML
N
[442.25 402.5 442.25 405.5] DP
S
GR
GS
10.0 ML
N
[451.4 402.5 451.4 405.5] DP
S
GR
GS
10.0 ML
N
[460.55 402.5 460.55 405.5] DP
S
GR
GS
10.0 ML
N
[469.7 402.5 469.7 405.5] DP
S
GR
GS
10.0 ML
N
[478.85 402.5 478.85 405.5] DP
S
GR
GS
10.0 ML
N
[488 402.5 488 405.5] DP
S
GR
GS
10.0 ML
N
[497.15 402.5 497.15 405.5] DP
S
GR
GS
10.0 ML
N
[506.3 402.5 506.3 405.5] DP
S
GR
GS
10.0 ML
N
[515.45 402.5 515.45 405.5] DP
S
GR
GS
10.0 ML
N
[524.6 402.5 524.6 405.5] DP
S
GR
GS
10.0 ML
N
[533.75 402.5 533.75 405.5] DP
S
GR
GS
10.0 ML
N
[533.75 402.5 76.25 402.5] DP
S
GR
/HelveticaLatin1 10 F
GS
[1 0 0 1 50.25 281] CT
-0.656 9.282 M 1 -1 scale
(0.4) t
GR
/HelveticaLatin1 10 F
GS
[1 0 0 1 50.25 127.66667] CT
-0.656 9.282 M 1 -1 scale
(0.6) t
GR
/HelveticaLatin1 10 F
GS
[1 0 0 1 51.25 357.66667] CT
-0.656 9.282 M 1 -1 scale
(0.3) t
GR
/HelveticaLatin1 10 F
GS
[1 0 0 1 51.25 204.33333] CT
-0.656 9.282 M 1 -1 scale
(0.5) t
GR
/HelveticaLatin1 10 F
GS
[1 0 0 1 51.25 51] CT
-0.656 9.282 M 1 -1 scale
(0.7) t
GR
/HelveticaLatin1 10 F
GS
[1 0 0 1 45.25 396] CT
-0.656 9.282 M 1 -1 scale
(0.25) t
GR
/HelveticaLatin1 10 F
GS
[1 0 0 1 45.25 319.33333] CT
-0.656 9.282 M 1 -1 scale
(0.35) t
GR
/HelveticaLatin1 10 F
GS
[1 0 0 1 45.25 242.66667] CT
-0.656 9.282 M 1 -1 scale
(0.45) t
GR
/HelveticaLatin1 10 F
GS
[1 0 0 1 45.25 166] CT
-0.656 9.282 M 1 -1 scale
(0.55) t
GR
/HelveticaLatin1 10 F
GS
[1 0 0 1 45.25 89.33333] CT
-0.656 9.282 M 1 -1 scale
(0.65) t
GR
GS
10.0 ML
N
[76.25 402.5 70.25 402.5] DP
S
GR
GS
10.0 ML
N
[76.25 364.167 70.25 364.167] DP
S
GR
GS
10.0 ML
N
[76.25 325.833 70.25 325.833] DP
S
GR
GS
10.0 ML
N
[76.25 287.5 70.25 287.5] DP
S
GR
GS
10.0 ML
N
[76.25 249.167 70.25 249.167] DP
S
GR
GS
10.0 ML
N
[76.25 210.833 70.25 210.833] DP
S
GR
GS
10.0 ML
N
[76.25 172.5 70.25 172.5] DP
S
GR
GS
10.0 ML
N
[76.25 134.167 70.25 134.167] DP
S
GR
GS
10.0 ML
N
[76.25 95.833 70.25 95.833] DP
S
GR
GS
10.0 ML
N
[76.25 57.5 70.25 57.5] DP
S
GR
GS
10.0 ML
N
[76.25 57.5 76.25 402.5] DP
S
GR
/HelveticaLatin1 14 F
GS
[1 0 0 1 287.5 427.5] CT
0.625 14.995 M 1 -1 scale
(Proc) t
GR
/HelveticaLatin1 14 F
GS
[0 -1 1 0 20.25 263] CT
1.234 14.995 M 1 -1 scale
(seconde) t
GR
GS
N
76.245 57.497 M
533.755 57.497 L
533.755 402.503 L
76.245 402.503 L
76.245 57.497 L
cp
clip
1 0 0 RC
10.0 ML
N
[85.4 387.167 94.55 387.167 112.85 387.167 149.45 379.5 186.05 318.167 222.65 279.833 369.05 226.167 515.45 65.167] DP
S
GR
GS
0 0 1 RC
10.0 ML
N
[85.4 387.167 515.45 387.167] DP
S
GR
GS
10.0 ML
N
[76.25 402.5 76.25 57.5 76.25 57.5 533.75 57.5 533.75 402.5 533.75 402.5 76.25 402.5] DP
S
GR
GS
10.0 ML
N
[533.75 57.5 76.25 57.5] DP
S
GR
GS
10.0 ML
N
[533.75 57.5 533.75 402.5] DP
S
GR
GS
10.0 ML
N
[533.75 57.5 533.75 57.5] DP
S
GR
GS
1 GC
N
/f-2002728949{81.969 99.85 M
186.875 99.85 L
186.875 60.95 L
cp}def
f-2002728949
f
GR
GS
1 GC
N
/f141502322{81.969 99.85 M
186.875 60.95 L
81.969 60.95 L
cp}def
f141502322
f
GR
GS
10.0 ML
N
[81.969 99.85 186.875 99.85] DP
S
GR
GS
10.0 ML
N
[186.875 99.85 186.875 60.95] DP
S
GR
GS
10.0 ML
N
[186.875 60.95 81.969 60.95] DP
S
GR
GS
10.0 ML
N
[81.969 60.95 81.969 99.85] DP
S
GR
GS
0 0 1 RC
10.0 ML
N
[87.688 87.4 110.563 87.4 133.438 87.4] DP
S
GR
GS
1 0 0 RC
10.0 ML
N
[87.688 73.4 110.563 73.4 133.438 73.4] DP
S
GR
GS
[1 0 0 1 139.15626 64.4] CT
1 GC
N
0 0 42 32 re
f
GR
/HelveticaLatin1 10 F
GS
[1 0 0 1 139.15626 64.4] CT
1.094 11.282 M 1 -1 scale
(mesur\351) t
GR
/HelveticaLatin1 10 F
GS
[1 0 0 1 139.15626 64.4] CT
1.453 26.282 M 1 -1 scale
(optimal) t
GR
%%Trailer
%%Pages: 1
%%EOF
