%!PS-Adobe-3.0 EPSF-3.0
%%Creator: (Apache XML Graphics Commons: EPS Generator for Java2D)
%%CreationDate: 2017-05-09T02:12:18
%%Pages: (atend)
%%BoundingBox: 0 0 610 460
%%LanguageLevel: 3
%%EndComments
%%BeginProlog
%%BeginResource: procset (Apache XML Graphics Std ProcSet) 1.2 0
%%Version: 1.2 0
%%Copyright: (Copyright 2001-2003,2010 The Apache Software Foundation. License terms: http://www.apache.org/licenses/LICENSE-2.0)
%%Title: (Basic set of procedures used by the XML Graphics project \(Batik and FOP\))
/bd{bind def}bind def
/ld{load def}bd
/GR/grestore ld
/GS/gsave ld
/RM/rmoveto ld
/C/curveto ld
/t/show ld
/L/lineto ld
/ML/setmiterlimit ld
/CT/concat ld
/f/fill ld
/N/newpath ld
/S/stroke ld
/CC/setcmykcolor ld
/A/ashow ld
/cp/closepath ld
/RC/setrgbcolor ld
/LJ/setlinejoin ld
/GC/setgray ld
/LW/setlinewidth ld
/M/moveto ld
/re {4 2 roll M
1 index 0 rlineto
0 exch rlineto
neg 0 rlineto
cp } bd
/_ctm matrix def
/_tm matrix def
/BT { _ctm currentmatrix pop matrix _tm copy pop 0 0 moveto } bd
/ET { _ctm setmatrix } bd
/iTm { _ctm setmatrix _tm concat } bd
/Tm { _tm astore pop iTm 0 0 moveto } bd
/ux 0.0 def
/uy 0.0 def
/F {
  /Tp exch def
  /Tf exch def
  Tf findfont Tp scalefont setfont
  /cf Tf def  /cs Tp def
} bd
/ULS {currentpoint /uy exch def /ux exch def} bd
/ULE {
  /Tcx currentpoint pop def
  gsave
  newpath
  cf findfont cs scalefont dup
  /FontMatrix get 0 get /Ts exch def /FontInfo get dup
  /UnderlinePosition get Ts mul /To exch def
  /UnderlineThickness get Ts mul /Tt exch def
  ux uy To add moveto  Tcx uy To add lineto
  Tt setlinewidth stroke
  grestore
} bd
/OLE {
  /Tcx currentpoint pop def
  gsave
  newpath
  cf findfont cs scalefont dup
  /FontMatrix get 0 get /Ts exch def /FontInfo get dup
  /UnderlinePosition get Ts mul /To exch def
  /UnderlineThickness get Ts mul /Tt exch def
  ux uy To add cs add moveto Tcx uy To add cs add lineto
  Tt setlinewidth stroke
  grestore
} bd
/SOE {
  /Tcx currentpoint pop def
  gsave
  newpath
  cf findfont cs scalefont dup
  /FontMatrix get 0 get /Ts exch def /FontInfo get dup
  /UnderlinePosition get Ts mul /To exch def
  /UnderlineThickness get Ts mul /Tt exch def
  ux uy To add cs 10 mul 26 idiv add moveto Tcx uy To add cs 10 mul 26 idiv add lineto
  Tt setlinewidth stroke
  grestore
} bd
/QT {
/Y22 exch store
/X22 exch store
/Y21 exch store
/X21 exch store
currentpoint
/Y21 load 2 mul add 3 div exch
/X21 load 2 mul add 3 div exch
/X21 load 2 mul /X22 load add 3 div
/Y21 load 2 mul /Y22 load add 3 div
/X22 load /Y22 load curveto
} bd
/SSPD {
dup length /d exch dict def
{
/v exch def
/k exch def
currentpagedevice k known {
/cpdv currentpagedevice k get def
v cpdv ne {
/upd false def
/nullv v type /nulltype eq def
/nullcpdv cpdv type /nulltype eq def
nullv nullcpdv or
{
/upd true def
} {
/sametype v type cpdv type eq def
sametype {
v type /arraytype eq {
/vlen v length def
/cpdvlen cpdv length def
vlen cpdvlen eq {
0 1 vlen 1 sub {
/i exch def
/obj v i get def
/cpdobj cpdv i get def
obj cpdobj ne {
/upd true def
exit
} if
} for
} {
/upd true def
} ifelse
} {
v type /dicttype eq {
v {
/dv exch def
/dk exch def
/cpddv cpdv dk get def
dv cpddv ne {
/upd true def
exit
} if
} forall
} {
/upd true def
} ifelse
} ifelse
} if
} ifelse
upd true eq {
d k v put
} if
} if
} if
} forall
d length 0 gt {
d setpagedevice
} if
} bd
/RE { % /NewFontName [NewEncodingArray] /FontName RE -
  findfont dup length dict begin
  {
    1 index /FID ne
    {def} {pop pop} ifelse
  } forall
  /Encoding exch def
  /FontName 1 index def
  currentdict definefont pop
  end
} bind def
%%EndResource
%%BeginResource: procset (Apache XML Graphics EPS ProcSet) 1.0 0
%%Version: 1.0 0
%%Copyright: (Copyright 2002-2003 The Apache Software Foundation. License terms: http://www.apache.org/licenses/LICENSE-2.0)
%%Title: (EPS procedures used by the Apache XML Graphics project \(Batik and FOP\))
/BeginEPSF { %def
/b4_Inc_state save def         % Save state for cleanup
/dict_count countdictstack def % Count objects on dict stack
/op_count count 1 sub def      % Count objects on operand stack
userdict begin                 % Push userdict on dict stack
/showpage { } def              % Redefine showpage, { } = null proc
0 setgray 0 setlinecap         % Prepare graphics state
1 setlinewidth 0 setlinejoin
10 setmiterlimit [ ] 0 setdash newpath
/languagelevel where           % If level not equal to 1 then
{pop languagelevel             % set strokeadjust and
1 ne                           % overprint to their defaults.
{false setstrokeadjust false setoverprint
} if
} if
} bd
/EndEPSF { %def
count op_count sub {pop} repeat            % Clean up stacks
countdictstack dict_count sub {end} repeat
b4_Inc_state restore
} bd
%%EndResource
%%EndProlog
%%Page: 1 1
%%PageBoundingBox: 0 0 610 460
%%BeginPageSetup
%%PageOrientation: Portrait
/ReEncode { /MyEncoding exch def exch findfont dup length dict begin {def} forall /Encoding MyEncoding def currentdict end definefont } def
/Helvetica /HelveticaLatin1 ISOLatin1Encoding ReEncode
/Times /TimesLatin1 ISOLatin1Encoding ReEncode
/DP {/Points exch def Points 0 get Points 1 get M 2 2 Points length 1 sub {/i exch def Points i get Points i 1 add get L}for} def
[1 0 0 -1 0 460] CT
%%EndPageSetup
GS
1 GC
N
0 0 610 460 re
f
GR
GS
1 GC
N
533.75 57.5 M
533.75 402.5 L
76.25 57.5 L
cp
f
GR
GS
1 GC
N
533.75 402.5 M
76.25 402.5 L
76.25 57.5 L
cp
f
GR
GS
1 GC
N
533.75 57.5 M
533.75 402.5 L
533.75 402.5 L
cp
f
GR
GS
1 GC
N
76.25 57.5 M
76.25 402.5 L
76.25 402.5 L
cp
f
GR
GS
1 GC
N
/f-1296051243{533.75 57.5 M
533.75 402.5 L
76.25 57.5 L
cp}def
f-1296051243
f
GR
GS
1 GC
N
/f-1921456228{533.75 402.5 M
76.25 402.5 L
76.25 57.5 L
cp}def
f-1921456228
f
GR
GS
1 GC
N
/f2146031872{533.75 57.5 M
533.75 57.5 L
533.75 402.5 L
cp}def
f2146031872
f
GR
GS
1 GC
N
/f-1836069955{76.25 57.5 M
76.25 57.5 L
76.25 402.5 L
cp}def
f-1836069955
f
GR
GS
1 GC
N
/f778255765{533.75 57.5 M
76.25 57.5 L
533.75 57.5 L
cp}def
f778255765
f
GR
GS
1 GC
N
/f-1907896102{76.25 57.5 M
76.25 57.5 L
533.75 57.5 L
cp}def
f-1907896102
f
GR
GS
1 GC
N
/f554099999{533.75 402.5 M
76.25 402.5 L
533.75 402.5 L
cp}def
f554099999
f
GR
GS
1 GC
N
/f1234489274{76.25 402.5 M
76.25 402.5 L
533.75 402.5 L
cp}def
f1234489274
f
GR
0 GC
/HelveticaLatin1 10 F
GS
[1 0 0 1 72.25 411.5] CT
-0.656 9.282 M 1 -1 scale
(0) t
GR
/HelveticaLatin1 10 F
GS
[1 0 0 1 355.6875 411.5] CT
-1.094 9.282 M 1 -1 scale
(10) t
GR
/HelveticaLatin1 10 F
GS
[1 0 0 1 129.9375 411.5] CT
-0.734 9.282 M 1 -1 scale
(2) t
GR
/HelveticaLatin1 10 F
GS
[1 0 0 1 186.625 411.5] CT
-0.484 9.282 M 1 -1 scale
(4) t
GR
/HelveticaLatin1 10 F
GS
[1 0 0 1 243.8125 411.5] CT
-0.703 9.282 M 1 -1 scale
(6) t
GR
/HelveticaLatin1 10 F
GS
[1 0 0 1 301.5 411.5] CT
-0.672 9.282 M 1 -1 scale
(8) t
GR
/HelveticaLatin1 10 F
GS
[1 0 0 1 412.875 411.5] CT
-1.094 9.282 M 1 -1 scale
(12) t
GR
/HelveticaLatin1 10 F
GS
[1 0 0 1 470.0625 411.5] CT
-1.094 9.282 M 1 -1 scale
(14) t
GR
/HelveticaLatin1 10 F
GS
[1 0 0 1 527.25 411.5] CT
-1.094 9.282 M 1 -1 scale
(16) t
GR
/HelveticaLatin1 10 F
GS
[1 0 0 1 101.34375 411.5] CT
-1.094 9.282 M 1 -1 scale
(1) t
GR
/HelveticaLatin1 10 F
GS
[1 0 0 1 158.53125 411.5] CT
-0.766 9.282 M 1 -1 scale
(3) t
GR
/HelveticaLatin1 10 F
GS
[1 0 0 1 215.71875 411.5] CT
-0.766 9.282 M 1 -1 scale
(5) t
GR
/HelveticaLatin1 10 F
GS
[1 0 0 1 272.90625 411.5] CT
-0.828 9.282 M 1 -1 scale
(7) t
GR
/HelveticaLatin1 10 F
GS
[1 0 0 1 329.59375 411.5] CT
-0.625 9.282 M 1 -1 scale
(9) t
GR
/HelveticaLatin1 10 F
GS
[1 0 0 1 384.28125 411.5] CT
-1.094 9.282 M 1 -1 scale
(11) t
GR
/HelveticaLatin1 10 F
GS
[1 0 0 1 441.46875 411.5] CT
-1.094 9.282 M 1 -1 scale
(13) t
GR
/HelveticaLatin1 10 F
GS
[1 0 0 1 498.65625 411.5] CT
-1.094 9.282 M 1 -1 scale
(15) t
GR
GS
10.0 ML
N
[76.25 402.5 76.25 408.5] DP
S
GR
GS
10.0 ML
N
[104.844 402.5 104.844 408.5] DP
S
GR
GS
10.0 ML
N
[133.438 402.5 133.438 408.5] DP
S
GR
GS
10.0 ML
N
[162.031 402.5 162.031 408.5] DP
S
GR
GS
10.0 ML
N
[190.625 402.5 190.625 408.5] DP
S
GR
GS
10.0 ML
N
[219.219 402.5 219.219 408.5] DP
S
GR
GS
10.0 ML
N
[247.813 402.5 247.813 408.5] DP
S
GR
GS
10.0 ML
N
[276.406 402.5 276.406 408.5] DP
S
GR
GS
10.0 ML
N
[305 402.5 305 408.5] DP
S
GR
GS
10.0 ML
N
[333.594 402.5 333.594 408.5] DP
S
GR
GS
10.0 ML
N
[362.188 402.5 362.188 408.5] DP
S
GR
GS
10.0 ML
N
[390.781 402.5 390.781 408.5] DP
S
GR
GS
10.0 ML
N
[419.375 402.5 419.375 408.5] DP
S
GR
GS
10.0 ML
N
[447.969 402.5 447.969 408.5] DP
S
GR
GS
10.0 ML
N
[476.563 402.5 476.563 408.5] DP
S
GR
GS
10.0 ML
N
[505.156 402.5 505.156 408.5] DP
S
GR
GS
10.0 ML
N
[533.75 402.5 533.75 408.5] DP
S
GR
GS
10.0 ML
N
[76.25 402.5 76.25 405.5] DP
S
GR
GS
10.0 ML
N
[90.547 402.5 90.547 405.5] DP
S
GR
GS
10.0 ML
N
[104.844 402.5 104.844 405.5] DP
S
GR
GS
10.0 ML
N
[119.141 402.5 119.141 405.5] DP
S
GR
GS
10.0 ML
N
[133.438 402.5 133.438 405.5] DP
S
GR
GS
10.0 ML
N
[147.734 402.5 147.734 405.5] DP
S
GR
GS
10.0 ML
N
[162.031 402.5 162.031 405.5] DP
S
GR
GS
10.0 ML
N
[176.328 402.5 176.328 405.5] DP
S
GR
GS
10.0 ML
N
[190.625 402.5 190.625 405.5] DP
S
GR
GS
10.0 ML
N
[204.922 402.5 204.922 405.5] DP
S
GR
GS
10.0 ML
N
[219.219 402.5 219.219 405.5] DP
S
GR
GS
10.0 ML
N
[233.516 402.5 233.516 405.5] DP
S
GR
GS
10.0 ML
N
[247.813 402.5 247.813 405.5] DP
S
GR
GS
10.0 ML
N
[262.109 402.5 262.109 405.5] DP
S
GR
GS
10.0 ML
N
[276.406 402.5 276.406 405.5] DP
S
GR
GS
10.0 ML
N
[290.703 402.5 290.703 405.5] DP
S
GR
GS
10.0 ML
N
[305 402.5 305 405.5] DP
S
GR
GS
10.0 ML
N
[319.297 402.5 319.297 405.5] DP
S
GR
GS
10.0 ML
N
[333.594 402.5 333.594 405.5] DP
S
GR
GS
10.0 ML
N
[347.891 402.5 347.891 405.5] DP
S
GR
GS
10.0 ML
N
[362.188 402.5 362.188 405.5] DP
S
GR
GS
10.0 ML
N
[376.484 402.5 376.484 405.5] DP
S
GR
GS
10.0 ML
N
[390.781 402.5 390.781 405.5] DP
S
GR
GS
10.0 ML
N
[405.078 402.5 405.078 405.5] DP
S
GR
GS
10.0 ML
N
[419.375 402.5 419.375 405.5] DP
S
GR
GS
10.0 ML
N
[433.672 402.5 433.672 405.5] DP
S
GR
GS
10.0 ML
N
[447.969 402.5 447.969 405.5] DP
S
GR
GS
10.0 ML
N
[462.266 402.5 462.266 405.5] DP
S
GR
GS
10.0 ML
N
[476.563 402.5 476.563 405.5] DP
S
GR
GS
10.0 ML
N
[490.859 402.5 490.859 405.5] DP
S
GR
GS
10.0 ML
N
[505.156 402.5 505.156 405.5] DP
S
GR
GS
10.0 ML
N
[519.453 402.5 519.453 405.5] DP
S
GR
GS
10.0 ML
N
[533.75 402.5 533.75 405.5] DP
S
GR
GS
10.0 ML
N
[533.75 402.5 76.25 402.5] DP
S
GR
/HelveticaLatin1 10 F
GS
[1 0 0 1 51.25 338.5] CT
-0.766 9.282 M 1 -1 scale
(3.6) t
GR
/HelveticaLatin1 10 F
GS
[1 0 0 1 51.25 108.5] CT
-0.766 9.282 M 1 -1 scale
(3.8) t
GR
/HelveticaLatin1 10 F
GS
[1 0 0 1 51.25 223.5] CT
-0.766 9.282 M 1 -1 scale
(3.7) t
GR
/HelveticaLatin1 10 F
GS
[1 0 0 1 45.25 396] CT
-0.766 9.282 M 1 -1 scale
(3.55) t
GR
/HelveticaLatin1 10 F
GS
[1 0 0 1 45.25 281] CT
-0.766 9.282 M 1 -1 scale
(3.65) t
GR
/HelveticaLatin1 10 F
GS
[1 0 0 1 45.25 166] CT
-0.766 9.282 M 1 -1 scale
(3.75) t
GR
/HelveticaLatin1 10 F
GS
[1 0 0 1 45.25 51] CT
-0.766 9.282 M 1 -1 scale
(3.85) t
GR
GS
10.0 ML
N
[76.25 402.5 70.25 402.5] DP
S
GR
GS
10.0 ML
N
[76.25 345 70.25 345] DP
S
GR
GS
10.0 ML
N
[76.25 287.5 70.25 287.5] DP
S
GR
GS
10.0 ML
N
[76.25 230 70.25 230] DP
S
GR
GS
10.0 ML
N
[76.25 172.5 70.25 172.5] DP
S
GR
GS
10.0 ML
N
[76.25 115 70.25 115] DP
S
GR
GS
10.0 ML
N
[76.25 57.5 70.25 57.5] DP
S
GR
GS
10.0 ML
N
[76.25 402.5 73.25 402.5] DP
S
GR
GS
10.0 ML
N
[76.25 391 73.25 391] DP
S
GR
GS
10.0 ML
N
[76.25 379.5 73.25 379.5] DP
S
GR
GS
10.0 ML
N
[76.25 368 73.25 368] DP
S
GR
GS
10.0 ML
N
[76.25 356.5 73.25 356.5] DP
S
GR
GS
10.0 ML
N
[76.25 345 73.25 345] DP
S
GR
GS
10.0 ML
N
[76.25 333.5 73.25 333.5] DP
S
GR
GS
10.0 ML
N
[76.25 322 73.25 322] DP
S
GR
GS
10.0 ML
N
[76.25 310.5 73.25 310.5] DP
S
GR
GS
10.0 ML
N
[76.25 299 73.25 299] DP
S
GR
GS
10.0 ML
N
[76.25 287.5 73.25 287.5] DP
S
GR
GS
10.0 ML
N
[76.25 276 73.25 276] DP
S
GR
GS
10.0 ML
N
[76.25 264.5 73.25 264.5] DP
S
GR
GS
10.0 ML
N
[76.25 253 73.25 253] DP
S
GR
GS
10.0 ML
N
[76.25 241.5 73.25 241.5] DP
S
GR
GS
10.0 ML
N
[76.25 230 73.25 230] DP
S
GR
GS
10.0 ML
N
[76.25 218.5 73.25 218.5] DP
S
GR
GS
10.0 ML
N
[76.25 207 73.25 207] DP
S
GR
GS
10.0 ML
N
[76.25 195.5 73.25 195.5] DP
S
GR
GS
10.0 ML
N
[76.25 184 73.25 184] DP
S
GR
GS
10.0 ML
N
[76.25 172.5 73.25 172.5] DP
S
GR
GS
10.0 ML
N
[76.25 161 73.25 161] DP
S
GR
GS
10.0 ML
N
[76.25 149.5 73.25 149.5] DP
S
GR
GS
10.0 ML
N
[76.25 138 73.25 138] DP
S
GR
GS
10.0 ML
N
[76.25 126.5 73.25 126.5] DP
S
GR
GS
10.0 ML
N
[76.25 115 73.25 115] DP
S
GR
GS
10.0 ML
N
[76.25 103.5 73.25 103.5] DP
S
GR
GS
10.0 ML
N
[76.25 92 73.25 92] DP
S
GR
GS
10.0 ML
N
[76.25 80.5 73.25 80.5] DP
S
GR
GS
10.0 ML
N
[76.25 69 73.25 69] DP
S
GR
GS
10.0 ML
N
[76.25 57.5 73.25 57.5] DP
S
GR
GS
10.0 ML
N
[76.25 57.5 76.25 402.5] DP
S
GR
/HelveticaLatin1 14 F
GS
[1 0 0 1 287.5 427.5] CT
0.625 14.995 M 1 -1 scale
(Proc) t
GR
/HelveticaLatin1 14 F
GS
[0 -1 1 0 20.25 263] CT
1.234 14.995 M 1 -1 scale
(seconde) t
GR
GS
N
76.245 57.497 M
533.755 57.497 L
533.755 402.503 L
76.245 402.503 L
76.245 57.497 L
cp
clip
1 0 0 RC
10.0 ML
N
[104.844 57.5 190.625 253 305 299 419.375 322 533.75 345] DP
S
GR
GS
N
76.245 57.497 M
533.755 57.497 L
533.755 402.503 L
76.245 402.503 L
76.245 57.497 L
cp
clip
0 0 1 RC
10.0 ML
N
[104.844 80.5 190.625 299 305 345 419.375 356.5 533.75 391] DP
S
GR
GS
10.0 ML
N
[76.25 402.5 76.25 57.5 76.25 57.5 533.75 57.5 533.75 402.5 533.75 402.5 76.25 402.5] DP
S
GR
GS
10.0 ML
N
[533.75 57.5 76.25 57.5] DP
S
GR
GS
10.0 ML
N
[533.75 57.5 533.75 402.5] DP
S
GR
GS
10.0 ML
N
[533.75 57.5 533.75 57.5] DP
S
GR
GS
1 GC
N
/f-397095378{369.125 99.85 M
528.031 99.85 L
528.031 60.95 L
cp}def
f-397095378
f
GR
GS
1 GC
N
/f880714568{369.125 99.85 M
528.031 60.95 L
369.125 60.95 L
cp}def
f880714568
f
GR
GS
10.0 ML
N
[369.125 99.85 528.031 99.85] DP
S
GR
GS
10.0 ML
N
[528.031 99.85 528.031 60.95] DP
S
GR
GS
10.0 ML
N
[528.031 60.95 369.125 60.95] DP
S
GR
GS
10.0 ML
N
[369.125 60.95 369.125 99.85] DP
S
GR
GS
0 0 1 RC
10.0 ML
N
[374.844 87.4 397.719 87.4 420.594 87.4] DP
S
GR
GS
1 0 0 RC
10.0 ML
N
[374.844 73.4 397.719 73.4 420.594 73.4] DP
S
GR
GS
[1 0 0 1 426.31245 64.4] CT
1 GC
N
0 0 96 32 re
f
GR
/HelveticaLatin1 10 F
GS
[1 0 0 1 426.31245 64.4] CT
1.406 11.282 M 1 -1 scale
(avec normalisation) t
GR
/HelveticaLatin1 10 F
GS
[1 0 0 1 426.31245 64.4] CT
1.453 26.282 M 1 -1 scale
(sans normalisation) t
GR
%%Trailer
%%Pages: 1
%%EOF
