\beamer@endinputifotherversion {3.36pt}
\beamer@sectionintoc {1}{Addition parall\IeC {\'e}le }{3}{0}{1}
\beamer@sectionintoc {2}{Impl\IeC {\'e}mentation Parall\IeC {\`e}le}{6}{0}{2}
\beamer@sectionintoc {3}{Conclusion}{9}{0}{3}
