\relax 
\select@language{english}
\@writefile{toc}{\select@language{english}}
\@writefile{lof}{\select@language{english}}
\@writefile{lot}{\select@language{english}}
\@writefile{toc}{\contentsline {section}{\numberline {1}Addition}{1}}
\@writefile{toc}{\contentsline {subsection}{\numberline {1.1}Algorithme}{1}}
\@writefile{loa}{\contentsline {algocf}{\numberline {1}{\ignorespaces Calcule de la somme de deux grands nombres en parall\IeC {\'e}le}}{1}}
\@writefile{lof}{\contentsline {figure}{\numberline {1}{\ignorespaces addition de deux grands nombre}}{2}}
\newlabel{fig:univerise}{{1}{2}}
\@writefile{lof}{\contentsline {figure}{\numberline {2}{\ignorespaces Comparaison entre avec et sans normalisation}}{3}}
\newlabel{fig:univerise}{{2}{3}}
\@writefile{toc}{\contentsline {section}{\numberline {2}Impl\IeC {\'e}mentation Parall\IeC {\`e}le}{3}}
\@writefile{toc}{\contentsline {subsection}{\numberline {2.1}Etude de scalabilit\IeC {\'e}}{3}}
\@writefile{toc}{\contentsline {subsection}{\numberline {2.2}Scalabilit\IeC {\'e} faible}{3}}
\@writefile{toc}{\contentsline {subsection}{\numberline {2.3}Scalabilit\IeC {\'e} forte}{3}}
\@writefile{toc}{\contentsline {subsection}{\numberline {2.4}Addition parallele}{3}}
\@writefile{toc}{\contentsline {subsubsection}{\numberline {2.4.1}Scalabilit\IeC {\'e} faible}{4}}
\@writefile{lof}{\contentsline {figure}{\numberline {3}{\ignorespaces Scalabilit\IeC {\'e} faible pour l'addition}}{4}}
\newlabel{fig:univerise}{{3}{4}}
\@writefile{toc}{\contentsline {subsubsection}{\numberline {2.4.2}Scalabilit\IeC {\'e} forte}{4}}
\@writefile{lof}{\contentsline {figure}{\numberline {4}{\ignorespaces Scalabilit\IeC {\'e} forte pour l'addition}}{4}}
\newlabel{fig:univerise}{{4}{4}}
\@writefile{toc}{\contentsline {subsubsection}{\numberline {2.4.3}Conclusion}{4}}
