\beamer@endinputifotherversion {3.36pt}
\headcommand {\slideentry {0}{0}{1}{1/1}{}{0}}
\headcommand {\beamer@framepages {1}{1}}
\headcommand {\slideentry {0}{0}{2}{2/2}{}{0}}
\headcommand {\beamer@framepages {2}{2}}
\headcommand {\sectionentry {1}{Addition parall\IeC {\'e}le }{3}{Addition parall\IeC {\'e}le }{0}}
\headcommand {\beamer@sectionpages {1}{2}}
\headcommand {\beamer@subsectionpages {1}{2}}
\headcommand {\slideentry {1}{0}{1}{3/3}{}{0}}
\headcommand {\beamer@framepages {3}{3}}
\headcommand {\slideentry {1}{0}{2}{4/4}{}{0}}
\headcommand {\beamer@framepages {4}{4}}
\headcommand {\slideentry {1}{0}{3}{5/5}{}{0}}
\headcommand {\beamer@framepages {5}{5}}
\headcommand {\sectionentry {2}{Impl\IeC {\'e}mentation Parall\IeC {\`e}le}{6}{Impl\IeC {\'e}mentation Parall\IeC {\`e}le}{0}}
\headcommand {\beamer@sectionpages {3}{5}}
\headcommand {\beamer@subsectionpages {3}{5}}
\headcommand {\slideentry {2}{0}{1}{6/6}{}{0}}
\headcommand {\beamer@framepages {6}{6}}
\headcommand {\slideentry {2}{0}{2}{7/7}{}{0}}
\headcommand {\beamer@framepages {7}{7}}
\headcommand {\slideentry {2}{0}{3}{8/8}{}{0}}
\headcommand {\beamer@framepages {8}{8}}
\headcommand {\beamer@partpages {1}{9}}
\headcommand {\beamer@subsectionpages {9}{9}}
\headcommand {\beamer@sectionpages {9}{9}}
\headcommand {\beamer@documentpages {9}}
\headcommand {\def \inserttotalframenumber {9}}
\headcommand {\sectionentry {3}{Conclusion}{9}{Conclusion}{0}}
\headcommand {\beamer@sectionpages {6}{8}}
\headcommand {\beamer@subsectionpages {6}{8}}
\headcommand {\slideentry {3}{0}{1}{9/9}{}{0}}
\headcommand {\beamer@framepages {9}{9}}
