<svg width="136" height="29" viewBox="0 0 136 29" fill="none" xmlns="http://www.w3.org/2000/svg">
<path d="M4.804 11.116C5.5 10.156 6.448 9.376 7.648 8.776C8.872 8.152 10.228 7.84 11.716 7.84C13.468 7.84 15.052 8.26 16.468 9.1C17.884 9.94 19 11.14 19.816 12.7C20.632 14.236 21.04 16 21.04 17.992C21.04 19.984 20.632 21.772 19.816 23.356C19 24.916 17.872 26.14 16.432 27.028C15.016 27.892 13.444 28.324 11.716 28.324C10.18 28.324 8.812 28.024 7.612 27.424C6.436 26.824 5.5 26.056 4.804 25.12V28H0.7V1.36H4.804V11.116ZM16.864 17.992C16.864 16.624 16.576 15.448 16 14.464C15.448 13.456 14.704 12.7 13.768 12.196C12.856 11.668 11.872 11.404 10.816 11.404C9.784 11.404 8.8 11.668 7.864 12.196C6.952 12.724 6.208 13.492 5.632 14.5C5.08 15.508 4.804 16.696 4.804 18.064C4.804 19.432 5.08 20.632 5.632 21.664C6.208 22.672 6.952 23.44 7.864 23.968C8.8 24.496 9.784 24.76 10.816 24.76C11.872 24.76 12.856 24.496 13.768 23.968C14.704 23.416 15.448 22.624 16 21.592C16.576 20.56 16.864 19.36 16.864 17.992ZM27.1864 5.536C26.4424 5.536 25.8184 5.284 25.3144 4.78C24.8104 4.276 24.5584 3.652 24.5584 2.908C24.5584 2.164 24.8104 1.54 25.3144 1.036C25.8184 0.531999 26.4424 0.279999 27.1864 0.279999C27.9064 0.279999 28.5184 0.531999 29.0224 1.036C29.5264 1.54 29.7784 2.164 29.7784 2.908C29.7784 3.652 29.5264 4.276 29.0224 4.78C28.5184 5.284 27.9064 5.536 27.1864 5.536ZM29.2024 8.164V28H25.0984V8.164H29.2024ZM42.4386 18.1L51.5826 28H46.0386L38.6946 19.468V28H34.5906V1.36H38.6946V16.84L45.8946 8.164H51.5826L42.4386 18.1ZM53.1562 18.064C53.1562 16.024 53.5642 14.236 54.3802 12.7C55.2202 11.14 56.3722 9.94 57.8362 9.1C59.3002 8.26 60.9802 7.84 62.8762 7.84C65.2762 7.84 67.2562 8.416 68.8162 9.568C70.4002 10.696 71.4682 12.316 72.0202 14.428H67.5922C67.2322 13.444 66.6562 12.676 65.8642 12.124C65.0722 11.572 64.0762 11.296 62.8762 11.296C61.1962 11.296 59.8522 11.896 58.8442 13.096C57.8602 14.272 57.3682 15.928 57.3682 18.064C57.3682 20.2 57.8602 21.868 58.8442 23.068C59.8522 24.268 61.1962 24.868 62.8762 24.868C65.2522 24.868 66.8242 23.824 67.5922 21.736H72.0202C71.4442 23.752 70.3642 25.36 68.7802 26.56C67.1962 27.736 65.2282 28.324 62.8762 28.324C60.9802 28.324 59.3002 27.904 57.8362 27.064C56.3722 26.2 55.2202 25 54.3802 23.464C53.5642 21.904 53.1562 20.104 53.1562 18.064ZM80.2142 11.044C80.8142 10.036 81.6062 9.256 82.5902 8.704C83.5982 8.128 84.7862 7.84 86.1542 7.84V12.088H85.1102C83.5022 12.088 82.2782 12.496 81.4382 13.312C80.6222 14.128 80.2142 15.544 80.2142 17.56V28H76.1102V8.164H80.2142V11.044ZM88.5586 17.992C88.5586 16 88.9666 14.236 89.7826 12.7C90.6226 11.164 91.7506 9.976 93.1666 9.136C94.6066 8.272 96.1906 7.84 97.9186 7.84C99.4786 7.84 100.835 8.152 101.987 8.776C103.163 9.376 104.099 10.132 104.795 11.044V8.164H108.935V28H104.795V25.048C104.099 25.984 103.151 26.764 101.951 27.388C100.751 28.012 99.3826 28.324 97.8466 28.324C96.1426 28.324 94.5826 27.892 93.1666 27.028C91.7506 26.14 90.6226 24.916 89.7826 23.356C88.9666 21.772 88.5586 19.984 88.5586 17.992ZM104.795 18.064C104.795 16.696 104.507 15.508 103.931 14.5C103.379 13.492 102.647 12.724 101.735 12.196C100.823 11.668 99.8386 11.404 98.7826 11.404C97.7266 11.404 96.7426 11.668 95.8306 12.196C94.9186 12.7 94.1746 13.456 93.5986 14.464C93.0466 15.448 92.7706 16.624 92.7706 17.992C92.7706 19.36 93.0466 20.56 93.5986 21.592C94.1746 22.624 94.9186 23.416 95.8306 23.968C96.7666 24.496 97.7506 24.76 98.7826 24.76C99.8386 24.76 100.823 24.496 101.735 23.968C102.647 23.44 103.379 22.672 103.931 21.664C104.507 20.632 104.795 19.432 104.795 18.064ZM122.641 11.512H118.969V28H114.829V11.512H112.489V8.164H114.829V6.76C114.829 4.48 115.429 2.824 116.629 1.792C117.853 0.735999 119.761 0.207999 122.353 0.207999V3.628C121.105 3.628 120.229 3.868 119.725 4.348C119.221 4.804 118.969 5.608 118.969 6.76V8.164H122.641V11.512ZM131.066 11.512V22.492C131.066 23.236 131.234 23.776 131.57 24.112C131.93 24.424 132.53 24.58 133.37 24.58H135.89V28H132.65C130.802 28 129.386 27.568 128.402 26.704C127.418 25.84 126.926 24.436 126.926 22.492V11.512H124.586V8.164H126.926V3.232H131.066V8.164H135.89V11.512H131.066Z" fill="white"/>
</svg>
