<svg width="10" height="64" viewBox="0 0 10 64" fill="none" xmlns="http://www.w3.org/2000/svg">
<circle cx="5.00024" cy="23" r="4.5" stroke="white"/>
<circle r="3" transform="matrix(1 0 0 -1 5 41)" fill="white"/>
<circle cx="5" cy="5" r="4.5" stroke="white"/>
<circle cx="5" cy="41" r="4.5" stroke="white"/>
<circle cx="5" cy="59" r="4.5" stroke="white"/>
</svg>
