<svg width="11" height="64" viewBox="0 0 11 64" fill="none" xmlns="http://www.w3.org/2000/svg">
<circle cx="5" cy="23" r="4.5" stroke="white"/>
<circle r="3" transform="matrix(1 0 0 -1 5.0022 23)" fill="white"/>
<circle cx="5" cy="5" r="4.5" stroke="white"/>
<circle cx="5.0022" cy="40.9999" r="4.5" stroke="white"/>
<circle cx="5.0022" cy="58.9999" r="4.5" stroke="white"/>
</svg>
