"","GO.ID","Term","Significant","Expected","weight01Fisher","median_corr","max_corr"
"1","GO:0030198","extracellular matrix organization",138,28.43,2.2e-28,0.867,0.962
"2","GO:0022617","extracellular matrix disassembly",48,7.56,6.2e-26,0.888,0.962
"3","GO:0030574","collagen catabolic process",28,3.7,8.5e-16,0.901,0.962
"4","GO:0001525","angiogenesis",109,38.99,1.7e-12,0.845,0.962
"5","GO:0030199","collagen fibril organization",22,3.81,3.5e-11,0.896,0.952
"6","GO:0001657","ureteric bud development",34,8.37,4.3e-11,0.834,0.921
"7","GO:0010812","negative regulation of cell-substrate ad...",30,6.14,4.9e-11,0.858,0.952
"8","GO:0001501","skeletal system development",127,45.81,1.2e-10,0.852,0.952
"9","GO:0008285","negative regulation of cell proliferatio...",120,58.18,2.5e-10,0.844,0.953
"10","GO:0007155","cell adhesion",215,91.39,2.7e-10,0.853,0.96
"11","GO:0035987","endodermal cell differentiation",27,5.28,9.3e-10,0.865,0.962
"12","GO:0048103","somatic stem cell division",18,4.23,1e-09,0.841,0.943
"13","GO:0071230","cellular response to amino acid stimulus",21,4.12,1.1e-09,0.89,0.96
"14","GO:0021915","neural tube development",46,18.46,1.2e-09,0.844,0.943
"15","GO:0008360","regulation of cell shape",42,15.36,2.1e-09,0.858,0.915
"16","GO:0070208","protein heterotrimerization",12,1.23,2.2e-09,0.892,0.952
"17","GO:0060346","bone trabecula formation",11,1.02,3.2e-09,0.892,0.952
"18","GO:0042476","odontogenesis",44,11.84,5.1e-09,0.846,0.936
"19","GO:0007411","axon guidance",116,53.74,5.3e-09,0.854,0.962
"20","GO:0031960","response to corticosteroid",31,16.01,1.2e-08,0.851,0.935
