Module	OTU_name	kTotal	kWithin	kOut	kDiff	Domain	Phylum	Class	Order	Family	Genus	Species
1	OTU_1	23.9742436623728	13.453956340024	10.5202873223489	2.93366901767508	 Bacteria	Firmicutes	Clostridia	Clostridiales	Peptostreptococcaceae	Peptostreptococcus	Unclassified_Peptostreptococcus_1
1	OTU_2	22.5787567149611	13.2821953000962	9.29656141486491	3.98563388523126	 Bacteria	Firmicutes	Clostridia	Clostridiales	Peptostreptococcaceae	Peptostreptococcus	Unclassified_Peptostreptococcus_2
2	OTU_3	3.61773594935575	0.974455007139386	2.64328094221636	-1.66882593507698	Bacteria	Cyanobacteria	Unclassified_Cyanobacteria_3	Oscillatoriales	Unclassified_Oscillatoriales_3	Planktothrix	Unclassified_Planktothrix_3
1	OTU_5	20.2117988848927	12.0276184644879	8.18418042040484	3.84343804408302	 Bacteria	Firmicutes	Clostridia	Clostridiales	Unclassified_Clostridiales_5	Peptoniphilus	Unclassified_Peptoniphilus_5
1	OTU_10	25.5102892808746	14.5661412834771	10.9441479973975	3.62199328607961	 Bacteria	Firmicutes	Bacilli	Lactobacillales	Enterococcaceae	Vagococcus	Unclassified_Vagococcus_10
2	OTU_4	13.8734271111821	3.21416566279405	10.659261448388	-7.44509578559398	Bacteria	Cyanobacteria	Unclassified_Cyanobacteria_4	Oscillatoriales	Unclassified_Oscillatoriales_4	Planktothrix	Unclassified_Planktothrix_4
2	OTU_7	9.48226457387371	3.59666234759226	5.88560222628145	-2.28893987868918	Bacteria	Proteobacteria	Alphaproteobacteria	Rhodobacterales	Rhodobacteraceae	Tropicibacter	Unclassified_Tropicibacter_7
0	OTU_8	2.76636416264812	NA	NA	NA	 Bacteria	Actinobacteria	Actinobacteria	Actinomycetales	Corynebacteriaceae	Corynebacterium	Unclassified_Corynebacterium_8
1	OTU_6	15.4202307379888	9.24103614190442	6.17919459608438	3.06184154582004	Bacteria	Firmicutes	Clostridia	Clostridiales	Unclassified_Clostridiales_6	Gallicola	Unclassified_Gallicola_6
1	OTU_9	18.3667012229773	6.99814644364924	11.368554779328	-4.37040833567876	Bacteria	Cyanobacteria	Oscillatoriophycideae	Chroococcales	Xenococcaceae	Chroococcidiopsis	Unclassified_Chroococcidiopsis_9
1	OTU_11	22.833606850457	12.4002197491164	10.4333871013406	1.96683264777579	 Bacteria	Firmicutes	Bacilli	Lactobacillales	Streptococcaceae	Lactococcus	Unclassified_Lactococcus_11
2	OTU_20	9.24717193390524	3.87566976286852	5.37150217103671	-1.49583240816819	 Bacteria	Proteobacteria	Gammaproteobacteria	Vibrionales	Vibrionaceae	Photobacterium	Unclassified_Photobacterium_20
1	OTU_13	22.1395628107772	11.9180218810751	10.2215409297021	1.69648095137306	 Bacteria	Firmicutes	Bacilli	Lactobacillales	Lactobacillaceae	Lactobacillus	Unclassified_Lactobacillus_13
1	OTU_12	11.8883713203711	5.05534050910721	6.8330308112639	-1.77769030215669	 Bacteria	Proteobacteria	Alphaproteobacteria	Rhizobiales	Bradyrhizobiaceae	Bradyrhizobium	Unclassified_Bradyrhizobium_12
1	OTU_14	24.9276060443236	13.140754023248	11.7868520210756	1.35390200217237	 Bacteria	Firmicutes	Bacilli	Lactobacillales	Streptococcaceae	Lactococcus	Unclassified_Lactococcus_14
1	OTU_15	18.7255474465991	10.6252606169076	8.10028682969149	2.52497378721613	Bacteria	Actinobacteria	Actinobacteria	Coriobacteriales	Coriobacteriaceae	Denitrobacterium	Unclassified_Denitrobacterium_15
1	OTU_27	14.6056129578151	8.26093824085106	6.34467471696404	1.91626352388702	 Bacteria	Firmicutes	Bacilli	Lactobacillales	Carnobacteriaceae	Granulicatella	Unclassified_Granulicatella_27
1	OTU_17	19.3802624563149	9.75556637109396	9.62469608522095	0.130870285873009	 Bacteria	Firmicutes	Bacilli	Lactobacillales	Leuconostocaceae	Weissella	Unclassified_Weissella_17
1	OTU_22	16.5672781794777	8.98598306098309	7.5812951184946	1.4046879424885	 Bacteria	Firmicutes	Clostridia	Clostridiales	Clostridiaceae	Clostridium	Unclassified_Clostridium_22
1	OTU_16	20.2185358903905	10.3673722529546	9.85116363743584	0.516208615518785	 Bacteria	Firmicutes	Bacilli	Lactobacillales	Lactobacillaceae	Lactobacillus	Unclassified_Lactobacillus_16
0	OTU_18	9.84093846940421	NA	NA	NA	 Bacteria	Actinobacteria	Actinobacteria	Coriobacteriales	Coriobacteriaceae	Atopobium	Unclassified_Atopobium_18
1	OTU_21	19.870474980565	9.8549941852807	10.0154807952843	-0.160486610003645	 Bacteria	Firmicutes	Clostridia	Clostridiales	Lachnospiraceae	Robinsoniella	Unclassified_Robinsoniella
1	OTU_19	18.2737744696181	10.4186918436	7.85508262601812	2.56360921758187	 Bacteria	Firmicutes	Bacilli	Lactobacillales	Carnobacteriaceae	Carnobacterium	Unclassified_Carnobacterium_19
3	OTU_26	4.63150997296426	3.00201462050539	1.62949535245887	1.37251926804651	 Bacteria	Proteobacteria	Gammaproteobacteria	Pseudomonadales	Pseudomonadaceae	Pseudomonas	Unclassified_Pseudomonas_26
0	OTU_28	2.14595211994805	NA	NA	NA	 Bacteria	Proteobacteria	Gammaproteobacteria	Enterobacteriales	Enterobacteriaceae	Escherichia|Shigella	Unclassified_Escherichia|Shigella
1	OTU_24	18.5056017549059	9.93686955844832	8.56873219645755	1.36813736199077	 Bacteria	Firmicutes	Bacilli	Lactobacillales	Streptococcaceae	Streptococcus	Unclassified_Streptococcus_24
1	OTU_30	14.6461433134994	6.535224431306	8.11091888219337	-1.57569445088737	 Bacteria	Proteobacteria	Gammaproteobacteria	Oceanospirillales	Halomonadaceae	Halomonas	Unclassified_Halomonas_30
0	OTU_23	2.00528237350223	NA	NA	NA	Bacteria	Cyanobacteria	Oscillatoriophycideae	Chroococcales	Xenococcaceae	Chroococcidiopsis	Unclassified_Chroococcidiopsis_23
2	OTU_25	7.85076798901371	2.28218586765102	5.56858212136268	-3.28639625371166	 Bacteria	Fusobacteria	Fusobacteriia	Fusobacteriales	Fusobacteriaceae	Cetobacterium	Unclassified_Cetobacterium_25
1	OTU_35	18.5572504228319	9.41124518432139	9.14600523851053	0.265239945810855	 Bacteria	Actinobacteria	Actinobacteria	Coriobacteriales	Coriobacteriaceae	Atopobium	Unclassified_Atopobium_35
0	OTU_32	8.07699104632826	NA	NA	NA	 Bacteria	Firmicutes	Bacilli	Lactobacillales	Lactobacillaceae	Lactobacillus	Unclassified_Lactobacillus_32
1	OTU_34	11.517574073096	4.25786803778192	7.25970603531411	-3.00183799753218	 Bacteria	Firmicutes	Bacilli	Lactobacillales	Lactobacillaceae	Lactobacillus	Unclassified_Lactobacillus_34
1	OTU_33	13.4144697741432	6.14242922695062	7.27204054719258	-1.12961132024196	 Bacteria	Proteobacteria	Gammaproteobacteria	Alteromonadales	Pseudoalteromonadaceae	Pseudoalteromonas	Unclassified_Pseudoalteromonas_33
0	OTU_31	9.80567553017713	NA	NA	NA	 Bacteria	Firmicutes	Bacilli	Bacillales	Bacillaceae	Geobacillus	Unclassified_Geobacillus_31
2	OTU_37	8.19935634198737	2.44601632693913	5.75334001504823	-3.3073236881091	 Bacteria	Fusobacteria	Fusobacteriia	Fusobacteriales	Fusobacteriaceae	Psychrilyobacter	Unclassified_Psychrilyobacter
3	OTU_36	3.4732433711765	1.69559929146218	1.77764407971432	-0.0820447882521318	 Bacteria	Proteobacteria	Alphaproteobacteria	Rhodobacterales	Rhodobacteraceae	Loktanella	Unclassified_Loktanella_36
0	OTU_44	10.5330506773139	NA	NA	NA	 Bacteria	Firmicutes	Clostridia	Clostridiales	Clostridiaceae	Clostridium	Unclassified_Clostridium_44
0	OTU_43	2.79545899555484	NA	NA	NA	 Bacteria	Proteobacteria	Gammaproteobacteria	Alteromonadales	Shewanellaceae	Shewanella	Unclassified_Shewanella_43
1	OTU_40	12.2782981943411	4.78427368609333	7.49402450824781	-2.70975082215448	 Bacteria	Firmicutes	Clostridia	Clostridiales	Peptostreptococcaceae	Peptostreptococcus	Unclassified_Peptostreptococcus_40
3	OTU_42	2.62521490333636	1.85963583827328	0.765579065063078	1.0940567732102	 Bacteria	Firmicutes	Bacilli	Lactobacillales	Enterococcaceae	Enterococcus	Unclassified_Enterococcus_42
0	OTU_38	12.4467095667272	NA	NA	NA	 Bacteria	Firmicutes	Bacilli	Lactobacillales	Streptococcaceae	Streptococcus	Unclassified_Streptococcus_38
4	OTU_39	2.73427759229037	0.888946678648342	1.84533091364203	-0.956384234993689	 Bacteria	Proteobacteria	Gammaproteobacteria	Oceanospirillales	Oceanospirillaceae	Thalassolituus	Unclassified_Thalassolituus
0	OTU_48	14.9956333635861	NA	NA	NA	 Bacteria	Firmicutes	Bacilli	Lactobacillales	Lactobacillaceae	Lactobacillus	Unclassified_Lactobacillus_48
3	OTU_49	2.50258109363113	1.44139603137068	1.06118506226045	0.380210969110224	 Bacteria	Firmicutes	Bacilli	Bacillales	Staphylococcaceae	Staphylococcus	Unclassified_Staphylococcus_49
1	OTU_429	15.441437518729	8.22264092495332	7.21879659377569	1.00384433117764	 Bacteria	Firmicutes	Bacilli	Lactobacillales	Enterococcaceae	Vagococcus	Unclassified_Vagococcus_429
4	OTU_41	3.44550171670583	1.00764087945897	2.43786083724686	-1.43021995778789	 Bacteria	Proteobacteria	Gammaproteobacteria	Pseudomonadales	Moraxellaceae	Perlucidibaca	Unclassified_Perlucidibaca
1	OTU_45	15.6626517585554	6.8803621840385	8.78228957451689	-1.90192739047839	 Bacteria	Firmicutes	Clostridia	Clostridiales	Ruminococcaceae	Faecalibacterium	Unclassified_Faecalibacterium_45
1	OTU_61	9.7814614239891	4.19652514217621	5.58493628181289	-1.38841113963668	Bacteria	Firmicutes	Clostridia	Clostridiales	Unclassified_Clostridiales_61	Anaerovorax	Unclassified_Anaerovorax_61
1	OTU_46	14.2601453736245	7.02218021692351	7.23796515670104	-0.215784939777533	 Bacteria	Firmicutes	Bacilli	Lactobacillales	Carnobacteriaceae	Trichococcus	Unclassified_Trichococcus_46
1	OTU_1045	13.310579610217	7.46677512669185	5.84380448352511	1.62297064316674	 Bacteria	Firmicutes	Bacilli	Lactobacillales	Carnobacteriaceae	Carnobacterium	Unclassified_Carnobacterium_1045
0	OTU_59	3.89321588360721	NA	NA	NA	 Bacteria	Proteobacteria	Alphaproteobacteria	Sphingomonadales	Sphingomonadaceae	Sphingomonas	Unclassified_Sphingomonas_59
0	OTU_114	11.7212798079945	NA	NA	NA	 Bacteria	Firmicutes	Bacilli	Lactobacillales	Lactobacillaceae	Lactobacillus	Unclassified_Lactobacillus_114
1	OTU_65	16.1926734363314	7.35966458923359	8.83300884709779	-1.47334425786419	 Bacteria	Firmicutes	Clostridia	Clostridiales	Clostridiaceae	Clostridium	Unclassified_Clostridium_65
0	OTU_55	12.2375968554737	NA	NA	NA	 Bacteria	Firmicutes	Clostridia	Clostridiales	Clostridiaceae	Tepidimicrobium	Unclassified_Tepidimicrobium_55
1	OTU_47	4.3231265995885	1.63503988512411	2.68808671446439	-1.05304682934028	 Bacteria	Proteobacteria	Betaproteobacteria	Burkholderiales	Burkholderiaceae	Ralstonia	Unclassified_Ralstonia
0	OTU_51	11.4251958673521	NA	NA	NA	 Bacteria	Firmicutes	Clostridia	Clostridiales	Unclassified_Clostridiales_51	Mogibacterium	Unclassified_Mogibacterium_51
0	OTU_69	2.10288243016301	NA	NA	NA	 Bacteria	Proteobacteria	Gammaproteobacteria	Alteromonadales	Shewanellaceae	Shewanella	Unclassified_Shewanella_69
0	OTU_56	14.753619727728	NA	NA	NA	 Bacteria	Firmicutes	Clostridia	Clostridiales	Clostridiaceae	Clostridium	Unclassified_Clostridium_56
0	OTU_52	0.96600219468474	NA	NA	NA	 Bacteria	Proteobacteria	Alphaproteobacteria	Rhizobiales	Methylobacteriaceae	Methylobacterium	Unclassified_Methylobacterium_52
1	OTU_71	17.0752948567846	8.60946396122308	8.46583089556151	0.143633065661572	 Bacteria	Firmicutes	Clostridia	Clostridiales	Unclassified_Clostridiales_71	Mogibacterium	Unclassified_Mogibacterium_71
1	OTU_64	11.3836932509325	5.91742462586034	5.46626862507214	0.451156000788197	 Bacteria	Firmicutes	Clostridia	Clostridiales	Peptococcaceae	Peptococcus	Unclassified_Peptococcus_64
1	OTU_77	15.4390468774675	7.17915061570826	8.25989626175922	-1.08074564605096	 Bacteria	Firmicutes	Bacilli	Bacillales	Bacillaceae	Lysinibacillus	Unclassified_Lysinibacillus_77
0	OTU_57	14.3894312804901	NA	NA	NA	 Bacteria	Firmicutes	Clostridia	Clostridiales	Unclassified_Clostridiales_57	Sporanaerobacter	Unclassified_Sporanaerobacter_57
3	OTU_255	2.46392825785553	1.094416036669	1.36951222118653	-0.275096184517525	 Bacteria	Proteobacteria	Gammaproteobacteria	Pseudomonadales	Pseudomonadaceae	Pseudomonas	Unclassified_Pseudomonas_255
2	OTU_98	4.61191921243593	1.33732450578944	3.27459470664649	-1.93727020085705	 Bacteria	Proteobacteria	Gammaproteobacteria	Aeromonadales	Aeromonadaceae	Aeromonas	Unclassified_Aeromonas_98
2	OTU_82	8.78115689800887	2.64149002828448	6.13966686972439	-3.49817684143991	 Bacteria	Proteobacteria	Gammaproteobacteria	Alteromonadales	Moritellaceae	Moritella	Unclassified_Moritella_82
1	OTU_62	15.7725988545092	6.29320462156162	9.47939423294761	-3.18618961138599	 Bacteria	Firmicutes	Bacilli	Lactobacillales	Streptococcaceae	Streptococcus	Unclassified_Streptococcus_62
1	OTU_60	10.2208620939311	4.52236238611892	5.69849970781221	-1.17613732169328	 Bacteria	Firmicutes	Bacilli	Bacillales	Bacillaceae	Bacillus	Unclassified_Bacillus_60
0	OTU_58	9.60660686951973	NA	NA	NA	 Bacteria	Firmicutes	Bacilli	Bacillales	Bacillaceae	Bacillus	Unclassified_Bacillus_58
0	OTU_110	5.44184351356573	NA	NA	NA	 Bacteria	Actinobacteria	Actinobacteria	Actinomycetales	Microbacteriaceae	Curtobacterium	Unclassified_Curtobacterium_110
1	OTU_63	11.2248172973845	4.89024267577959	6.33457462160495	-1.44433194582536	 Bacteria	Firmicutes	Bacilli	Lactobacillales	Leuconostocaceae	Weissella	Unclassified_Weissella_63
0	OTU_68	10.4751127727967	NA	NA	NA	 Bacteria	Firmicutes	Clostridia	Clostridiales	Clostridiaceae	Clostridium	Unclassified_Clostridium_68
0	OTU_95	8.54328855824635	NA	NA	NA	 Bacteria	Firmicutes	Bacilli	Bacillales	Bacillaceae	Bacillus	Unclassified_Bacillus_95
0	OTU_67	2.73859374967804	NA	NA	NA	 Bacteria	Proteobacteria	Betaproteobacteria	Burkholderiales	Comamonadaceae	Pelomonas	Unclassified_Pelomonas
0	OTU_66	9.35127440248818	NA	NA	NA	 Bacteria	Firmicutes	Bacilli	Bacillales	Listeriaceae	Brochothrix	Unclassified_Brochothrix
1	OTU_91	11.7784235883026	5.04011554650754	6.73830804179508	-1.69819249528754	 Bacteria	Firmicutes	Bacilli	Bacillales	Planococcaceae	Kurthia	Unclassified_Kurthia
0	OTU_83	9.81242775105106	NA	NA	NA	 Bacteria	Firmicutes	Bacilli	Bacillales	Planococcaceae	Ureibacillus	Unclassified_Ureibacillus
0	OTU_80	1.14884832102841	NA	NA	NA	 Bacteria	Proteobacteria	Gammaproteobacteria	Xanthomonadales	Xanthomonadaceae	Stenotrophomonas	Unclassified_Stenotrophomonas_80
0	OTU_72	10.4363647874687	NA	NA	NA	 Bacteria	Firmicutes	Clostridia	Clostridiales	Clostridiaceae	Clostridium	Unclassified_Clostridium_72
1	OTU_116	11.6595830863447	4.56263711630767	7.09694597003706	-2.53430885372939	 Bacteria	Firmicutes	Bacilli	Bacillales	Planococcaceae	Sporosarcina	Unclassified_Sporosarcina_116
3	OTU_74	3.15295187964727	1.14907852259754	2.00387335704973	-0.854794834452193	 Bacteria	Proteobacteria	Alphaproteobacteria	Sphingomonadales	Erythrobacteraceae	Altererythrobacter	Unclassified_Altererythrobacter_74
0	OTU_79	2.38361644722004	NA	NA	NA	 Bacteria	Proteobacteria	Epsilonproteobacteria	Campylobacterales	Campylobacteraceae	Arcobacter	Unclassified_Arcobacter_79
1	OTU_85	12.9362620168293	6.1266641919353	6.80959782489405	-0.682933632958745	 Bacteria	Firmicutes	Bacilli	Lactobacillales	Leuconostocaceae	Weissella	Unclassified_Weissella_85
0	OTU_78	1.75915356506027	NA	NA	NA	 Bacteria	Proteobacteria	Betaproteobacteria	Burkholderiales	Comamonadaceae	Delftia	Unclassified_Delftia
1	OTU_76	15.7410765684737	6.73369346454995	9.00738310392376	-2.27368963937381	 Bacteria	Actinobacteria	Actinobacteria	Actinomycetales	Pseudonocardiaceae	Saccharopolyspora	Unclassified_Saccharopolyspora_76
1	OTU_115	15.0776139591967	6.45934048927064	8.61827346992608	-2.15893298065544	 Bacteria	Firmicutes	Bacilli	Lactobacillales	Enterococcaceae	Enterococcus	Unclassified_Enterococcus_115
0	OTU_93	2.74245310041798	NA	NA	NA	 Bacteria	Proteobacteria	Gammaproteobacteria	Pseudomonadales	Moraxellaceae	Acinetobacter	Unclassified_Acinetobacter_93
0	OTU_131	12.0721554929405	NA	NA	NA	Bacteria	Firmicutes	Bacilli	Bacillales	Planococcaceae	Sporosarcina	Unclassified_Sporosarcina_131
0	OTU_99	10.1069322393537	NA	NA	NA	 Bacteria	Firmicutes	Bacilli	Lactobacillales	Lactobacillaceae	Lactobacillus	Unclassified_Lactobacillus_99
0	OTU_173	0.974273093657842	NA	NA	NA	 Bacteria	Proteobacteria	Gammaproteobacteria	Enterobacteriales	Enterobacteriaceae	Klebsiella	Unclassified_Klebsiella
0	OTU_130	14.7471116390528	NA	NA	NA	 Bacteria	Firmicutes	Bacilli	Bacillales	Planococcaceae	Sporosarcina	Unclassified_Sporosarcina_130
4	OTU_81	3.12882796911372	1.24334053777903	1.88548743133469	-0.642146893555656	 Bacteria	Proteobacteria	Gammaproteobacteria	Alteromonadales	Psychromonadaceae	Psychromonas	Unclassified_Psychromonas_81
0	OTU_87	4.43447612347359	NA	NA	NA	 Bacteria	Actinobacteria	Actinobacteria	Actinomycetales	Nocardiaceae	Rhodococcus	Unclassified_Rhodococcus_87
1	OTU_108	12.1605865557532	5.4427646839222	6.71782187183098	-1.27505718790878	Bacteria	Firmicutes	Clostridia	Clostridiales	Unclassified_Clostridiales_108	Anaerovorax	Unclassified_Anaerovorax_108
3	OTU_92	2.48597496078097	1.29278889255502	1.19318606822595	0.0996028243290712	 Bacteria	Proteobacteria	Alphaproteobacteria	Rhizobiales	Rhizobiaceae	Rhizobium	Unclassified_Rhizobium_92
0	OTU_90	5.60646945926157	NA	NA	NA	 Bacteria	Proteobacteria	Gammaproteobacteria	Oceanospirillales	Halomonadaceae	Halomonas	Unclassified_Halomonas_90
0	OTU_89	12.461274497624	NA	NA	NA	 Bacteria	Firmicutes	Bacilli	Lactobacillales	Lactobacillaceae	Lactobacillus	Unclassified_Lactobacillus_89
2	OTU_141	8.81208520389609	2.57979763943801	6.23228756445809	-3.65248992502008	 Bacteria	Fusobacteria	Fusobacteriia	Fusobacteriales	Fusobacteriaceae	Fusobacterium	Unclassified_Fusobacterium_141
0	OTU_126	4.64050102340007	NA	NA	NA	 Bacteria	Firmicutes	Clostridia	Clostridiales	Peptostreptococcaceae	Tepidibacter	Unclassified_Tepidibacter_126
2	OTU_94	7.7218013462251	1.76162036891895	5.96018097730616	-4.19856060838721	 Bacteria	Fusobacteria	Fusobacteriia	Fusobacteriales	Fusobacteriaceae	Fusobacterium	Unclassified_Fusobacterium_94
0	OTU_105	9.03957719980159	NA	NA	NA	 Bacteria	Firmicutes	Bacilli	Bacillales	Bacillaceae	Oceanobacillus	Unclassified_Oceanobacillus_105
0	OTU_97	8.83565260915557	NA	NA	NA	 Bacteria	Firmicutes	Clostridia	Clostridiales	Clostridiaceae	Clostridium	Unclassified_Clostridium_97
0	OTU_122	9.14703694094024	NA	NA	NA	 Bacteria	Firmicutes	Clostridia	Clostridiales	Clostridiaceae	Clostridium	Unclassified_Clostridium_122
0	OTU_88	9.65160652002534	NA	NA	NA	 Bacteria	Firmicutes	Clostridia	Clostridiales	Clostridiaceae	Clostridium	Unclassified_Clostridium_88
2	OTU_132	7.13368092086486	1.60638554120799	5.52729537965687	-3.92090983844888	Bacteria	Firmicutes	Erysipelotrichia	Erysipelotrichales	Erysipelotrichaceae	Bulleidia	Unclassified_Bulleidia_132
0	OTU_219	14.8251082306577	NA	NA	NA	 Bacteria	Firmicutes	Bacilli	Lactobacillales	Lactobacillaceae	Lactobacillus	Unclassified_Lactobacillus_219
4	OTU_117	3.20862762504209	1.42561262139381	1.78301500364828	-0.357402382254465	 Bacteria	Proteobacteria	Gammaproteobacteria	Pseudomonadales	Pseudomonadaceae	Pseudomonas	Unclassified_Pseudomonas_117
2	OTU_104	8.77820888813215	2.31853887416917	6.45967001396298	-4.14113113979381	 Bacteria	Bacteroidetes	Bacteroidia	Bacteroidales	Bacteroidaceae	Bacteroides	Unclassified_Bacteroides_104
0	OTU_112	1.21136172737285	NA	NA	NA	 Bacteria	Actinobacteria	Actinobacteria	Actinomycetales	Micrococcaceae	Micrococcus	Unclassified_Micrococcus
0	OTU_145	7.84324495319445	NA	NA	NA	 Bacteria	Proteobacteria	Gammaproteobacteria	Oceanospirillales	Halomonadaceae	Halomonas	Unclassified_Halomonas_145
1	OTU_102	10.4196353530663	4.17018025944553	6.24945509362076	-2.07927483417522	 Bacteria	Firmicutes	Clostridia	Clostridiales	Eubacteriaceae	Pseudoramibacter	Unclassified_Pseudoramibacter_102
0	OTU_121	1.93404983014473	NA	NA	NA	 Bacteria	Firmicutes	Bacilli	Lactobacillales	Streptococcaceae	Streptococcus	Unclassified_Streptococcus_121
0	OTU_101	11.6643100657202	NA	NA	NA	 Bacteria	Actinobacteria	Actinobacteria	Coriobacteriales	Coriobacteriaceae	Atopobium	Unclassified_Atopobium_101
5	OTU_106	2.04055929915871	0.389962712530232	1.65059658662848	-1.26063387409825	 Bacteria	Proteobacteria	Gammaproteobacteria	Pseudomonadales	Moraxellaceae	Psychrobacter	Unclassified_Psychrobacter_106
0	OTU_191	2.91178195018961	NA	NA	NA	 Bacteria	Proteobacteria	Gammaproteobacteria	Enterobacteriales	Enterobacteriaceae	Pantoea	Unclassified_Pantoea
0	OTU_107	8.69933482229727	NA	NA	NA	 Bacteria	Firmicutes	Clostridia	Clostridiales	Clostridiaceae	Proteiniclasticum	Unclassified_Proteiniclasticum_107
0	OTU_100	5.12129951092952	NA	NA	NA	Bacteria	Firmicutes	Clostridia	Clostridiales	Unclassified_Clostridiales_100	Anaerovorax	Unclassified_Anaerovorax_100
0	OTU_113	4.40702909549879	NA	NA	NA	 Bacteria	Proteobacteria	Alphaproteobacteria	Rhizobiales	Phyllobacteriaceae	Phyllobacterium	Unclassified_Phyllobacterium
0	OTU_127	9.08548898476515	NA	NA	NA	 Bacteria	Firmicutes	Clostridia	Clostridiales	Unclassified_Clostridiales_127	Sporanaerobacter	Unclassified_Sporanaerobacter_127
3	OTU_156	2.16246633506767	1.09237900111447	1.0700873339532	0.022291667161277	 Bacteria	Proteobacteria	Alphaproteobacteria	Sphingomonadales	Sphingomonadaceae	Sphingobium	Unclassified_Sphingobium
0	OTU_172	2.90491671356137	NA	NA	NA	 Bacteria	Proteobacteria	Alphaproteobacteria	Sphingomonadales	Sphingomonadaceae	Sphingorhabdus	Unclassified_Sphingorhabdus_172
0	OTU_109	8.09388393671414	NA	NA	NA	 Bacteria	Firmicutes	Clostridia	Clostridiales	Clostridiaceae	Clostridium	Unclassified_Clostridium_109
0	OTU_186	2.14699087528444	NA	NA	NA	 Bacteria	Proteobacteria	Gammaproteobacteria	Alteromonadales	Shewanellaceae	Shewanella	Unclassified_Shewanella_186
0	OTU_153	8.8495754633607	NA	NA	NA	 Bacteria	Firmicutes	Clostridia	Clostridiales	Clostridiaceae	Clostridium	Unclassified_Clostridium_153
0	OTU_103	4.22553056374079	NA	NA	NA	 Bacteria	Firmicutes	Clostridia	Clostridiales	Unclassified_Clostridiales_103	Sporanaerobacter	Unclassified_Sporanaerobacter_103
0	OTU_111	3.29986633228742	NA	NA	NA	 Bacteria	Proteobacteria	Gammaproteobacteria	Vibrionales	Vibrionaceae	Vibrio	Unclassified_Vibrio_111
0	OTU_162	11.6423258597063	NA	NA	NA	 Bacteria	Actinobacteria	Actinobacteria	Actinomycetales	Pseudonocardiaceae	Saccharopolyspora	Unclassified_Saccharopolyspora_162
0	OTU_152	9.45505342277327	NA	NA	NA	Bacteria	Firmicutes	Clostridia	Clostridiales	Clostridiaceae	Tepidimicrobium	Unclassified_Tepidimicrobium_152
0	OTU_178	2.47197835472762	NA	NA	NA	 Bacteria	Firmicutes	Bacilli	Bacillales	Bacillaceae	Bacillus	Unclassified_Bacillus_178
0	OTU_129	7.07532562467621	NA	NA	NA	Bacteria	Actinobacteria	Actinobacteria	Actinomycetales	Acidothermaceae	Acidothermus	Unclassified_Acidothermus
0	OTU_120	8.51417822222787	NA	NA	NA	Bacteria	Firmicutes	Clostridia	Clostridiales	Unclassified_Clostridiales_120	Gallicola	Unclassified_Gallicola_120
0	OTU_119	6.7013684095102	NA	NA	NA	 Bacteria	Firmicutes	Bacilli	Lactobacillales	Streptococcaceae	Lactococcus	Unclassified_Lactococcus_119
0	OTU_187	1.67175486985468	NA	NA	NA	 Bacteria	Actinobacteria	Actinobacteria	Actinomycetales	Micrococcaceae	Kocuria	Unclassified_Kocuria
0	OTU_177	11.0641842415356	NA	NA	NA	 Bacteria	Firmicutes	Bacilli	Bacillales	Bacillaceae	Cerasibacillus	Unclassified_Cerasibacillus_177
0	OTU_210	6.46001061550045	NA	NA	NA	 Bacteria	Firmicutes	Bacilli	Bacillales	Bacillaceae	Bacillus	Unclassified_Bacillus_210
2	OTU_1386	6.75479558643756	2.39605816514924	4.35873742128832	-1.96267925613908	 Bacteria	Proteobacteria	Gammaproteobacteria	Vibrionales	Vibrionaceae	Photobacterium	Unclassified_Photobacterium_1386
2	OTU_170	3.41842513123492	1.0695660666032	2.34885906463172	-1.27929299802851	 Bacteria	Firmicutes	Negativicutes	Selenomonadales	Acidaminococcaceae	Phascolarctobacterium	Unclassified_Phascolarctobacterium
0	OTU_143	8.19506451343117	NA	NA	NA	 Bacteria	Firmicutes	Clostridia	Clostridiales	Unclassified_Clostridiales_143	Anaerococcus	Unclassified_Anaerococcus_143
0	OTU_161	8.44609890110031	NA	NA	NA	 Bacteria	Actinobacteria	Actinobacteria	Actinomycetales	Pseudonocardiaceae	Saccharopolyspora	Unclassified_Saccharopolyspora_161
3	OTU_128	4.37973694454059	3.31195443217633	1.06778251236427	2.24417191981206	Bacteria	Actinobacteria	Actinobacteria	Actinomycetales	Micrococcaceae	Acaricomes	Unclassified_Acaricomes
2	OTU_154	8.15072620588051	1.93227455720959	6.21845164867092	-4.28617709146134	 Bacteria	Bacteroidetes	Bacteroidia	Bacteroidales	Bacteroidaceae	Bacteroides	Unclassified_Bacteroides_154
0	OTU_142	9.34665699604858	NA	NA	NA	 Bacteria	Firmicutes	Bacilli	Bacillales	Bacillaceae	Bacillus	Unclassified_Bacillus_142
0	OTU_133	6.66533727977793	NA	NA	NA	 Bacteria	Firmicutes	Bacilli	Bacillales	Bacillaceae	Bacillus	Unclassified_Bacillus_133
0	OTU_155	3.16770832572609	NA	NA	NA	 Bacteria	Actinobacteria	Actinobacteria	Actinomycetales	Corynebacteriaceae	Corynebacterium	Unclassified_Corynebacterium_155
0	OTU_134	9.14699592074372	NA	NA	NA	 Bacteria	Firmicutes	Clostridia	Clostridiales	Unclassified_Clostridiales_134	Sporanaerobacter	Unclassified_Sporanaerobacter_134
0	OTU_124	1.68839093833704	NA	NA	NA	 Bacteria	Firmicutes	Bacilli	Lactobacillales	Carnobacteriaceae	Alkalibacterium	Unclassified_Alkalibacterium
0	OTU_233	6.20471416909873	NA	NA	NA	 Bacteria	Actinobacteria	Actinobacteria	Actinomycetales	Corynebacteriaceae	Corynebacterium	Unclassified_Corynebacterium_233
0	OTU_157	5.26256174918536	NA	NA	NA	 Bacteria	Firmicutes	Clostridia	Clostridiales	Unclassified_Clostridiales_157	Peptoniphilus	Unclassified_Peptoniphilus_157
3	OTU_165	4.94696028327863	3.72361944203607	1.22334084124256	2.50027860079351	Bacteria	Cyanobacteria	Unclassified_Cyanobacteria_165	Oscillatoriales	Unclassified_Oscillatoriales_165	Planktothrix	Unclassified_Planktothrix_165
0	OTU_135	2.94531684206718	NA	NA	NA	 Bacteria	Proteobacteria	Betaproteobacteria	Burkholderiales	Burkholderiaceae	Burkholderia	Unclassified_Burkholderia_135
0	OTU_215	1.91332257722661	NA	NA	NA	 Bacteria	Proteobacteria	Alphaproteobacteria	Rhodobacterales	Rhodobacteraceae	Paracoccus	Unclassified_Paracoccus
2	OTU_136	5.28010808632685	1.46740825359046	3.81269983273639	-2.34529157914593	 Bacteria	Firmicutes	Clostridia	Clostridiales	Lachnospiraceae	Oribacterium	Unclassified_Oribacterium
0	OTU_182	4.39633354586915	NA	NA	NA	 Bacteria	Actinobacteria	Actinobacteria	Actinomycetales	Brevibacteriaceae	Brevibacterium	Unclassified_Brevibacterium_182
0	OTU_139	1.92548402259158	NA	NA	NA	 Bacteria	Actinobacteria	Actinobacteria	Actinomycetales	Corynebacteriaceae	Corynebacterium	Unclassified_Corynebacterium_139
0	OTU_144	7.99237514728973	NA	NA	NA	 Bacteria	Firmicutes	Bacilli	Lactobacillales	Lactobacillaceae	Lactobacillus	Unclassified_Lactobacillus_144
0	OTU_151	10.0674931305489	NA	NA	NA	 Bacteria	Firmicutes	Clostridia	Clostridiales	Peptostreptococcaceae	Tepidibacter	Unclassified_Tepidibacter_151
0	OTU_181	10.5493877929185	NA	NA	NA	 Bacteria	Firmicutes	Bacilli	Bacillales	Planococcaceae	Sporosarcina	Unclassified_Sporosarcina_181
0	OTU_159	1.38774514266216	NA	NA	NA	 Bacteria	Proteobacteria	Gammaproteobacteria	Pseudomonadales	Moraxellaceae	Enhydrobacter	Unclassified_Enhydrobacter
0	OTU_192	2.29860426946866	NA	NA	NA	 Bacteria	Proteobacteria	Alphaproteobacteria	Rhizobiales	Methylobacteriaceae	Methylobacterium	Unclassified_Methylobacterium_192
0	OTU_138	6.56910088603089	NA	NA	NA	 Bacteria	Firmicutes	Clostridia	Clostridiales	Clostridiaceae	Clostridium	Unclassified_Clostridium_138
0	OTU_158	3.03296247529051	NA	NA	NA	 Bacteria	Proteobacteria	Betaproteobacteria	Burkholderiales	Unclassified_Burkholderiales_158	Aquabacterium	Unclassified_Aquabacterium
0	OTU_227	1.76624032099757	NA	NA	NA	 Bacteria	Proteobacteria	Gammaproteobacteria	Pseudomonadales	Pseudomonadaceae	Pseudomonas	Unclassified_Pseudomonas_227
0	OTU_296	5.96160315331386	NA	NA	NA	 Bacteria	Firmicutes	Clostridia	Clostridiales	Unclassified_Clostridiales_296	Peptoniphilus	Unclassified_Peptoniphilus_296
3	OTU_137	4.99319064324142	3.65425975787795	1.33893088536347	2.31532887251449	Bacteria	Actinobacteria	Actinobacteria	Actinomycetales	Nocardioidaceae	Flindersiella	Unclassified_Flindersiella_137
4	OTU_140	2.88385031312425	0.895977999746509	1.98787231337774	-1.09189431363123	Bacteria	Bacteroidetes	Flavobacteriia	Flavobacteriales	Flavobacteriaceae	Ulvibacter	Unclassified_Ulvibacter_140
5	OTU_213	2.14965851500959	0.510333857108713	1.63932465790088	-1.12899080079217	 Bacteria	Proteobacteria	Alphaproteobacteria	Caulobacterales	Caulobacteraceae	Brevundimonas	Unclassified_Brevundimonas_213
3	OTU_168	5.49647823710658	4.05334843077844	1.44312980632814	2.6102186244503	Bacteria	Actinobacteria	Actinobacteria	Actinomycetales	Pseudonocardiaceae	Sciscionella	Unclassified_Sciscionella_168
3	OTU_207	5.52514579112034	4.04794294106921	1.47720285005113	2.57074009101808	Bacteria	Proteobacteria	Gammaproteobacteria	Oceanospirillales	Litoricolaceae	Litoricola	Unclassified_Litoricola_207
4	OTU_146	2.34104849169457	0.84234705057783	1.49870144111674	-0.656354390538908	 Bacteria	Proteobacteria	Gammaproteobacteria	Pseudomonadales	Moraxellaceae	Alkanindiges	Unclassified_Alkanindiges_146
0	OTU_231	5.26944343278115	NA	NA	NA	 Bacteria	Firmicutes	Erysipelotrichia	Erysipelotrichales	Erysipelotrichaceae	Erysipelothrix	Unclassified_Erysipelothrix_231
0	OTU_148	4.26511702897202	NA	NA	NA	 Bacteria	Actinobacteria	Actinobacteria	Actinomycetales	Nocardiaceae	Rhodococcus	Unclassified_Rhodococcus_148
0	OTU_180	4.10857600557828	NA	NA	NA	 Bacteria	Proteobacteria	Gammaproteobacteria	Alteromonadales	Psychromonadaceae	Psychromonas	Unclassified_Psychromonas_180
0	OTU_167	7.41363877357864	NA	NA	NA	Bacteria	Firmicutes	Clostridia	Clostridiales	Caldicoprobacteraceae	Caldicoprobacter	Unclassified_Caldicoprobacter_167
0	OTU_166	2.25376079981153	NA	NA	NA	 Bacteria	Proteobacteria	Alphaproteobacteria	Rhodobacterales	Rhodobacteraceae	Rhodobacter	Unclassified_Rhodobacter_166
0	OTU_441	2.08311183141935	NA	NA	NA	 Bacteria	Firmicutes	Bacilli	Bacillales	Bacillaceae	Geobacillus	Unclassified_Geobacillus_441
2	OTU_169	5.70457988094876	1.49488772717448	4.20969215377428	-2.71480442659979	 Bacteria	Bacteroidetes	Bacteroidia	Bacteroidales	Bacteroidaceae	Bacteroides	Unclassified_Bacteroides_169
0	OTU_147	5.33650950684202	NA	NA	NA	 Bacteria	Actinobacteria	Actinobacteria	Actinomycetales	Brevibacteriaceae	Brevibacterium	Unclassified_Brevibacterium_147
0	OTU_163	8.34213060778237	NA	NA	NA	 Bacteria	Firmicutes	Clostridia	Clostridiales	Lachnospiraceae	Shuttleworthia	Unclassified_Shuttleworthia
0	OTU_160	4.81045423907343	NA	NA	NA	 Bacteria	Actinobacteria	Actinobacteria	Acidimicrobiales	Acidimicrobiaceae	Ilumatobacter	Unclassified_Ilumatobacter_160
0	OTU_249	2.15186676151028	NA	NA	NA	 Bacteria	Proteobacteria	Alphaproteobacteria	Rhodobacterales	Rhodobacteraceae	Sulfitobacter	Unclassified_Sulfitobacter
0	OTU_228	6.32774803757747	NA	NA	NA	 Bacteria	Firmicutes	Bacilli	Lactobacillales	Lactobacillaceae	Lactobacillus	Unclassified_Lactobacillus_228
0	OTU_193	1.09095222939981	NA	NA	NA	 Bacteria	Proteobacteria	Gammaproteobacteria	Pseudomonadales	Moraxellaceae	Acinetobacter	Unclassified_Acinetobacter_193
0	OTU_171	3.06414738983577	NA	NA	NA	 Bacteria	Firmicutes	Bacilli	Bacillales	Paenibacillaceae	Aneurinibacillus	Unclassified_Aneurinibacillus
0	OTU_175	5.13522986225351	NA	NA	NA	 Bacteria	Firmicutes	Clostridia	Clostridiales	Clostridiaceae	Clostridium	Unclassified_Clostridium_175
0	OTU_276	11.279941132009	NA	NA	NA	 Bacteria	Firmicutes	Clostridia	Clostridiales	Unclassified_Clostridiales_276	Proteocatella	Unclassified_Proteocatella
0	OTU_241	2.68698565770679	NA	NA	NA	 Bacteria	Firmicutes	Bacilli	Bacillales	Bacillaceae	Calditerricola	Unclassified_Calditerricola
0	OTU_305	4.81820035626257	NA	NA	NA	 Bacteria	Firmicutes	Bacilli	Lactobacillales	Aerococcaceae	Globicatella	Unclassified_Globicatella
0	OTU_216	6.73128758016014	NA	NA	NA	Bacteria	Firmicutes	Clostridia	Clostridiales	Clostridiaceae	Clostridiisalibacter	Unclassified_Clostridiisalibacter_216
0	OTU_164	6.881981730085	NA	NA	NA	 Bacteria	Firmicutes	Clostridia	Clostridiales	Clostridiaceae	Clostridium	Unclassified_Clostridium_164
2	OTU_461	6.01194288179599	1.35155314631182	4.66038973548417	-3.30883658917235	 Bacteria	Bacteroidetes	Flavobacteriia	Flavobacteriales	Flavobacteriaceae	Myroides	Unclassified_Myroides_461
0	OTU_223	3.9332943514784	NA	NA	NA	 Bacteria	Proteobacteria	Betaproteobacteria	Burkholderiales	Comamonadaceae	Comamonas	Unclassified_Comamonas_223
0	OTU_270	6.28410921170765	NA	NA	NA	 Bacteria	Actinobacteria	Actinobacteria	Actinomycetales	Corynebacteriaceae	Corynebacterium	Unclassified_Corynebacterium_270
0	OTU_201	5.52567122737709	NA	NA	NA	 Bacteria	Firmicutes	Bacilli	Bacillales	Thermoactinomycetaceae	Thermoactinomyces	Unclassified_Thermoactinomyces_201
0	OTU_267	1.74248167764469	NA	NA	NA	 Bacteria	Proteobacteria	Betaproteobacteria	Burkholderiales	Oxalobacteraceae	Janthinobacterium	Unclassified_Janthinobacterium
1	OTU_674	12.772219427611	6.11728613181544	6.65493329579552	-0.537647163980072	Bacteria	Firmicutes	Clostridia	Clostridiales	Unclassified_Clostridiales_674	Anaerovorax	Unclassified_Anaerovorax_674
0	OTU_190	2.64596768047248	NA	NA	NA	 Bacteria	Firmicutes	Bacilli	Bacillales	Bacillaceae	Oceanobacillus	Unclassified_Oceanobacillus_190
0	OTU_174	1.19976693901568	NA	NA	NA	 Bacteria	Firmicutes	Bacilli	Lactobacillales	Lactobacillaceae	Lactobacillus	Unclassified_Lactobacillus_174
0	OTU_242	8.01671856179639	NA	NA	NA	 Bacteria	Firmicutes	Clostridia	Clostridiales	Peptostreptococcaceae	Peptostreptococcus	Unclassified_Peptostreptococcus_242
0	OTU_209	1.71336602090348	NA	NA	NA	 Bacteria	Proteobacteria	Betaproteobacteria	Burkholderiales	Comamonadaceae	Variovorax	Unclassified_Variovorax
0	OTU_205	5.20406275362628	NA	NA	NA	 Bacteria	Firmicutes	Bacilli	Bacillales	Bacillaceae	Bacillus	Unclassified_Bacillus_205
5	OTU_183	1.89561396496921	0.426800174659915	1.4688137903093	-1.04201361564938	Bacteria	Firmicutes	Negativicutes	Selenomonadales	Veillonellaceae	Propionispira	Unclassified_Propionispira_183
0	OTU_184	2.5300306389417	NA	NA	NA	Bacteria	Firmicutes	Bacilli	Lactobacillales	Carnobacteriaceae	Allofustis	Unclassified_Allofustis
0	OTU_188	7.29794008651209	NA	NA	NA	 Bacteria	Firmicutes	Bacilli	Bacillales	Unclassified_Bacillales_188	Exiguobacterium	Unclassified_Exiguobacterium
5	OTU_259	2.95849519816985	0.76103292228357	2.19746227588628	-1.43642935360271	 Bacteria	Bacteroidetes	Flavobacteriia	Flavobacteriales	Flavobacteriaceae	Subsaxibacter	Unclassified_Subsaxibacter
0	OTU_272	2.65364623092074	NA	NA	NA	 Bacteria	Proteobacteria	Epsilonproteobacteria	Campylobacterales	Campylobacteraceae	Arcobacter	Unclassified_Arcobacter_272
0	OTU_262	2.2067308237021	NA	NA	NA	 Bacteria	Proteobacteria	Gammaproteobacteria	Enterobacteriales	Enterobacteriaceae	Serratia	Unclassified_Serratia
0	OTU_339	6.07522907986523	NA	NA	NA	 Bacteria	Firmicutes	Bacilli	Bacillales	Bacillaceae	Bacillus	Unclassified_Bacillus_339
0	OTU_229	4.58817892138756	NA	NA	NA	 Bacteria	Firmicutes	Clostridia	Clostridiales	Unclassified_Clostridiales_229	Helcococcus	Unclassified_Helcococcus_229
0	OTU_265	5.04692632842442	NA	NA	NA	 Bacteria	Actinobacteria	Actinobacteria	Actinomycetales	Micrococcaceae	Arthrobacter	Unclassified_Arthrobacter_265
0	OTU_279	1.15910813979041	NA	NA	NA	 Bacteria	Proteobacteria	Betaproteobacteria	Burkholderiales	Burkholderiaceae	Burkholderia	Unclassified_Burkholderia_279
0	OTU_318	4.83472418067552	NA	NA	NA	 Bacteria	Proteobacteria	Gammaproteobacteria	Enterobacteriales	Enterobacteriaceae	Morganella	Unclassified_Morganella_318
0	OTU_208	4.54999874720296	NA	NA	NA	 Bacteria	Firmicutes	Bacilli	Lactobacillales	Lactobacillaceae	Lactobacillus	Unclassified_Lactobacillus_208
0	OTU_333	4.64525104544023	NA	NA	NA	 Bacteria	Actinobacteria	Actinobacteria	Actinomycetales	Dietziaceae	Dietzia	Unclassified_Dietzia
2	OTU_214	6.25787574716628	1.4775712879957	4.78030445917058	-3.30273317117488	 Bacteria	Bacteroidetes	Bacteroidia	Bacteroidales	Bacteroidaceae	Bacteroides	Unclassified_Bacteroides_214
0	OTU_257	3.84901148190558	NA	NA	NA	 Bacteria	Firmicutes	Clostridia	Clostridiales	Clostridiaceae	Tepidimicrobium	Unclassified_Tepidimicrobium_257
0	OTU_337	5.79170099280125	NA	NA	NA	 Bacteria	Firmicutes	Bacilli	Bacillales	Paenibacillaceae	Paenibacillus	Unclassified_Paenibacillus_337
2	OTU_498	4.92175928381067	1.16664025131104	3.75511903249962	-2.58847878118858	 Bacteria	Bacteroidetes	Sphingobacteriia	Sphingobacteriales	Sphingobacteriaceae	Sphingobacterium	Unclassified_Sphingobacterium_498
0	OTU_202	5.93575947547318	NA	NA	NA	 Bacteria	Firmicutes	Clostridia	Clostridiales	Clostridiaceae	Clostridium	Unclassified_Clostridium_202
0	OTU_245	4.0187939642053	NA	NA	NA	 Bacteria	Proteobacteria	Gammaproteobacteria	Alteromonadales	Shewanellaceae	Shewanella	Unclassified_Shewanella_245
0	OTU_252	4.55373896282172	NA	NA	NA	 Bacteria	Firmicutes	Bacilli	Bacillales	Bacillaceae	Bacillus	Unclassified_Bacillus_252
3	OTU_258	4.81705812861764	3.45198691511591	1.36507121350173	2.08691570161417	Bacteria	Synergistetes	Synergistia	Synergistales	Synergistaceae	Thermanaerovibrio	Unclassified_Thermanaerovibrio_258
0	OTU_203	1.70013496903505	NA	NA	NA	 Bacteria	Proteobacteria	Betaproteobacteria	Burkholderiales	Oxalobacteraceae	Undibacterium	Unclassified_Undibacterium_203
0	OTU_218	4.11092855096421	NA	NA	NA	 Bacteria	Firmicutes	Clostridia	Clostridiales	Lachnospiraceae	Roseburia	Unclassified_Roseburia_218
0	OTU_412	5.7953517756226	NA	NA	NA	 Bacteria	Proteobacteria	Gammaproteobacteria	Enterobacteriales	Enterobacteriaceae	Citrobacter	Unclassified_Citrobacter
0	OTU_261	3.47784670367265	NA	NA	NA	 Bacteria	Proteobacteria	Gammaproteobacteria	Pseudomonadales	Moraxellaceae	Acinetobacter	Unclassified_Acinetobacter_261
0	OTU_346	2.91445154851442	NA	NA	NA	 Bacteria	Actinobacteria	Actinobacteria	Actinomycetales	Micrococcaceae	Arthrobacter	Unclassified_Arthrobacter_346
0	OTU_464	2.22689451460928	NA	NA	NA	 Bacteria	Proteobacteria	Gammaproteobacteria	Pseudomonadales	Pseudomonadaceae	Pseudomonas	Unclassified_Pseudomonas_464
0	OTU_225	6.00876073577365	NA	NA	NA	 Bacteria	Firmicutes	Bacilli	Lactobacillales	Leuconostocaceae	Leuconostoc	Unclassified_Leuconostoc_225
0	OTU_325	3.63704511553709	NA	NA	NA	 Bacteria	Proteobacteria	Gammaproteobacteria	Pseudomonadales	Moraxellaceae	Psychrobacter	Unclassified_Psychrobacter_325
0	OTU_323	1.44920408885538	NA	NA	NA	Bacteria	Proteobacteria	Alphaproteobacteria	Sneathiellales	Sneathiellaceae	Oceanibacterium	Unclassified_Oceanibacterium_323
0	OTU_250	2.94991329544852	NA	NA	NA	Bacteria	Firmicutes	Bacilli	Bacillales	Thermoactinomycetaceae	Melghirimyces	Unclassified_Melghirimyces_250
0	OTU_221	1.64085620521004	NA	NA	NA	 Bacteria	Proteobacteria	Gammaproteobacteria	Xanthomonadales	Xanthomonadaceae	Luteibacter	Unclassified_Luteibacter
0	OTU_256	1.92743317221948	NA	NA	NA	 Bacteria	Actinobacteria	Actinobacteria	Actinomycetales	Micrococcaceae	Arthrobacter	Unclassified_Arthrobacter_256
0	OTU_239	2.60782001981883	NA	NA	NA	 Bacteria	Firmicutes	Clostridia	Clostridiales	Unclassified_Clostridiales_239	Mogibacterium	Unclassified_Mogibacterium_239
0	OTU_354	2.9925610617407	NA	NA	NA	 Bacteria	Actinobacteria	Actinobacteria	Actinomycetales	Streptomycetaceae	Streptomyces	Unclassified_Streptomyces_354
0	OTU_315	3.8435811479993	NA	NA	NA	 Bacteria	Firmicutes	Bacilli	Bacillales	Bacillaceae	Oceanobacillus	Unclassified_Oceanobacillus_315
0	OTU_230	5.43973036053349	NA	NA	NA	Bacteria	Actinobacteria	Actinobacteria	Coriobacteriales	Coriobacteriaceae	Paraeggerthella	Unclassified_Paraeggerthella
0	OTU_254	4.62962201262992	NA	NA	NA	 Bacteria	Firmicutes	Clostridia	Clostridiales	Clostridiaceae	Proteiniclasticum	Unclassified_Proteiniclasticum_254
0	OTU_236	6.88568414086015	NA	NA	NA	 Bacteria	Firmicutes	Bacilli	Bacillales	Staphylococcaceae	Macrococcus	Unclassified_Macrococcus
0	OTU_234	2.97066841035642	NA	NA	NA	 Bacteria	Firmicutes	Clostridia	Clostridiales	Caldicoprobacteraceae	Caldicoprobacter	Unclassified_Caldicoprobacter_234
0	OTU_266	2.22708868854354	NA	NA	NA	 Bacteria	Proteobacteria	Gammaproteobacteria	Pseudomonadales	Moraxellaceae	Alkanindiges	Unclassified_Alkanindiges_266
0	OTU_243	2.87404441924636	NA	NA	NA	Bacteria	Proteobacteria	Alphaproteobacteria	Rhodobacterales	Rhodobacteraceae	Tropicibacter	Unclassified_Tropicibacter_243
0	OTU_422	3.51679810623485	NA	NA	NA	 Bacteria	Firmicutes	Bacilli	Bacillales	Bacillaceae	Aeribacillus	Unclassified_Aeribacillus
5	OTU_244	2.68696038544688	0.690244950170541	1.99671543527634	-1.3064704851058	 Bacteria	Bacteroidetes	Flavobacteriia	Flavobacteriales	Flavobacteriaceae	Aequorivita	Unclassified_Aequorivita
4	OTU_278	2.40405302993078	0.938714827719157	1.46533820221162	-0.526623374492466	 Bacteria	Proteobacteria	Gammaproteobacteria	Alteromonadales	Shewanellaceae	Shewanella	Unclassified_Shewanella_278
0	OTU_814	1.66684063006182	NA	NA	NA	 Bacteria	Proteobacteria	Gammaproteobacteria	Enterobacteriales	Enterobacteriaceae	Yersinia	Unclassified_Yersinia
0	OTU_271	1.82921192452136	NA	NA	NA	 Bacteria	Firmicutes	Bacilli	Bacillales	Bacillaceae	Bacillus	Unclassified_Bacillus_271
0	OTU_496	1.64677243487238	NA	NA	NA	 Bacteria	Actinobacteria	Actinobacteria	Actinomycetales	Dermabacteraceae	Brachybacterium	Unclassified_Brachybacterium
0	OTU_342	7.03579378277717	NA	NA	NA	 Bacteria	Actinobacteria	Actinobacteria	Actinomycetales	Corynebacteriaceae	Corynebacterium	Unclassified_Corynebacterium_342
4	OTU_398	3.42220895385059	1.73968067472613	1.68252827912446	0.0571523956016664	 Bacteria	Proteobacteria	Gammaproteobacteria	Chromatiales	Chromatiaceae	Rheinheimera	Unclassified_Rheinheimera_398
5	OTU_293	1.83516882836106	0.282277638124678	1.55289119023639	-1.27061355211171	 Bacteria	Proteobacteria	Alphaproteobacteria	Sphingomonadales	Sphingomonadaceae	Sphingopyxis	Unclassified_Sphingopyxis
0	OTU_268	5.0021816520771	NA	NA	NA	 Bacteria	Firmicutes	Clostridia	Clostridiales	Eubacteriaceae	Eubacterium	Unclassified_Eubacterium
0	OTU_418	3.43138320530663	NA	NA	NA	 Bacteria	Proteobacteria	Gammaproteobacteria	Pseudomonadales	Pseudomonadaceae	Pseudomonas	Unclassified_Pseudomonas_418
0	OTU_283	2.56720299843535	NA	NA	NA	Bacteria	Actinobacteria	Actinobacteria	Coriobacteriales	Coriobacteriaceae	Asaccharobacter	Unclassified_Asaccharobacter
0	OTU_298	4.78237817152371	NA	NA	NA	 Bacteria	Actinobacteria	Actinobacteria	Actinomycetales	Mycobacteriaceae	Mycobacterium	Unclassified_Mycobacterium_298
0	OTU_556	2.62954604733037	NA	NA	NA	 Bacteria	Proteobacteria	Gammaproteobacteria	Enterobacteriales	Enterobacteriaceae	Hafnia	Unclassified_Hafnia
0	OTU_393	4.12049266431417	NA	NA	NA	 Bacteria	Firmicutes	Clostridia	Clostridiales	Clostridiaceae	Tepidimicrobium	Unclassified_Tepidimicrobium_393
0	OTU_316	4.50283279054055	NA	NA	NA	Bacteria	Tenericutes	Mollicutes	Anaeroplasmatales	Anaeroplasmataceae	Anaeroplasma	Unclassified_Anaeroplasma_316
0	OTU_465	3.01187444751588	NA	NA	NA	Bacteria	Proteobacteria	Alphaproteobacteria	Rhizobiales	Rhodobiaceae	Lutibaculum	Unclassified_Lutibaculum_465
0	OTU_326	4.03503031608397	NA	NA	NA	 Bacteria	Firmicutes	Bacilli	Lactobacillales	Lactobacillaceae	Pediococcus	Unclassified_Pediococcus
0	OTU_321	1.60089464955765	NA	NA	NA	 Bacteria	Proteobacteria	Alphaproteobacteria	Sphingomonadales	Sphingomonadaceae	Novosphingobium	Unclassified_Novosphingobium_321
0	OTU_405	2.36845127346309	NA	NA	NA	 Bacteria	Firmicutes	Bacilli	Bacillales	Bacillaceae	Bacillus	Unclassified_Bacillus_405
0	OTU_566	3.97907316611931	NA	NA	NA	 Bacteria	Firmicutes	Bacilli	Lactobacillales	Lactobacillaceae	Lactobacillus	Unclassified_Lactobacillus_566
0	OTU_411	2.80085805292144	NA	NA	NA	 Bacteria	Actinobacteria	Actinobacteria	Bifidobacteriales	Bifidobacteriaceae	Bifidobacterium	Unclassified_Bifidobacterium_411
0	OTU_287	3.53877210181016	NA	NA	NA	Bacteria	Firmicutes	Clostridia	Clostridiales	Unclassified_Clostridiales_287	Fusibacter	Unclassified_Fusibacter_287
0	OTU_491	6.47305696747121	NA	NA	NA	 Bacteria	Firmicutes	Bacilli	Bacillales	Bacillaceae	Lysinibacillus	Unclassified_Lysinibacillus_491
0	OTU_344	4.06433415505644	NA	NA	NA	 Bacteria	Bacteroidetes	Bacteroidia	Bacteroidales	Bacteroidaceae	Bacteroides	Unclassified_Bacteroides_344
2	OTU_384	5.64760038184606	1.22982058400702	4.41777979783904	-3.18795921383202	Bacteria	Cyanobacteria	Unclassified_Cyanobacteria_384	Oscillatoriales	Unclassified_Oscillatoriales_384	Planktothrix	Unclassified_Planktothrix_384
0	OTU_311	2.6286061692714	NA	NA	NA	 Bacteria	Firmicutes	Clostridia	Clostridiales	Clostridiaceae	Tepidimicrobium	Unclassified_Tepidimicrobium_311
0	OTU_302	4.47776182978458	NA	NA	NA	Bacteria	Proteobacteria	Alphaproteobacteria	Rhodobacterales	Rhodobacteraceae	Tropicibacter	Unclassified_Tropicibacter_302
0	OTU_303	3.87852272848907	NA	NA	NA	 Bacteria	Firmicutes	Clostridia	Clostridiales	Unclassified_Clostridiales_303	Mogibacterium	Unclassified_Mogibacterium_303
0	OTU_625	7.17525719512722	NA	NA	NA	 Bacteria	Firmicutes	Bacilli	Lactobacillales	Lactobacillaceae	Lactobacillus	Unclassified_Lactobacillus_625
0	OTU_414	1.49413282432076	NA	NA	NA	 Bacteria	Proteobacteria	Gammaproteobacteria	Xanthomonadales	Xanthomonadaceae	Xanthomonas	Unclassified_Xanthomonas
0	OTU_432	5.84727325253576	NA	NA	NA	 Bacteria	Firmicutes	Negativicutes	Selenomonadales	Veillonellaceae	Megasphaera	Unclassified_Megasphaera
0	OTU_602	4.18978428085397	NA	NA	NA	 Bacteria	Firmicutes	Bacilli	Bacillales	Bacillaceae	Bacillus	Unclassified_Bacillus_602
0	OTU_628	4.39074125460204	NA	NA	NA	 Bacteria	Firmicutes	Bacilli	Bacillales	Bacillaceae	Geobacillus	Unclassified_Geobacillus_628
0	OTU_322	3.52430453865321	NA	NA	NA	 Bacteria	Deinococcus-Thermus	Deinococci	Thermales	Thermaceae	Meiothermus	Unclassified_Meiothermus
0	OTU_324	4.42212636559825	NA	NA	NA	 Bacteria	Firmicutes	Bacilli	Lactobacillales	Lactobacillaceae	Lactobacillus	Unclassified_Lactobacillus_324
0	OTU_512	4.35448130651071	NA	NA	NA	 Bacteria	Firmicutes	Bacilli	Bacillales	Bacillaceae	Oceanobacillus	Unclassified_Oceanobacillus_512
0	OTU_522	2.3533567543055	NA	NA	NA	 Bacteria	Proteobacteria	Gammaproteobacteria	Alteromonadales	Alteromonadaceae	Marinobacter	Unclassified_Marinobacter_522
0	OTU_542	1.14807829399278	NA	NA	NA	 Bacteria	Actinobacteria	Actinobacteria	Actinomycetales	Actinomycetaceae	Actinomyces	Unclassified_Actinomyces_542
0	OTU_492	2.23834472567957	NA	NA	NA	 Bacteria	Proteobacteria	Gammaproteobacteria	Pasteurellales	Pasteurellaceae	Haemophilus	Unclassified_Haemophilus_492
0	OTU_768	3.16557430004211	NA	NA	NA	 Bacteria	Actinobacteria	Actinobacteria	Actinomycetales	Microbacteriaceae	Leucobacter	Unclassified_Leucobacter_768
0	OTU_401	2.16074751223567	NA	NA	NA	 Bacteria	Firmicutes	Bacilli	Lactobacillales	Aerococcaceae	Aerococcus	Unclassified_Aerococcus_401
0	OTU_914	3.1544070487203	NA	NA	NA	 Bacteria	Proteobacteria	Gammaproteobacteria	Pseudomonadales	Pseudomonadaceae	Pseudomonas	Unclassified_Pseudomonas_914
2	OTU_641	5.2878282023959	1.19059539518151	4.09723280721439	-2.90663741203289	 Bacteria	Proteobacteria	Gammaproteobacteria	Pseudomonadales	Moraxellaceae	Acinetobacter	Unclassified_Acinetobacter_641
1	OTU_1684	13.9939179969732	7.22580425261039	6.76811374436285	0.457690508247548	 Bacteria	Firmicutes	Clostridia	Clostridiales	Unclassified_Clostridiales_1684	Peptoniphilus	Unclassified_Peptoniphilus_1684
0	OTU_1371	2.12697420980387	NA	NA	NA	 Bacteria	Proteobacteria	Alphaproteobacteria	Sphingomonadales	Sphingomonadaceae	Sphingomonas	Unclassified_Sphingomonas_1371
0	OTU_1512	7.55392506558137	NA	NA	NA	Bacteria	Actinobacteria	Actinobacteria	Actinomycetales	Pseudonocardiaceae	Labedaea	Unclassified_Labedaea
0	OTU_865	5.24934339236868	NA	NA	NA	 Bacteria	Firmicutes	Erysipelotrichia	Erysipelotrichales	Erysipelotrichaceae	Erysipelothrix	Unclassified_Erysipelothrix_865
0	OTU_1425	1.9184322629252	NA	NA	NA	 Bacteria	Proteobacteria	Alphaproteobacteria	Rhodobacterales	Rhodobacteraceae	Tateyamaria	Unclassified_Tateyamaria
0	OTU_1449	1.36418188800315	NA	NA	NA	 Bacteria	Proteobacteria	Alphaproteobacteria	Rhizobiales	Methylobacteriaceae	Methylobacterium	Unclassified_Methylobacterium_1449
0	OTU_1330	3.29446859815482	NA	NA	NA	Bacteria	Cyanobacteria	Unclassified_Cyanobacteria_1330	Oscillatoriales	Unclassified_Oscillatoriales_1330	Planktothrix	Unclassified_Planktothrix_1330
0	OTU_1480	2.39535780341962	NA	NA	NA	 Bacteria	Actinobacteria	Actinobacteria	Actinomycetales	Microbacteriaceae	Salinibacterium	Unclassified_Salinibacterium
0	OTU_1495	4.97207185702398	NA	NA	NA	Bacteria	Firmicutes	Clostridia	Clostridiales	Unclassified_Clostridiales_1495	Sporanaerobacter	Unclassified_Sporanaerobacter_1495
0	OTU_1688	4.24898225574432	NA	NA	NA	 Bacteria	Proteobacteria	Gammaproteobacteria	Alteromonadales	Moritellaceae	Moritella	Unclassified_Moritella_1688
