INDEX VERSION 1.130+C:\Users\Lenovo\Desktop\Project\.metadata\.plugins\org.eclipse.jdt.core
2593705439.index
331074855.index
2071462652.index
1127722141.index
1991064192.index
4167418401.index
3470739580.index
1172913984.index
3703908070.index
2919056830.index
2782998763.index
2256529200.index
1552878334.index
3175309738.index
2006079928.index
226831990.index
2864512489.index
3470154767.index
303816160.index
3211443750.index
2194716159.index
1647306921.index
2616923935.index
3100202246.index
2902840291.index
1786213409.index
493762239.index
2556463141.index
3566089501.index
3954963071.index
3685031974.index
724112727.index
3412234828.index
3355708150.index
1737575566.index
769783516.index
918197086.index
127075646.index
3260422705.index
25719217.index
3384257139.index
1227306570.index
114842010.index
2500705029.index
851967107.index
542394892.index
1460672587.index
3396503471.index
3331504834.index
2210773320.index
451226928.index
3888827764.index
2143465359.index
553130259.index
2413328645.index
4278764599.index
2130565040.index
585472926.index
2733622157.index
3300596117.index
3984554174.index
3242034012.index
2045318433.index
530480302.index
3098243908.index
35212824.index
3729257151.index
1458595765.index
3840448539.index
2103812182.index
401767567.index
3312165055.index
1296033504.index
2653330038.index
157152999.index
2659493963.index
578789385.index
979240095.index
412588034.index
198133219.index
2195795875.index
4038421125.index
1609818966.index
2758576337.index
415431168.index
743109110.index
2096793336.index
2760557627.index
2613528357.index
2455384232.index
637468804.index
75335440.index
4245812523.index
2287252768.index
4203003851.index
2561767932.index
951157909.index
3852244655.index
3532552576.index
3283956519.index
563867080.index
2935194562.index
3435648363.index
