%YAML 1.1
%TAG !u! tag:unity3d.com,2011:
--- !u!74 &7400000
AnimationClip:
  m_ObjectHideFlags: 0
  m_CorrespondingSourceObject: {fileID: 0}
  m_PrefabInstance: {fileID: 0}
  m_PrefabAsset: {fileID: 0}
  m_Name: Shoot
  serializedVersion: 7
  m_Legacy: 0
  m_Compressed: 0
  m_UseHighQualityCurve: 1
  m_RotationCurves: []
  m_CompressedRotationCurves: []
  m_EulerCurves: []
  m_PositionCurves: []
  m_ScaleCurves: []
  m_FloatCurves: []
  m_PPtrCurves:
  - serializedVersion: 2
    curve:
    - time: 0
      value: {fileID: 1954604780, guid: cac38e7892e255649a870fbe8905007c, type: 3}
    - time: 0.1
      value: {fileID: 1792188582, guid: cac38e7892e255649a870fbe8905007c, type: 3}
    - time: 0.21666667
      value: {fileID: 1137995544, guid: cac38e7892e255649a870fbe8905007c, type: 3}
    - time: 0.31666666
      value: {fileID: 693214293, guid: cac38e7892e255649a870fbe8905007c, type: 3}
    - time: 0.41666666
      value: {fileID: 1853945494, guid: cac38e7892e255649a870fbe8905007c, type: 3}
    - time: 0.51666665
      value: {fileID: 1378531298, guid: cac38e7892e255649a870fbe8905007c, type: 3}
    - time: 0.6333333
      value: {fileID: -1427277790, guid: 33862b4c4bbe02a48b67517f734ec890, type: 3}
    - time: 0.73333335
      value: {fileID: 1569220244, guid: 33862b4c4bbe02a48b67517f734ec890, type: 3}
    attribute: m_Sprite
    path: 
    classID: 212
    script: {fileID: 0}
    flags: 2
  m_SampleRate: 60
  m_WrapMode: 0
  m_Bounds:
    m_Center: {x: 0, y: 0, z: 0}
    m_Extent: {x: 0, y: 0, z: 0}
  m_ClipBindingConstant:
    genericBindings:
    - serializedVersion: 2
      path: 0
      attribute: 0
      script: {fileID: 0}
      typeID: 212
      customType: 23
      isPPtrCurve: 1
      isIntCurve: 0
      isSerializeReferenceCurve: 0
    pptrCurveMapping:
    - {fileID: 1954604780, guid: cac38e7892e255649a870fbe8905007c, type: 3}
    - {fileID: 1792188582, guid: cac38e7892e255649a870fbe8905007c, type: 3}
    - {fileID: 1137995544, guid: cac38e7892e255649a870fbe8905007c, type: 3}
    - {fileID: 693214293, guid: cac38e7892e255649a870fbe8905007c, type: 3}
    - {fileID: 1853945494, guid: cac38e7892e255649a870fbe8905007c, type: 3}
    - {fileID: 1378531298, guid: cac38e7892e255649a870fbe8905007c, type: 3}
    - {fileID: -1427277790, guid: 33862b4c4bbe02a48b67517f734ec890, type: 3}
    - {fileID: 1569220244, guid: 33862b4c4bbe02a48b67517f734ec890, type: 3}
  m_AnimationClipSettings:
    serializedVersion: 2
    m_AdditiveReferencePoseClip: {fileID: 0}
    m_AdditiveReferencePoseTime: 0
    m_StartTime: 0
    m_StopTime: 0.75
    m_OrientationOffsetY: 0
    m_Level: 0
    m_CycleOffset: 0
    m_HasAdditiveReferencePose: 0
    m_LoopTime: 1
    m_LoopBlend: 0
    m_LoopBlendOrientation: 0
    m_LoopBlendPositionY: 0
    m_LoopBlendPositionXZ: 0
    m_KeepOriginalOrientation: 0
    m_KeepOriginalPositionY: 1
    m_KeepOriginalPositionXZ: 0
    m_HeightFromFeet: 0
    m_Mirror: 0
  m_EditorCurves: []
  m_EulerEditorCurves: []
  m_HasGenericRootTransform: 0
  m_HasMotionFloatCurves: 0
  m_Events: []
