%YAML 1.1
%TAG !u! tag:unity3d.com,2011:
--- !u!1 &3181471301081859690
GameObject:
  m_ObjectHideFlags: 0
  m_CorrespondingSourceObject: {fileID: 0}
  m_PrefabInstance: {fileID: 0}
  m_PrefabAsset: {fileID: 0}
  serializedVersion: 6
  m_Component:
  - component: {fileID: 6784613896431114918}
  - component: {fileID: 7535334962792500887}
  - component: {fileID: 7548174826401634071}
  m_Layer: 0
  m_Name: Layer1
  m_TagString: Untagged
  m_Icon: {fileID: 0}
  m_NavMeshLayer: 0
  m_StaticEditorFlags: 0
  m_IsActive: 1
--- !u!4 &6784613896431114918
Transform:
  m_ObjectHideFlags: 0
  m_CorrespondingSourceObject: {fileID: 0}
  m_PrefabInstance: {fileID: 0}
  m_PrefabAsset: {fileID: 0}
  m_GameObject: {fileID: 3181471301081859690}
  serializedVersion: 2
  m_LocalRotation: {x: -0, y: -0, z: -0, w: 1}
  m_LocalPosition: {x: 0, y: 0, z: 0}
  m_LocalScale: {x: 1, y: 1, z: 1}
  m_ConstrainProportionsScale: 0
  m_Children: []
  m_Father: {fileID: 8747549146146071487}
  m_LocalEulerAnglesHint: {x: 0, y: 0, z: 0}
--- !u!1839735485 &7535334962792500887
Tilemap:
  m_ObjectHideFlags: 0
  m_CorrespondingSourceObject: {fileID: 0}
  m_PrefabInstance: {fileID: 0}
  m_PrefabAsset: {fileID: 0}
  m_GameObject: {fileID: 3181471301081859690}
  m_Enabled: 1
  m_Tiles:
  - first: {x: -1, y: -7, z: 0}
    second:
      serializedVersion: 2
      m_TileIndex: 32
      m_TileSpriteIndex: 32
      m_TileMatrixIndex: 0
      m_TileColorIndex: 0
      m_TileObjectToInstantiateIndex: 65535
      dummyAlignment: 0
      m_AllTileFlags: 1073741825
  - first: {x: 2, y: -7, z: 0}
    second:
      serializedVersion: 2
      m_TileIndex: 33
      m_TileSpriteIndex: 33
      m_TileMatrixIndex: 0
      m_TileColorIndex: 0
      m_TileObjectToInstantiateIndex: 65535
      dummyAlignment: 0
      m_AllTileFlags: 1073741825
  - first: {x: 4, y: -7, z: 0}
    second:
      serializedVersion: 2
      m_TileIndex: 34
      m_TileSpriteIndex: 34
      m_TileMatrixIndex: 0
      m_TileColorIndex: 0
      m_TileObjectToInstantiateIndex: 65535
      dummyAlignment: 0
      m_AllTileFlags: 1073741825
  - first: {x: 5, y: -7, z: 0}
    second:
      serializedVersion: 2
      m_TileIndex: 35
      m_TileSpriteIndex: 35
      m_TileMatrixIndex: 0
      m_TileColorIndex: 0
      m_TileObjectToInstantiateIndex: 65535
      dummyAlignment: 0
      m_AllTileFlags: 1073741825
  - first: {x: 6, y: -7, z: 0}
    second:
      serializedVersion: 2
      m_TileIndex: 36
      m_TileSpriteIndex: 36
      m_TileMatrixIndex: 0
      m_TileColorIndex: 0
      m_TileObjectToInstantiateIndex: 65535
      dummyAlignment: 0
      m_AllTileFlags: 1073741825
  - first: {x: -1, y: -6, z: 0}
    second:
      serializedVersion: 2
      m_TileIndex: 29
      m_TileSpriteIndex: 29
      m_TileMatrixIndex: 0
      m_TileColorIndex: 0
      m_TileObjectToInstantiateIndex: 65535
      dummyAlignment: 0
      m_AllTileFlags: 1073741825
  - first: {x: 1, y: -6, z: 0}
    second:
      serializedVersion: 2
      m_TileIndex: 30
      m_TileSpriteIndex: 30
      m_TileMatrixIndex: 0
      m_TileColorIndex: 0
      m_TileObjectToInstantiateIndex: 65535
      dummyAlignment: 0
      m_AllTileFlags: 1073741825
  - first: {x: 2, y: -6, z: 0}
    second:
      serializedVersion: 2
      m_TileIndex: 31
      m_TileSpriteIndex: 31
      m_TileMatrixIndex: 0
      m_TileColorIndex: 0
      m_TileObjectToInstantiateIndex: 65535
      dummyAlignment: 0
      m_AllTileFlags: 1073741825
  - first: {x: 4, y: -5, z: 0}
    second:
      serializedVersion: 2
      m_TileIndex: 25
      m_TileSpriteIndex: 25
      m_TileMatrixIndex: 0
      m_TileColorIndex: 0
      m_TileObjectToInstantiateIndex: 65535
      dummyAlignment: 0
      m_AllTileFlags: 1073741825
  - first: {x: 6, y: -5, z: 0}
    second:
      serializedVersion: 2
      m_TileIndex: 26
      m_TileSpriteIndex: 26
      m_TileMatrixIndex: 0
      m_TileColorIndex: 0
      m_TileObjectToInstantiateIndex: 65535
      dummyAlignment: 0
      m_AllTileFlags: 1073741825
  - first: {x: 7, y: -5, z: 0}
    second:
      serializedVersion: 2
      m_TileIndex: 27
      m_TileSpriteIndex: 27
      m_TileMatrixIndex: 0
      m_TileColorIndex: 0
      m_TileObjectToInstantiateIndex: 65535
      dummyAlignment: 0
      m_AllTileFlags: 1073741825
  - first: {x: 8, y: -5, z: 0}
    second:
      serializedVersion: 2
      m_TileIndex: 28
      m_TileSpriteIndex: 28
      m_TileMatrixIndex: 0
      m_TileColorIndex: 0
      m_TileObjectToInstantiateIndex: 65535
      dummyAlignment: 0
      m_AllTileFlags: 1073741825
  - first: {x: 8, y: -4, z: 0}
    second:
      serializedVersion: 2
      m_TileIndex: 24
      m_TileSpriteIndex: 24
      m_TileMatrixIndex: 0
      m_TileColorIndex: 0
      m_TileObjectToInstantiateIndex: 65535
      dummyAlignment: 0
      m_AllTileFlags: 1073741825
  - first: {x: -1, y: -3, z: 0}
    second:
      serializedVersion: 2
      m_TileIndex: 18
      m_TileSpriteIndex: 18
      m_TileMatrixIndex: 0
      m_TileColorIndex: 0
      m_TileObjectToInstantiateIndex: 65535
      dummyAlignment: 0
      m_AllTileFlags: 1073741825
  - first: {x: 0, y: -3, z: 0}
    second:
      serializedVersion: 2
      m_TileIndex: 19
      m_TileSpriteIndex: 19
      m_TileMatrixIndex: 0
      m_TileColorIndex: 0
      m_TileObjectToInstantiateIndex: 65535
      dummyAlignment: 0
      m_AllTileFlags: 1073741825
  - first: {x: 1, y: -3, z: 0}
    second:
      serializedVersion: 2
      m_TileIndex: 20
      m_TileSpriteIndex: 20
      m_TileMatrixIndex: 0
      m_TileColorIndex: 0
      m_TileObjectToInstantiateIndex: 65535
      dummyAlignment: 0
      m_AllTileFlags: 1073741825
  - first: {x: 4, y: -3, z: 0}
    second:
      serializedVersion: 2
      m_TileIndex: 21
      m_TileSpriteIndex: 21
      m_TileMatrixIndex: 0
      m_TileColorIndex: 0
      m_TileObjectToInstantiateIndex: 65535
      dummyAlignment: 0
      m_AllTileFlags: 1073741825
  - first: {x: 5, y: -3, z: 0}
    second:
      serializedVersion: 2
      m_TileIndex: 22
      m_TileSpriteIndex: 22
      m_TileMatrixIndex: 0
      m_TileColorIndex: 0
      m_TileObjectToInstantiateIndex: 65535
      dummyAlignment: 0
      m_AllTileFlags: 1073741825
  - first: {x: 6, y: -3, z: 0}
    second:
      serializedVersion: 2
      m_TileIndex: 23
      m_TileSpriteIndex: 23
      m_TileMatrixIndex: 0
      m_TileColorIndex: 0
      m_TileObjectToInstantiateIndex: 65535
      dummyAlignment: 0
      m_AllTileFlags: 1073741825
  - first: {x: 4, y: -2, z: 0}
    second:
      serializedVersion: 2
      m_TileIndex: 15
      m_TileSpriteIndex: 15
      m_TileMatrixIndex: 0
      m_TileColorIndex: 0
      m_TileObjectToInstantiateIndex: 65535
      dummyAlignment: 0
      m_AllTileFlags: 1073741825
  - first: {x: 5, y: -2, z: 0}
    second:
      serializedVersion: 2
      m_TileIndex: 16
      m_TileSpriteIndex: 16
      m_TileMatrixIndex: 0
      m_TileColorIndex: 0
      m_TileObjectToInstantiateIndex: 65535
      dummyAlignment: 0
      m_AllTileFlags: 1073741825
  - first: {x: 6, y: -2, z: 0}
    second:
      serializedVersion: 2
      m_TileIndex: 17
      m_TileSpriteIndex: 17
      m_TileMatrixIndex: 0
      m_TileColorIndex: 0
      m_TileObjectToInstantiateIndex: 65535
      dummyAlignment: 0
      m_AllTileFlags: 1073741825
  - first: {x: -1, y: -1, z: 0}
    second:
      serializedVersion: 2
      m_TileIndex: 9
      m_TileSpriteIndex: 9
      m_TileMatrixIndex: 0
      m_TileColorIndex: 0
      m_TileObjectToInstantiateIndex: 65535
      dummyAlignment: 0
      m_AllTileFlags: 1073741825
  - first: {x: 0, y: -1, z: 0}
    second:
      serializedVersion: 2
      m_TileIndex: 10
      m_TileSpriteIndex: 10
      m_TileMatrixIndex: 0
      m_TileColorIndex: 0
      m_TileObjectToInstantiateIndex: 65535
      dummyAlignment: 0
      m_AllTileFlags: 1073741825
  - first: {x: 1, y: -1, z: 0}
    second:
      serializedVersion: 2
      m_TileIndex: 11
      m_TileSpriteIndex: 11
      m_TileMatrixIndex: 0
      m_TileColorIndex: 0
      m_TileObjectToInstantiateIndex: 65535
      dummyAlignment: 0
      m_AllTileFlags: 1073741825
  - first: {x: 4, y: -1, z: 0}
    second:
      serializedVersion: 2
      m_TileIndex: 12
      m_TileSpriteIndex: 12
      m_TileMatrixIndex: 0
      m_TileColorIndex: 0
      m_TileObjectToInstantiateIndex: 65535
      dummyAlignment: 0
      m_AllTileFlags: 1073741825
  - first: {x: 5, y: -1, z: 0}
    second:
      serializedVersion: 2
      m_TileIndex: 13
      m_TileSpriteIndex: 13
      m_TileMatrixIndex: 0
      m_TileColorIndex: 0
      m_TileObjectToInstantiateIndex: 65535
      dummyAlignment: 0
      m_AllTileFlags: 1073741825
  - first: {x: 6, y: -1, z: 0}
    second:
      serializedVersion: 2
      m_TileIndex: 14
      m_TileSpriteIndex: 14
      m_TileMatrixIndex: 0
      m_TileColorIndex: 0
      m_TileObjectToInstantiateIndex: 65535
      dummyAlignment: 0
      m_AllTileFlags: 1073741825
  - first: {x: -1, y: 0, z: 0}
    second:
      serializedVersion: 2
      m_TileIndex: 6
      m_TileSpriteIndex: 6
      m_TileMatrixIndex: 0
      m_TileColorIndex: 0
      m_TileObjectToInstantiateIndex: 65535
      dummyAlignment: 0
      m_AllTileFlags: 1073741825
  - first: {x: 0, y: 0, z: 0}
    second:
      serializedVersion: 2
      m_TileIndex: 7
      m_TileSpriteIndex: 7
      m_TileMatrixIndex: 0
      m_TileColorIndex: 0
      m_TileObjectToInstantiateIndex: 65535
      dummyAlignment: 0
      m_AllTileFlags: 1073741825
  - first: {x: 1, y: 0, z: 0}
    second:
      serializedVersion: 2
      m_TileIndex: 8
      m_TileSpriteIndex: 8
      m_TileMatrixIndex: 0
      m_TileColorIndex: 0
      m_TileObjectToInstantiateIndex: 65535
      dummyAlignment: 0
      m_AllTileFlags: 1073741825
  - first: {x: -1, y: 1, z: 0}
    second:
      serializedVersion: 2
      m_TileIndex: 0
      m_TileSpriteIndex: 0
      m_TileMatrixIndex: 0
      m_TileColorIndex: 0
      m_TileObjectToInstantiateIndex: 65535
      dummyAlignment: 0
      m_AllTileFlags: 1073741825
  - first: {x: 0, y: 1, z: 0}
    second:
      serializedVersion: 2
      m_TileIndex: 1
      m_TileSpriteIndex: 1
      m_TileMatrixIndex: 0
      m_TileColorIndex: 0
      m_TileObjectToInstantiateIndex: 65535
      dummyAlignment: 0
      m_AllTileFlags: 1073741825
  - first: {x: 1, y: 1, z: 0}
    second:
      serializedVersion: 2
      m_TileIndex: 2
      m_TileSpriteIndex: 2
      m_TileMatrixIndex: 0
      m_TileColorIndex: 0
      m_TileObjectToInstantiateIndex: 65535
      dummyAlignment: 0
      m_AllTileFlags: 1073741825
  - first: {x: 4, y: 1, z: 0}
    second:
      serializedVersion: 2
      m_TileIndex: 3
      m_TileSpriteIndex: 3
      m_TileMatrixIndex: 0
      m_TileColorIndex: 0
      m_TileObjectToInstantiateIndex: 65535
      dummyAlignment: 0
      m_AllTileFlags: 1073741825
  - first: {x: 5, y: 1, z: 0}
    second:
      serializedVersion: 2
      m_TileIndex: 4
      m_TileSpriteIndex: 4
      m_TileMatrixIndex: 0
      m_TileColorIndex: 0
      m_TileObjectToInstantiateIndex: 65535
      dummyAlignment: 0
      m_AllTileFlags: 1073741825
  - first: {x: 6, y: 1, z: 0}
    second:
      serializedVersion: 2
      m_TileIndex: 5
      m_TileSpriteIndex: 5
      m_TileMatrixIndex: 0
      m_TileColorIndex: 0
      m_TileObjectToInstantiateIndex: 65535
      dummyAlignment: 0
      m_AllTileFlags: 1073741825
  m_AnimatedTiles: {}
  m_TileAssetArray:
  - m_RefCount: 1
    m_Data: {fileID: 11400000, guid: 7bd6fde02b0a9cd438373f3f8b528a51, type: 2}
  - m_RefCount: 1
    m_Data: {fileID: 11400000, guid: 0383647d5ea9ffd4490eedfbf2d05b3e, type: 2}
  - m_RefCount: 1
    m_Data: {fileID: 11400000, guid: e9c6f065f525f564d9e9e86479768ba2, type: 2}
  - m_RefCount: 1
    m_Data: {fileID: 11400000, guid: 347d6f86c102b5f4bbc5bf1112506b75, type: 2}
  - m_RefCount: 1
    m_Data: {fileID: 11400000, guid: 9995b145cde614f4ea8d00aedbf5a33b, type: 2}
  - m_RefCount: 1
    m_Data: {fileID: 11400000, guid: e6bcc6315472e5848ae2364019ac4f71, type: 2}
  - m_RefCount: 1
    m_Data: {fileID: 11400000, guid: f21d119540b4d694d85afd2233b532bf, type: 2}
  - m_RefCount: 1
    m_Data: {fileID: 11400000, guid: 0629f5b13d2ed824095b8502eedefaf1, type: 2}
  - m_RefCount: 1
    m_Data: {fileID: 11400000, guid: abffb8df0a5bc1a40bc4e56452f611ce, type: 2}
  - m_RefCount: 1
    m_Data: {fileID: 11400000, guid: 294611356047a884b96b7ab80aa7f7e6, type: 2}
  - m_RefCount: 1
    m_Data: {fileID: 11400000, guid: 243c7ad75051d8d47bee10d540c2b7c1, type: 2}
  - m_RefCount: 1
    m_Data: {fileID: 11400000, guid: a3eb99e6489f06849bf54772b53c8520, type: 2}
  - m_RefCount: 1
    m_Data: {fileID: 11400000, guid: 8f4289f6fdc7da444bf65c51957f29ec, type: 2}
  - m_RefCount: 1
    m_Data: {fileID: 11400000, guid: e3ba2e570e5ca4245affa02a2b818c55, type: 2}
  - m_RefCount: 1
    m_Data: {fileID: 11400000, guid: e80d5f01f3f059447ac4079cd1d46aa2, type: 2}
  - m_RefCount: 1
    m_Data: {fileID: 11400000, guid: caaa58e05d1dee342b2d32d8e9c57e0d, type: 2}
  - m_RefCount: 1
    m_Data: {fileID: 11400000, guid: 88ddf3e195036a1429711a9f28e84218, type: 2}
  - m_RefCount: 1
    m_Data: {fileID: 11400000, guid: acbed18aebfdf844695c8d038c83c377, type: 2}
  - m_RefCount: 1
    m_Data: {fileID: 11400000, guid: 0a745222d9557bc4b9afba87bc56e70f, type: 2}
  - m_RefCount: 1
    m_Data: {fileID: 11400000, guid: 365f80043df0dc34488ca41c4836a6e1, type: 2}
  - m_RefCount: 1
    m_Data: {fileID: 11400000, guid: 055d4a256d65f9744b3fd3845e361400, type: 2}
  - m_RefCount: 1
    m_Data: {fileID: 11400000, guid: d75415da868073d4eb80adee57403f18, type: 2}
  - m_RefCount: 1
    m_Data: {fileID: 11400000, guid: 814c7c087cb34bb4b9b262260ef8343d, type: 2}
  - m_RefCount: 1
    m_Data: {fileID: 11400000, guid: 2b93279c042aabf43a45ace2117e0d61, type: 2}
  - m_RefCount: 1
    m_Data: {fileID: 11400000, guid: 9571bc54d992d3040ae1c8d101fa18e4, type: 2}
  - m_RefCount: 1
    m_Data: {fileID: 11400000, guid: 8bb8fdb3012b8b348b2c83252bdf0862, type: 2}
  - m_RefCount: 1
    m_Data: {fileID: 11400000, guid: f0e230700cd0a3d438d220a47a474982, type: 2}
  - m_RefCount: 1
    m_Data: {fileID: 11400000, guid: 8fe2a40ef0831474f8ea625e9211132c, type: 2}
  - m_RefCount: 1
    m_Data: {fileID: 11400000, guid: c1f51c4cfd5a907479b2a2e20cc9d466, type: 2}
  - m_RefCount: 1
    m_Data: {fileID: 11400000, guid: c6f3469c45dee524c86834bb546724dd, type: 2}
  - m_RefCount: 1
    m_Data: {fileID: 11400000, guid: 9bae001537c5cb54e93901d660ef33cd, type: 2}
  - m_RefCount: 1
    m_Data: {fileID: 11400000, guid: d1d54cee9833b354faf66142d6a74902, type: 2}
  - m_RefCount: 1
    m_Data: {fileID: 11400000, guid: 3199804603396a5419518d29fa5bdec2, type: 2}
  - m_RefCount: 1
    m_Data: {fileID: 11400000, guid: 47dcc42c57cce2c469662ccf16ded170, type: 2}
  - m_RefCount: 1
    m_Data: {fileID: 11400000, guid: a998cb705e5250f4682da9bd1afa60a7, type: 2}
  - m_RefCount: 1
    m_Data: {fileID: 11400000, guid: 514106da27f9b6f42a4ac9563562baef, type: 2}
  - m_RefCount: 1
    m_Data: {fileID: 11400000, guid: f4e89c1912281be40aafa043090f6763, type: 2}
  m_TileSpriteArray:
  - m_RefCount: 1
    m_Data: {fileID: 1900785469, guid: 1db1cccc3063dad49a76b436c3011b30, type: 3}
  - m_RefCount: 1
    m_Data: {fileID: -1172854888, guid: 1db1cccc3063dad49a76b436c3011b30, type: 3}
  - m_RefCount: 1
    m_Data: {fileID: 833250094, guid: 1db1cccc3063dad49a76b436c3011b30, type: 3}
  - m_RefCount: 1
    m_Data: {fileID: -506210622, guid: 1db1cccc3063dad49a76b436c3011b30, type: 3}
  - m_RefCount: 1
    m_Data: {fileID: -1464547252, guid: 1db1cccc3063dad49a76b436c3011b30, type: 3}
  - m_RefCount: 1
    m_Data: {fileID: 1270174932, guid: 1db1cccc3063dad49a76b436c3011b30, type: 3}
  - m_RefCount: 1
    m_Data: {fileID: 153474811, guid: 1db1cccc3063dad49a76b436c3011b30, type: 3}
  - m_RefCount: 1
    m_Data: {fileID: 1321784208, guid: 1db1cccc3063dad49a76b436c3011b30, type: 3}
  - m_RefCount: 1
    m_Data: {fileID: 1552499007, guid: 1db1cccc3063dad49a76b436c3011b30, type: 3}
  - m_RefCount: 1
    m_Data: {fileID: -1607357888, guid: 1db1cccc3063dad49a76b436c3011b30, type: 3}
  - m_RefCount: 1
    m_Data: {fileID: 1207579639, guid: 1db1cccc3063dad49a76b436c3011b30, type: 3}
  - m_RefCount: 1
    m_Data: {fileID: -152445604, guid: 1db1cccc3063dad49a76b436c3011b30, type: 3}
  - m_RefCount: 1
    m_Data: {fileID: -827953260, guid: 1db1cccc3063dad49a76b436c3011b30, type: 3}
  - m_RefCount: 1
    m_Data: {fileID: 521430120, guid: 1db1cccc3063dad49a76b436c3011b30, type: 3}
  - m_RefCount: 1
    m_Data: {fileID: 431894550, guid: 1db1cccc3063dad49a76b436c3011b30, type: 3}
  - m_RefCount: 1
    m_Data: {fileID: -1185757111, guid: 1db1cccc3063dad49a76b436c3011b30, type: 3}
  - m_RefCount: 1
    m_Data: {fileID: 928219274, guid: 1db1cccc3063dad49a76b436c3011b30, type: 3}
  - m_RefCount: 1
    m_Data: {fileID: 22696209, guid: 1db1cccc3063dad49a76b436c3011b30, type: 3}
  - m_RefCount: 1
    m_Data: {fileID: -2072852025, guid: 1db1cccc3063dad49a76b436c3011b30, type: 3}
  - m_RefCount: 1
    m_Data: {fileID: 1548181238, guid: 1db1cccc3063dad49a76b436c3011b30, type: 3}
  - m_RefCount: 1
    m_Data: {fileID: 1617202373, guid: 1db1cccc3063dad49a76b436c3011b30, type: 3}
  - m_RefCount: 1
    m_Data: {fileID: -1025358447, guid: 1db1cccc3063dad49a76b436c3011b30, type: 3}
  - m_RefCount: 1
    m_Data: {fileID: 1954844621, guid: 1db1cccc3063dad49a76b436c3011b30, type: 3}
  - m_RefCount: 1
    m_Data: {fileID: -2048666992, guid: 1db1cccc3063dad49a76b436c3011b30, type: 3}
  - m_RefCount: 1
    m_Data: {fileID: 243468124, guid: 1db1cccc3063dad49a76b436c3011b30, type: 3}
  - m_RefCount: 1
    m_Data: {fileID: 1513950195, guid: 1db1cccc3063dad49a76b436c3011b30, type: 3}
  - m_RefCount: 1
    m_Data: {fileID: -1808718880, guid: 1db1cccc3063dad49a76b436c3011b30, type: 3}
  - m_RefCount: 1
    m_Data: {fileID: -1316921809, guid: 1db1cccc3063dad49a76b436c3011b30, type: 3}
  - m_RefCount: 1
    m_Data: {fileID: -1425180677, guid: 1db1cccc3063dad49a76b436c3011b30, type: 3}
  - m_RefCount: 1
    m_Data: {fileID: -1097201586, guid: 1db1cccc3063dad49a76b436c3011b30, type: 3}
  - m_RefCount: 1
    m_Data: {fileID: 1559172051, guid: 1db1cccc3063dad49a76b436c3011b30, type: 3}
  - m_RefCount: 1
    m_Data: {fileID: 1234425306, guid: 1db1cccc3063dad49a76b436c3011b30, type: 3}
  - m_RefCount: 1
    m_Data: {fileID: 1800679118, guid: 1db1cccc3063dad49a76b436c3011b30, type: 3}
  - m_RefCount: 1
    m_Data: {fileID: 1570941240, guid: 1db1cccc3063dad49a76b436c3011b30, type: 3}
  - m_RefCount: 1
    m_Data: {fileID: -622588067, guid: 1db1cccc3063dad49a76b436c3011b30, type: 3}
  - m_RefCount: 1
    m_Data: {fileID: -1122859271, guid: 1db1cccc3063dad49a76b436c3011b30, type: 3}
  - m_RefCount: 1
    m_Data: {fileID: 1879490092, guid: 1db1cccc3063dad49a76b436c3011b30, type: 3}
  m_TileMatrixArray:
  - m_RefCount: 37
    m_Data:
      e00: 1
      e01: 0
      e02: 0
      e03: 0
      e10: 0
      e11: 1
      e12: 0
      e13: 0
      e20: 0
      e21: 0
      e22: 1
      e23: 0
      e30: 0
      e31: 0
      e32: 0
      e33: 1
  m_TileColorArray:
  - m_RefCount: 37
    m_Data: {r: 1, g: 1, b: 1, a: 1}
  m_TileObjectToInstantiateArray: []
  m_AnimationFrameRate: 1
  m_Color: {r: 1, g: 1, b: 1, a: 1}
  m_Origin: {x: -1, y: -7, z: 0}
  m_Size: {x: 10, y: 9, z: 1}
  m_TileAnchor: {x: 0.5, y: 0.5, z: 0}
  m_TileOrientation: 0
  m_TileOrientationMatrix:
    e00: 1
    e01: 0
    e02: 0
    e03: 0
    e10: 0
    e11: 1
    e12: 0
    e13: 0
    e20: 0
    e21: 0
    e22: 1
    e23: 0
    e30: 0
    e31: 0
    e32: 0
    e33: 1
--- !u!483693784 &7548174826401634071
TilemapRenderer:
  m_ObjectHideFlags: 0
  m_CorrespondingSourceObject: {fileID: 0}
  m_PrefabInstance: {fileID: 0}
  m_PrefabAsset: {fileID: 0}
  m_GameObject: {fileID: 3181471301081859690}
  m_Enabled: 1
  m_CastShadows: 0
  m_ReceiveShadows: 0
  m_DynamicOccludee: 0
  m_StaticShadowCaster: 0
  m_MotionVectors: 1
  m_LightProbeUsage: 0
  m_ReflectionProbeUsage: 0
  m_RayTracingMode: 0
  m_RayTraceProcedural: 0
  m_RenderingLayerMask: 1
  m_RendererPriority: 0
  m_Materials:
  - {fileID: 10754, guid: 0000000000000000f000000000000000, type: 0}
  m_StaticBatchInfo:
    firstSubMesh: 0
    subMeshCount: 0
  m_StaticBatchRoot: {fileID: 0}
  m_ProbeAnchor: {fileID: 0}
  m_LightProbeVolumeOverride: {fileID: 0}
  m_ScaleInLightmap: 1
  m_ReceiveGI: 1
  m_PreserveUVs: 0
  m_IgnoreNormalsForChartDetection: 0
  m_ImportantGI: 0
  m_StitchLightmapSeams: 1
  m_SelectedEditorRenderState: 0
  m_MinimumChartSize: 4
  m_AutoUVMaxDistance: 0.5
  m_AutoUVMaxAngle: 89
  m_LightmapParameters: {fileID: 0}
  m_SortingLayerID: 0
  m_SortingLayer: 0
  m_SortingOrder: 0
  m_ChunkSize: {x: 32, y: 32, z: 32}
  m_ChunkCullingBounds: {x: 0, y: 0, z: 0}
  m_MaxChunkCount: 16
  m_MaxFrameAge: 16
  m_SortOrder: 0
  m_Mode: 0
  m_DetectChunkCullingBounds: 0
  m_MaskInteraction: 0
--- !u!1 &6805032679860058881
GameObject:
  m_ObjectHideFlags: 0
  m_CorrespondingSourceObject: {fileID: 0}
  m_PrefabInstance: {fileID: 0}
  m_PrefabAsset: {fileID: 0}
  serializedVersion: 6
  m_Component:
  - component: {fileID: 8747549146146071487}
  - component: {fileID: 5425497770181702818}
  m_Layer: 0
  m_Name: TilesMundo1
  m_TagString: Untagged
  m_Icon: {fileID: 0}
  m_NavMeshLayer: 0
  m_StaticEditorFlags: 0
  m_IsActive: 1
--- !u!4 &8747549146146071487
Transform:
  m_ObjectHideFlags: 0
  m_CorrespondingSourceObject: {fileID: 0}
  m_PrefabInstance: {fileID: 0}
  m_PrefabAsset: {fileID: 0}
  m_GameObject: {fileID: 6805032679860058881}
  serializedVersion: 2
  m_LocalRotation: {x: 0, y: 0, z: 0, w: 1}
  m_LocalPosition: {x: 0, y: 0, z: 0}
  m_LocalScale: {x: 1, y: 1, z: 1}
  m_ConstrainProportionsScale: 0
  m_Children:
  - {fileID: 6784613896431114918}
  m_Father: {fileID: 0}
  m_LocalEulerAnglesHint: {x: 0, y: 0, z: 0}
--- !u!156049354 &5425497770181702818
Grid:
  m_ObjectHideFlags: 0
  m_CorrespondingSourceObject: {fileID: 0}
  m_PrefabInstance: {fileID: 0}
  m_PrefabAsset: {fileID: 0}
  m_GameObject: {fileID: 6805032679860058881}
  m_Enabled: 1
  m_CellSize: {x: 1, y: 1, z: 0}
  m_CellGap: {x: 0, y: 0, z: 0}
  m_CellLayout: 0
  m_CellSwizzle: 0
--- !u!114 &1111236465609846536
MonoBehaviour:
  m_ObjectHideFlags: 0
  m_CorrespondingSourceObject: {fileID: 0}
  m_PrefabInstance: {fileID: 0}
  m_PrefabAsset: {fileID: 0}
  m_GameObject: {fileID: 0}
  m_Enabled: 1
  m_EditorHideFlags: 0
  m_Script: {fileID: 12395, guid: 0000000000000000e000000000000000, type: 0}
  m_Name: Palette Settings
  m_EditorClassIdentifier: 
  cellSizing: 0
  m_TransparencySortMode: 0
  m_TransparencySortAxis: {x: 0, y: 0, z: 1}
