ID;name_db;name_de;name_en;emissions_fuel;reference
1;nuclear;Nuklear;nuclear;32.76;
2;lignite;Braunkohle;lignite;1108.0;
3;hard_coal;Steinkohle;hard coal;888.0;
4;nat_gas;Erdgas;natural gas;350.0;
5;oil;Öl;oil;788.0;
6;other_fossil;Fossil sonst.;fossil other;750.0;
7;waste;Müll;waste;276.0;
8;biomass;Biomasse;biomass;225.0;
9;geothermal;Geothermie;geothermal;0.0;
10;hydro_river;Wasserkraft;hydro river;0.0;
11;hydro_reservoir;Wasserspeicherkraft;hydro reservoir;0.0;
12;pv;Solar;solar;0.0;
13;wind_offshore;Wind Offshore;wind offshore;0.0;
14;wind_onshore;Wind Onshore;wind onshore;0.0;
15;other_renewable;Erneuerbare sonst.;renewable other;0.0;
16;hydro_storage_gen;PSW Erzeugung;hydro storage generation;;
17;hydro_storage_con;PSW Verbrauch;hydro storage consumption;;
