#-----------------------------------------------------------
# Vivado v2018.3 (64-bit)
# SW Build 2405991 on Thu Dec  6 23:38:27 MST 2018
# IP Build 2404404 on Fri Dec  7 01:43:56 MST 2018
# Start of session at: Fri Jul 26 19:50:05 2019
# Process ID: 12532
# Current directory: C:/Users/Rod/Documents/Universidad/Digitales/repo-labdigitales/lab_7_evaluado
# Command line: vivado.exe -gui_launcher_event rodinguilauncherevent7572 C:\Users\Rod\Documents\Universidad\Digitales\repo-labdigitales\lab_7_evaluado\lab_7_evaluado.xpr
# Log file: C:/Users/Rod/Documents/Universidad/Digitales/repo-labdigitales/lab_7_evaluado/vivado.log
# Journal file: C:/Users/Rod/Documents/Universidad/Digitales/repo-labdigitales/lab_7_evaluado\vivado.jou
#-----------------------------------------------------------
start_gui
open_project C:/Users/Rod/Documents/Universidad/Digitales/repo-labdigitales/lab_7_evaluado/lab_7_evaluado.xpr
Scanning sources...
Finished scanning sources
INFO: [IP_Flow 19-234] Refreshing IP repositories
INFO: [IP_Flow 19-1704] No user IP repositories specified
INFO: [IP_Flow 19-2313] Loaded Vivado IP repository 'C:/Xilinx/Vivado/2018.3/data/ip'.
open_project: Time (s): cpu = 00:00:54 ; elapsed = 00:00:21 . Memory (MB): peak = 748.559 ; gain = 133.242
update_compile_order -fileset sources_1
open_hw
connect_hw_server
INFO: [Labtools 27-2285] Connecting to hw_server url TCP:localhost:3121
INFO: [Labtools 27-2222] Launching hw_server...
INFO: [Labtools 27-2221] Launch Output:

****** Xilinx hw_server v2018.3
  **** Build date : Dec  7 2018-00:40:27
    ** Copyright 1986-2018 Xilinx, Inc. All Rights Reserved.


connect_hw_server: Time (s): cpu = 00:00:02 ; elapsed = 00:00:06 . Memory (MB): peak = 801.328 ; gain = 0.000
open_hw_target
INFO: [Labtoolstcl 44-466] Opening hw_target localhost:3121/xilinx_tcf/Digilent/210292A3FD94A
open_hw_target: Time (s): cpu = 00:00:11 ; elapsed = 00:00:10 . Memory (MB): peak = 1704.059 ; gain = 902.730
set_property PROGRAM.FILE {C:/Users/Rod/Documents/Universidad/Digitales/repo-labdigitales/lab_7_evaluado/lab_7_evaluado.runs/impl_1/main_3_3_2.bit} [get_hw_devices xc7a100t_0]
current_hw_device [get_hw_devices xc7a100t_0]
refresh_hw_device -update_hw_probes false [lindex [get_hw_devices xc7a100t_0] 0]
INFO: [Labtools 27-1434] Device xc7a100t (JTAG device index = 0) is programmed with a design that has no supported debug core(s) in it.
set_property PROBES.FILE {} [get_hw_devices xc7a100t_0]
set_property FULL_PROBES.FILE {} [get_hw_devices xc7a100t_0]
set_property PROGRAM.FILE {C:/Users/Rod/Documents/Universidad/Digitales/repo-labdigitales/lab_7_evaluado/lab_7_evaluado.runs/impl_1/main_3_3_2.bit} [get_hw_devices xc7a100t_0]
program_hw_devices [get_hw_devices xc7a100t_0]
INFO: [Labtools 27-3164] End of startup status: HIGH
refresh_hw_device [lindex [get_hw_devices xc7a100t_0] 0]
INFO: [Labtools 27-1434] Device xc7a100t (JTAG device index = 0) is programmed with a design that has no supported debug core(s) in it.
ERROR: [Labtoolstcl 44-513] HW Target shutdown. Closing target: localhost:3121/xilinx_tcf/Digilent/210292A3FD94A
