{
    "products": [
            {"id": 1,
            "name": "iPhone 8",
            "price": 549,
            "imgUrl": "products_pictures/iphone_8_white.png",
            "color": "white",
            "description": "The iPhone 8 features a more advanced 12-megapixel wide-angle f/1.8 camera with a larger, faster sensor that lets in 83 percent more light.",
            "setNumber": "71022"},

            {"id": 2,
            "name": "iPhone X",
            "price": 899,
            "imgUrl": "products_pictures/iphone_x.png",
            "color": "black",
            "description": "The iPhone X display has rounded corners that follow a beautiful curved design, and these corners are within a standard rectangle.",
            "setNumber": "71045"},

            {"id": 3,
            "name": "XBox Series X",
            "price": 587,
            "imgUrl": "products_pictures/xbox.png",
            "color": "black",
            "description": "The Xbox Series X is intended to render games at 4K resolution at 60 frames per second, and can support up to 120 frames per second and can render up to 8K resolution.",
            "setNumber": "71073"},

            {"id": 4,
            "name": "PlayStation",
            "price": 542,
            "imgUrl": "products_pictures/ps5.png",
            "color": "white",
            "description": "PlayStation is a video gaming brand that consists of five home video game consoles, two handhelds, a media center, and a smartphone, as well as an online service and multiple magazines.",
            "setNumber": "61081"},

            {"id": 5,
            "name": "MacBook Pro",
            "price": 1500,
            "imgUrl": "products_pictures/macbook.png",
            "color": "white",
            "description": "Apple MacBook Pro is a macOS laptop with a 13.30-inch display that has a resolution of 2560x1600 pixels. It is powered by a Core i5 processor and it comes with 12GB of RAM. ",
            "setNumber": "71091"},

            {"id": 6,
            "name": "HP Pavilion 15-DK1056WM",
            "price": 999,
            "imgUrl": "products_pictures/hp_pavilion_15.png",
            "color": "grey",
            "description": "HP Pavilion 15 gives you access to Intel Core i7 and AMD Ryzen processors, dedicated high-end graphics cards, up to 16GB of RAM, a max of 1TB of solid-state drive (SSD) storage, full-size keyboard, fast-charging, all-day battery life.",
            "setNumber": "65012"},

            {"id": 7,
            "name": "JBL Bluetooth Speaker",
            "price": 90,
            "imgUrl": "products_pictures/jbl_speaker.png",
            "color": "grey",
            "description": "A wireless Bluetooth speaker is a sound device that is aimed at making it easier for you to enjoy listening to your music or favorite podcasts. Most are portable and you can take them almost anywhere you go.",
            "setNumber": "66013"},

            {"id": 8,
            "name": "Samsung Galaxy S21",
            "price": 799,
            "imgUrl": "products_pictures/samsung_galaxy_s_21.png",
            "color": "grey",
            "description": "The Samsung Galaxy S21 specs are top-notch including a Snapdragon 888 chipset, 5G capability, 8GB RAM coupled with 128/256GB storage, and a 4000mAh battery.",
            "setNumber": "72024"},

            {"id": 9,
            "name": "Dell Inspiron 15",
            "price": 799,
            "imgUrl": "products_pictures/dell_inspiron_15.png",
            "color": "silver",
            "description": "Dell Inspiron 15 is a Windows 10 Home laptop with a 15.60-inch display that has a resolution of 1920x1080 pixels. It is powered by a Core i5 processor.",
            "setNumber": "67035"},

            {"id": 10,
            "name": "Sony WH-1000XM4 Headphones",
            "price": 349,
            "imgUrl": "products_pictures/Sony_WH_1000XM4.png",
            "color": "blue",
            "description": "The WH-1000XM4 are over-ear headphones that are more comfortable, have a more bass-heavy sound profile, which some users may prefer, and their ANC can significantly block out more noise around you.",
            "setNumber": "73046"},

            {"id": 11,
            "name": "LG OLED 4K TV",
            "price": 1499,
            "imgUrl": "products_pictures/LG_OLED_4K_TV.png",
            "color": "black",
            "description": "With their spectacular, true-to-life richness, pencil-thin profiles, super-clear action, superior viewing angles, and gorgeous, nuanced colors that virtually match those seen in movie theaters – LG OLED 4K TVs provide the ultimate entertainment experience.",
            "setNumber": "74057"},

            {"id": 12,
            "name": "Nintendo Switch",
            "price": 299,
            "imgUrl": "products_pictures/nintendo_switch.png",
            "color": "red/blue",
            "description": "The Nintendo Switch is a hybrid video game console, consisting of a console unit, a dock, and two Joy-Con controllers. Although it is a hybrid console, Nintendo classifies it as 'a home console that you can take with you on the go'.",
            "setNumber": "78068"},

            {"id": 13,
            "name": "Bose SoundLink Mini II",
            "price": 199,
            "imgUrl": "products_pictures/bose_soundlink_mini.png",
            "color": "black",
            "description": "The SoundLink Mini II Special Edition delivers full, natural sound with dramatically deeper bass than you'd expect from a Bluetooth mini speaker that fits in the palm of your hand.",
            "setNumber": "75079"},

            {"id": 14,
            "name": "Canon EOS Rebel T7i",
            "price": 699,
            "imgUrl": "products_pictures/canon_EOS_Rebel.png",
            "color": "black",
            "description": "The EOS Rebel T7i camera has professional features in an easy-to-use and highly customizable package.",
            "setNumber": "79080"},

            {"id": 15,
            "name": "Fitbit Charge 4",
            "price": 149,
            "imgUrl": "products_pictures/fitbit_Charge_4.png",
            "color": "rosewood",
            "description": "Meet Fitbit Charge 4™—a health & fitness tracker that packs built-in GPS and enhanced heart rate tracking into a sleek, comfortable wristband.",
            "setNumber": "81091"}
        ]
}