<?xml version="1.0" encoding="utf-8"?>
<!-- Generator: Adobe Illustrator 15.0.2, SVG Export Plug-In . SVG Version: 6.00 Build 0)  -->
<!DOCTYPE svg PUBLIC "-//W3C//DTD SVG 1.1//EN" "http://www.w3.org/Graphics/SVG/1.1/DTD/svg11.dtd" [
	<!ENTITY ns_extend "http://ns.adobe.com/Extensibility/1.0/">
	<!ENTITY ns_ai "http://ns.adobe.com/AdobeIllustrator/10.0/">
	<!ENTITY ns_graphs "http://ns.adobe.com/Graphs/1.0/">
	<!ENTITY ns_vars "http://ns.adobe.com/Variables/1.0/">
	<!ENTITY ns_imrep "http://ns.adobe.com/ImageReplacement/1.0/">
	<!ENTITY ns_sfw "http://ns.adobe.com/SaveForWeb/1.0/">
	<!ENTITY ns_custom "http://ns.adobe.com/GenericCustomNamespace/1.0/">
	<!ENTITY ns_adobe_xpath "http://ns.adobe.com/XPath/1.0/">
]>
<svg version="1.1" id="Calque_1" xmlns:x="&ns_extend;" xmlns:i="&ns_ai;" xmlns:graph="&ns_graphs;"
	 xmlns="http://www.w3.org/2000/svg" xmlns:xlink="http://www.w3.org/1999/xlink" x="0px" y="0px" width="800px" height="600px"
	 viewBox="0 0 800 600" enable-background="new 0 0 800 600" xml:space="preserve">
<metadata><?xpacket begin="﻿" id="W5M0MpCehiHzreSzNTczkc9d"?>
<x:xmpmeta xmlns:x="adobe:ns:meta/" x:xmptk="Adobe XMP Core 5.0-c060 61.134777, 2010/02/12-17:32:00        ">
   <rdf:RDF xmlns:rdf="http://www.w3.org/1999/02/22-rdf-syntax-ns#">
      <rdf:Description rdf:about=""
            xmlns:dc="http://purl.org/dc/elements/1.1/">
         <dc:format>image/svg+xml</dc:format>
         <dc:title>
            <rdf:Alt>
               <rdf:li xml:lang="x-default">Web</rdf:li>
            </rdf:Alt>
         </dc:title>
      </rdf:Description>
      <rdf:Description rdf:about=""
            xmlns:xmp="http://ns.adobe.com/xap/1.0/"
            xmlns:xmpGImg="http://ns.adobe.com/xap/1.0/g/img/">
         <xmp:CreatorTool>Adobe Illustrator CS5</xmp:CreatorTool>
         <xmp:CreateDate>2017-04-06T07:40:02+02:00</xmp:CreateDate>
         <xmp:ModifyDate>2017-04-06T07:40:03+02:00</xmp:ModifyDate>
         <xmp:MetadataDate>2017-04-06T07:40:03+02:00</xmp:MetadataDate>
         <xmp:Thumbnails>
            <rdf:Alt>
               <rdf:li rdf:parseType="Resource">
                  <xmpGImg:width>256</xmpGImg:width>
                  <xmpGImg:height>204</xmpGImg:height>
                  <xmpGImg:format>JPEG</xmpGImg:format>
                  <xmpGImg:image>/9j/4AAQSkZJRgABAgEASABIAAD/7QAsUGhvdG9zaG9wIDMuMAA4QklNA+0AAAAAABAASAAAAAEA&#xA;AQBIAAAAAQAB/+4ADkFkb2JlAGTAAAAAAf/bAIQABgQEBAUEBgUFBgkGBQYJCwgGBggLDAoKCwoK&#xA;DBAMDAwMDAwQDA4PEA8ODBMTFBQTExwbGxscHx8fHx8fHx8fHwEHBwcNDA0YEBAYGhURFRofHx8f&#xA;Hx8fHx8fHx8fHx8fHx8fHx8fHx8fHx8fHx8fHx8fHx8fHx8fHx8fHx8fHx8f/8AAEQgAzAEAAwER&#xA;AAIRAQMRAf/EAaIAAAAHAQEBAQEAAAAAAAAAAAQFAwIGAQAHCAkKCwEAAgIDAQEBAQEAAAAAAAAA&#xA;AQACAwQFBgcICQoLEAACAQMDAgQCBgcDBAIGAnMBAgMRBAAFIRIxQVEGE2EicYEUMpGhBxWxQiPB&#xA;UtHhMxZi8CRygvElQzRTkqKyY3PCNUQnk6OzNhdUZHTD0uIIJoMJChgZhJRFRqS0VtNVKBry4/PE&#xA;1OT0ZXWFlaW1xdXl9WZ2hpamtsbW5vY3R1dnd4eXp7fH1+f3OEhYaHiImKi4yNjo+Ck5SVlpeYmZ&#xA;qbnJ2en5KjpKWmp6ipqqusra6voRAAICAQIDBQUEBQYECAMDbQEAAhEDBCESMUEFURNhIgZxgZEy&#xA;obHwFMHR4SNCFVJicvEzJDRDghaSUyWiY7LCB3PSNeJEgxdUkwgJChgZJjZFGidkdFU38qOzwygp&#xA;0+PzhJSktMTU5PRldYWVpbXF1eX1RlZmdoaWprbG1ub2R1dnd4eXp7fH1+f3OEhYaHiImKi4yNjo&#xA;+DlJWWl5iZmpucnZ6fkqOkpaanqKmqq6ytrq+v/aAAwDAQACEQMRAD8Am35M/kz+Vus/lb5b1TVP&#xA;Ldpd6hd2iyXNzIrF3cswqaNirNP+VA/k1/1Kdj/wLf8ANWKu/wCVA/k1/wBSnY/8C3/NWKu/5UD+&#xA;TX/Up2P/AALf81Yq7/lQP5Nf9SnY/wDAt/zVirv+VA/k1/1Kdj/wLf8ANWKu/wCVA/k1/wBSnY/8&#xA;C3/NWKu/5UD+TX/Up2P/AALf81Yq7/lQP5Nf9SnY/wDAt/zVirv+VA/k1/1Kdj/wLf8ANWKu/wCV&#xA;A/k1/wBSnY/8C3/NWKu/5UD+TX/Up2P/AALf81Yq7/lQP5Nf9SnY/wDAt/zVirv+VA/k1/1Kdj/w&#xA;Lf8ANWKu/wCVA/k1/wBSnY/8C3/NWKpb5k/In8obby7qlxB5Wso54bOeSKQK1VdYmKkfF2IxVLvy&#xA;3/JH8p9R/LvytqF95Ys7i9vNIsLi6ndW5SSy20bu7fF1ZiTirI/+VA/k1/1Kdj/wLf8ANWKu/wCV&#xA;A/k1/wBSnY/8C3/NWKu/5UD+TX/Up2P/AALf81Yq7/lQP5Nf9SnY/wDAt/zVirv+VA/k1/1Kdj/w&#xA;Lf8ANWKu/wCVA/k1/wBSnY/8C3/NWKu/5UD+TX/Up2P/AALf81Yq7/lQP5Nf9SnY/wDAt/zVirv+&#xA;VA/k1/1Kdj/wLf8ANWKu/wCVA/k1/wBSnY/8C3/NWKu/5UD+TX/Up2P/AALf81Yq7/lQP5Nf9SnY&#xA;/wDAt/zVirv+VA/k1/1Kdj/wLf8ANWKu/wCVA/k1/wBSnY/8C3/NWKsL/Ob8mfyt0b8rfMmqaX5b&#xA;tLTULS0aS2uY1YOjhlFRVsVZp+QP/kmvKf8AzAr/AMSbFWf4q7FXYq7FXYq7FXYq7FXYq7FXYq7F&#xA;XYq7FUq82f8AKK6z/wAwNz/yZbFUq/Kf/wAlZ5N/7Yem/wDUHHirKsVdirsVdirsVdirsVdirsVd&#xA;irsVdirsVdirAPz+/wDJNebP+YFv+JLirvyB/wDJNeU/+YFf+JNirP8AFXYq7FXYq7FXYq7FXYq7&#xA;FXYq7FXYq7FXYqlXmz/lFdZ/5gbn/ky2KpV+U/8A5Kzyb/2w9N/6g48VZVirsVdirsVdirsVdirs&#xA;VdirsVdirsVdirsVYB+f3/kmvNn/ADAt/wASXFXfkD/5Jryn/wAwK/8AEmxVn+KuxV2KuxV2KuxV&#xA;2KuxV2KuxV2KuxV2KuxVKvNn/KK6z/zA3P8AyZbFUq/Kf/yVnk3/ALYem/8AUHHirKsVdirsVdir&#xA;sVdirsVdirsVdirsVdirsVdirAPz+/8AJNebP+YFv+JLirvyB/8AJNeU/wDmBX/iTYqz/FXYq7FX&#xA;Yq7FXYq7FXYq7FXYq7FXYq7FXYqlXmz/AJRXWf8AmBuf+TLYqlX5T/8AkrPJv/bD03/qDjxVlWKu&#xA;xV2KuxV2KuxV2KuxV2KuxV2KuxV2KuxVgH5/f+Sa82f8wLf8SXFXfkD/AOSa8p/8wK/8SbFWf4q7&#xA;FXYq7FXYq7FXYq7FXYq7FXYq7FXYq7FUq82f8orrP/MDc/8AJlsVSr8p/wDyVnk3/th6b/1Bx4qy&#xA;rFXYq7FXYq7FXYq7FXYq7FXYq7FXYq7FXYqwD8/v/JNebP8AmBb/AIkuKu/IH/yTXlP/AJgV/wCJ&#xA;NirP8VdirsVdirsVdirsVdirsVdirsVdirsVdiqVebP+UV1n/mBuf+TLYqlX5T/+Ss8m/wDbD03/&#xA;AKg48VZVirsVdirsVdirsVdirsVdirsVdirsVdirsVYB+f3/AJJrzZ/zAt/xJcVd+QP/AJJryn/z&#xA;Ar/xJsVZ/irsVdirsVdirsVdirsVdirsVdirsVdirsVSrzZ/yius/wDMDc/8mWxVKvyn/wDJWeTf&#xA;+2Hpv/UHHirKsVdirsVdirsVdirsVdirsVdirsVdirsVdirAPz+/8k15s/5gW/4kuKu/IH/yTXlP&#xA;/mBX/iTYqz/FXYq7FXYq7FXYq7FXYq7FXYq7FXYq7FXYqlXmz/lFdZ/5gbn/AJMtiqVflP8A+Ss8&#xA;m/8AbD03/qDjxVlWKuxV2KuxV2KuxV2KuxV2KuxV2KuxV2KuxVgH5/f+Sa82f8wLf8SXFXfkD/5J&#xA;ryn/AMwK/wDEmxVn+KuxV2KuxV2KuxV2KuxV2KuxV2KuxV2KuxVKvNn/ACius/8AMDc/8mWxVKvy&#xA;n/8AJWeTf+2Hpv8A1Bx4qyrFXYq7FXYq7FXYq7FXYq7FXYq7FXYq7FXYqwD8/v8AyTXmz/mBb/iS&#xA;4q78gf8AyTXlP/mBX/iTYqz/ABV2KuxV2KuxV2KuxV2KuxV2KuxV2KuxV2KpV5s/5RXWf+YG5/5M&#xA;tiqVflP/AOSs8m/9sPTf+oOPFWVYq7FXYq7FXYq7FXYq7FXYq7FXYq7FXYq7FWAfn9/5JrzZ/wAw&#xA;Lf8AElxV35A/+Sa8p/8AMCv/ABJsVZ/irsVdirsVdirsVdirsVdirsVdirsVdirsVSrzZ/yius/8&#xA;wNz/AMmWxVKvyn/8lZ5N/wC2Hpv/AFBx4qyrFXYq7FXYq7FXYq7FXYq7FXYq7FXYq7FXYqwD8/v/&#xA;ACTXmz/mBb/iS4q78gf/ACTXlP8A5gV/4k2Ks/xV2KuxV2KuxV2KuxV2KuxV2KuxV2KuxV2KpV5s&#xA;/wCUV1n/AJgbn/ky2KpV+U//AJKzyb/2w9N/6g48VZVirsVdirsVdirsVdirsVdirsVdirsVdirs&#xA;VYB+f3/kmvNn/MC3/ElxV35A/wDkmvKf/MCv/EmxVn+KuxV2KuxV2KuxV2KuxV2KuxV2KuxV2Kux&#xA;VKvNn/KK6z/zA3P/ACZbFUq/Kf8A8lZ5N/7Yem/9QceKsqxV2KuxV2KuxV2KuxV2KuxV2KuxV2Ku&#xA;xV2KsA/P7/yTXmz/AJgW/wCJLirvyB/8k15T/wCYFf8AiTYqz/FXYq7FXYq7FXYq7FXYq7FXYq7F&#xA;XYq7FXYqlXmz/lFdZ/5gbn/ky2KpV+U//krPJv8A2w9N/wCoOPFWVYq7FXYq7FXYq7FXYq7FXYq7&#xA;FXYq7FXYq7FWAfn9/wCSa82f8wLf8SXFXfkD/wCSa8p/8wK/8SbFWf4q7FXYq7FXYq7FXYq7FXYq&#xA;7FXYq7FXYq7FUq82f8orrP8AzA3P/JlsVSr8p/8AyVnk3/th6b/1Bx4qyrFXYq7FXYq7FXYq7FXY&#xA;q7FXYq7FXYq7FXYqwD8/v/JNebP+YFv+JLirvyB/8k15T/5gV/4k2Ks/xV2KuxV2KuxV2KuxV2Ku&#xA;xV2KuxV2KuxV2KpV5s/5RXWf+YG5/wCTLYqlX5T/APkrPJv/AGw9N/6g48VZVirsVdirsVdirsVd&#xA;irsVdirsVdirsVdirsVYB+f3/kmvNn/MC3/ElxV35A/+Sa8p/wDMCv8AxJsVZ/irsVdirsVdirsV&#xA;dirsVdirsVdirsVdirsVSrzZ/wAorrP/ADA3P/JlsVSr8p//ACVnk3/th6b/ANQceKsqxV2KuxV2&#xA;KuxV2KuxV2KuxV2KuxV2KuxV2KsA/P7/AMk15s/5gW/4kuKu/IH/AMk15T/5gV/4k2Ks/wAVdirs&#xA;VdirsVdirsVdirsVdirsVdirsVdiqVebP+UV1n/mBuf+TLYqlX5T/wDkrPJv/bD03/qDjxVlWKux&#xA;V2KuxV2KuxV2KuxV2KuxV2KuxV2KuxVgH5/f+Sa82f8AMC3/ABJcVd+QP/kmvKf/ADAr/wASbFWf&#xA;4q7FXYq7FXYq7FXYq7FXYq7FXYq7FXYq7FUq82f8orrP/MDc/wDJlsVSr8p//JWeTf8Ath6b/wBQ&#xA;ceKsqxV2KuxV2KuxV2KuxV2KuxV2KuxV2KuxV2KsA/P7/wAk15s/5gW/4kuKu/IH/wAk15T/AOYF&#xA;f+JNirP8VdirsVdirsVdirsVdirsVdirsVdirsVdiqVebP8AlFdZ/wCYG5/5MtiqVflP/wCSs8m/&#xA;9sPTf+oOPFWVYq7FXYq7FXYq7FXYq7FXYq7FXYq7FXYq7FWAfn9/5JrzZ/zAt/xJcVd+QP8A5Jry&#xA;n/zAr/xJsVZ/irsVdirsVdirsVdirsVdirsVdirsVdirsVSrzZ/yius/8wNz/wAmWxVKvyn/APJW&#xA;eTf+2Hpv/UHHirKsVdirsVdirsVdirsVdirsVdirsVdirsVdirAPz+/8k15s/wCYFv8AiS4qlflj&#xA;8sfzS8taBY6Dpfn20XT9PjENssmhq7hASd2N5v1xVNP8KfnL/wBT/Y/9wFf+y3FXf4U/OX/qf7H/&#xA;ALgK/wDZbirv8KfnL/1P9j/3AV/7LcVd/hT85f8Aqf7H/uAr/wBluKu/wp+cv/U/2P8A3AV/7LcV&#xA;d/hT85f+p/sf+4Cv/Zbirv8ACn5y/wDU/wBj/wBwFf8AstxV3+FPzl/6n+x/7gK/9luKu/wp+cv/&#xA;AFP9j/3AV/7LcVd/hT85f+p/sf8AuAr/ANluKu/wp+cv/U/2P/cBX/stxV3+FPzl/wCp/sf+4Cv/&#xA;AGW4q7/Cn5y/9T/Y/wDcBX/stxV3+FPzl/6n+x/7gK/9luKqF95I/N69srizn8/WRguY3hlA0FQe&#xA;EilWofrvgcVUND/L382NF0XT9GsfP1mtlpttDZ2ofQlZhFBGI05N9d3PFRviqO/wp+cv/U/2P/cB&#xA;X/stxV3+FPzl/wCp/sf+4Cv/AGW4q7/Cn5y/9T/Y/wDcBX/stxV3+FPzl/6n+x/7gK/9luKu/wAK&#xA;fnL/ANT/AGP/AHAV/wCy3FXf4U/OX/qf7H/uAr/2W4q7/Cn5y/8AU/2P/cBX/stxV3+FPzl/6n+x&#xA;/wC4Cv8A2W4q7/Cn5y/9T/Y/9wFf+y3FXf4U/OX/AKn+x/7gK/8AZbirv8KfnL/1P9j/ANwFf+y3&#xA;FXf4U/OX/qf7H/uAr/2W4q7/AAp+cv8A1P8AY/8AcBX/ALLcVd/hT85f+p/sf+4Cv/ZbiqV+Z/yx&#xA;/NLzLoF9oOqefbRtP1CMw3Kx6GqOUJB2YXm3TFXqeKuxV2KuxV2KuxV2KuxV2KuxV2KuxV2KuxV2&#xA;KuxV2KuxV2KuxV2KuxV2KuxV2KuxV2KuxV2KuxV2KuxV2KuxV2KuxV2KuxV2KuxV2KuxV2KuxV2K&#xA;uxV2KuxV2KuxV2KuxV2KuxV2KuxV2KuxV2KuxV2KuxV2KuxV2KuxV2KuxV2KuxV2KuxV2KuxV2Ku&#xA;xV2KuxV2KuxV2KuxV2KuxV2KuxV2KuxV2KuxV2KuxV2KuxV2KuxV/9k=</xmpGImg:image>
               </rdf:li>
            </rdf:Alt>
         </xmp:Thumbnails>
      </rdf:Description>
      <rdf:Description rdf:about=""
            xmlns:xmpMM="http://ns.adobe.com/xap/1.0/mm/"
            xmlns:stRef="http://ns.adobe.com/xap/1.0/sType/ResourceRef#"
            xmlns:stEvt="http://ns.adobe.com/xap/1.0/sType/ResourceEvent#">
         <xmpMM:RenditionClass>proof:pdf</xmpMM:RenditionClass>
         <xmpMM:OriginalDocumentID>uuid:65E6390686CF11DBA6E2D887CEACB407</xmpMM:OriginalDocumentID>
         <xmpMM:DocumentID>xmp.did:05801174072068118C14E8D79F052FC4</xmpMM:DocumentID>
         <xmpMM:InstanceID>xmp.iid:05801174072068118C14E8D79F052FC4</xmpMM:InstanceID>
         <xmpMM:DerivedFrom rdf:parseType="Resource">
            <stRef:instanceID>xmp.iid:04801174072068118C14E8D79F052FC4</stRef:instanceID>
            <stRef:documentID>xmp.did:04801174072068118C14E8D79F052FC4</stRef:documentID>
            <stRef:originalDocumentID>uuid:65E6390686CF11DBA6E2D887CEACB407</stRef:originalDocumentID>
            <stRef:renditionClass>proof:pdf</stRef:renditionClass>
         </xmpMM:DerivedFrom>
         <xmpMM:History>
            <rdf:Seq>
               <rdf:li rdf:parseType="Resource">
                  <stEvt:action>saved</stEvt:action>
                  <stEvt:instanceID>xmp.iid:01801174072068118C14E8D79F052FC4</stEvt:instanceID>
                  <stEvt:when>2017-04-06T07:14:33+02:00</stEvt:when>
                  <stEvt:softwareAgent>Adobe Illustrator CS5</stEvt:softwareAgent>
                  <stEvt:changed>/</stEvt:changed>
               </rdf:li>
               <rdf:li rdf:parseType="Resource">
                  <stEvt:action>saved</stEvt:action>
                  <stEvt:instanceID>xmp.iid:03801174072068118C14E8D79F052FC4</stEvt:instanceID>
                  <stEvt:when>2017-04-06T07:28:48+02:00</stEvt:when>
                  <stEvt:softwareAgent>Adobe Illustrator CS5</stEvt:softwareAgent>
                  <stEvt:changed>/</stEvt:changed>
               </rdf:li>
               <rdf:li rdf:parseType="Resource">
                  <stEvt:action>saved</stEvt:action>
                  <stEvt:instanceID>xmp.iid:04801174072068118C14E8D79F052FC4</stEvt:instanceID>
                  <stEvt:when>2017-04-06T07:39:39+02:00</stEvt:when>
                  <stEvt:softwareAgent>Adobe Illustrator CS5</stEvt:softwareAgent>
                  <stEvt:changed>/</stEvt:changed>
               </rdf:li>
               <rdf:li rdf:parseType="Resource">
                  <stEvt:action>saved</stEvt:action>
                  <stEvt:instanceID>xmp.iid:05801174072068118C14E8D79F052FC4</stEvt:instanceID>
                  <stEvt:when>2017-04-06T07:40:03+02:00</stEvt:when>
                  <stEvt:softwareAgent>Adobe Illustrator CS5</stEvt:softwareAgent>
                  <stEvt:changed>/</stEvt:changed>
               </rdf:li>
            </rdf:Seq>
         </xmpMM:History>
      </rdf:Description>
      <rdf:Description rdf:about=""
            xmlns:illustrator="http://ns.adobe.com/illustrator/1.0/">
         <illustrator:StartupProfile>Web</illustrator:StartupProfile>
      </rdf:Description>
      <rdf:Description rdf:about=""
            xmlns:xmpTPg="http://ns.adobe.com/xap/1.0/t/pg/"
            xmlns:stDim="http://ns.adobe.com/xap/1.0/sType/Dimensions#"
            xmlns:xmpG="http://ns.adobe.com/xap/1.0/g/">
         <xmpTPg:NPages>1</xmpTPg:NPages>
         <xmpTPg:HasVisibleTransparency>False</xmpTPg:HasVisibleTransparency>
         <xmpTPg:HasVisibleOverprint>False</xmpTPg:HasVisibleOverprint>
         <xmpTPg:MaxPageSize rdf:parseType="Resource">
            <stDim:w>800.000000</stDim:w>
            <stDim:h>600.000000</stDim:h>
            <stDim:unit>Pixels</stDim:unit>
         </xmpTPg:MaxPageSize>
         <xmpTPg:PlateNames>
            <rdf:Seq>
               <rdf:li>Cyan</rdf:li>
               <rdf:li>Magenta</rdf:li>
               <rdf:li>Yellow</rdf:li>
               <rdf:li>Black</rdf:li>
            </rdf:Seq>
         </xmpTPg:PlateNames>
         <xmpTPg:SwatchGroups>
            <rdf:Seq>
               <rdf:li rdf:parseType="Resource">
                  <xmpG:groupName>Groupe de nuances par défaut</xmpG:groupName>
                  <xmpG:groupType>0</xmpG:groupType>
               </rdf:li>
            </rdf:Seq>
         </xmpTPg:SwatchGroups>
      </rdf:Description>
      <rdf:Description rdf:about=""
            xmlns:pdf="http://ns.adobe.com/pdf/1.3/">
         <pdf:Producer>Adobe PDF library 9.90</pdf:Producer>
      </rdf:Description>
   </rdf:RDF>
</x:xmpmeta>
                                                                                                    
                                                                                                    
                                                                                                    
                                                                                                    
                                                                                                    
                                                                                                    
                                                                                                    
                                                                                                    
                                                                                                    
                                                                                                    
                                                                                                    
                                                                                                    
                                                                                                    
                                                                                                    
                                                                                                    
                                                                                                    
                                                                                                    
                                                                                                    
                                                                                                    
                                                                                                    
                           
<?xpacket end="w"?>
	</metadata>
<g>
	<rect x="159.5" y="72.5" fill="#FFFFFF" stroke="#000000" stroke-width="2" stroke-miterlimit="10" width="361" height="253"/>
	<rect x="159.5" y="72.5" fill="#FFFFFF" stroke="#000000" stroke-width="2" stroke-miterlimit="10" width="181" height="253"/>
</g>
<rect x="316.25" y="345.5" fill="none" width="100.5" height="14.5"/>
</svg>
