<?xml version="1.0" encoding="UTF-8"?>
<glyph name="greater" format="1">
  <advance width="694"/>
  <unicode hex="003E"/>
  <outline>
    <contour>
      <point x="117" y="579" type="line" smooth="yes"/>
      <point x="121" y="579"/>
      <point x="127" y="577"/>
      <point x="130" y="575" type="curve" smooth="yes"/>
      <point x="593" y="315" type="line" smooth="yes"/>
      <point x="601" y="311"/>
      <point x="608" y="298"/>
      <point x="608" y="289" type="curve" smooth="yes"/>
      <point x="608" y="280"/>
      <point x="601" y="268"/>
      <point x="593" y="264" type="curve" smooth="yes"/>
      <point x="130" y="3" type="line" smooth="yes"/>
      <point x="127" y="1"/>
      <point x="120" y="-1"/>
      <point x="116" y="-1" type="curve" smooth="yes"/>
      <point x="100" y="-1"/>
      <point x="86" y="12"/>
      <point x="86" y="28" type="curve" smooth="yes"/>
      <point x="86" y="38"/>
      <point x="92" y="50"/>
      <point x="101" y="54" type="curve" smooth="yes"/>
      <point x="520" y="289" type="line"/>
      <point x="101" y="525" type="line" smooth="yes"/>
      <point x="92" y="529"/>
      <point x="87" y="540"/>
      <point x="87" y="550" type="curve" smooth="yes"/>
      <point x="87" y="566"/>
      <point x="100" y="579"/>
      <point x="116" y="579" type="curve" smooth="yes"/>
    </contour>
  </outline>
  <lib>
    <dict>
      <key>com.fontlab.hintData</key>
      <dict>
        <key>hhints</key>
        <array>
          <dict>
            <key>position</key>
            <integer>-1</integer>
            <key>width</key>
            <integer>23</integer>
          </dict>
        </array>
      </dict>
    </dict>
  </lib>
</glyph>
