<?xml version="1.0" encoding="UTF-8"?>
<glyph name="asterisk" format="1">
  <advance width="463"/>
  <unicode hex="002A"/>
  <outline>
    <contour>
      <point x="349" y="363" type="line"/>
      <point x="350" y="362" type="line"/>
    </contour>
    <contour>
      <point x="114" y="363" type="line"/>
      <point x="113" y="362" type="line"/>
    </contour>
    <contour>
      <point x="239" y="368" type="line"/>
      <point x="239" y="286" type="line"/>
      <point x="253" y="299" type="line"/>
    </contour>
    <contour>
      <point x="224" y="368" type="line"/>
      <point x="210" y="299" type="line"/>
      <point x="224" y="286" type="line"/>
    </contour>
    <contour>
      <point x="312" y="402" type="line"/>
      <point x="370" y="367" type="line"/>
      <point x="370" y="380" type="line"/>
    </contour>
    <contour>
      <point x="151" y="402" type="line"/>
      <point x="95" y="380" type="line"/>
      <point x="95" y="367" type="line"/>
    </contour>
    <contour>
      <point x="370" y="516" type="line"/>
      <point x="312" y="482" type="line"/>
      <point x="370" y="505" type="line"/>
    </contour>
    <contour>
      <point x="95" y="516" type="line"/>
      <point x="95" y="505" type="line"/>
      <point x="151" y="482" type="line"/>
    </contour>
    <contour>
      <point x="350" y="521" type="line"/>
      <point x="349" y="520" type="line"/>
    </contour>
    <contour>
      <point x="113" y="521" type="line"/>
      <point x="114" y="520" type="line"/>
    </contour>
    <contour>
      <point x="239" y="598" type="line"/>
      <point x="239" y="515" type="line"/>
      <point x="253" y="584" type="line"/>
    </contour>
    <contour>
      <point x="224" y="598" type="line"/>
      <point x="210" y="584" type="line"/>
      <point x="224" y="515" type="line"/>
    </contour>
    <contour>
      <point x="231" y="623" type="line"/>
      <point x="232" y="623" type="line"/>
      <point x="233" y="623" type="line"/>
      <point x="234" y="623" type="line"/>
      <point x="235" y="622" type="line"/>
      <point x="236" y="622" type="line"/>
      <point x="236" y="620" type="line"/>
      <point x="238" y="620" type="line"/>
      <point x="238" y="619" type="line"/>
      <point x="266" y="592" type="line" smooth="yes"/>
      <point x="267" y="591"/>
      <point x="267" y="587"/>
      <point x="267" y="586" type="curve" smooth="yes"/>
      <point x="267" y="585" type="line"/>
      <point x="242" y="459" type="line"/>
      <point x="343" y="535" type="line" smooth="yes"/>
      <point x="344" y="536"/>
      <point x="347" y="536"/>
      <point x="348" y="536" type="curve" smooth="yes"/>
      <point x="375" y="536" type="line"/>
      <point x="376" y="536" type="line"/>
      <point x="378" y="536" type="line"/>
      <point x="380" y="536" type="line"/>
      <point x="380" y="535" type="line"/>
      <point x="381" y="535" type="line"/>
      <point x="382" y="534" type="line"/>
      <point x="383" y="532" type="line"/>
      <point x="383" y="531" type="line"/>
      <point x="384" y="530" type="line"/>
      <point x="384" y="529" type="line"/>
      <point x="384" y="528" type="line"/>
      <point x="384" y="527" type="line"/>
      <point x="384" y="499" type="line" smooth="yes"/>
      <point x="384" y="497"/>
      <point x="382" y="494"/>
      <point x="380" y="493" type="curve" smooth="yes"/>
      <point x="251" y="442" type="line"/>
      <point x="380" y="390" type="line" smooth="yes"/>
      <point x="382" y="389"/>
      <point x="384" y="386"/>
      <point x="384" y="384" type="curve" smooth="yes"/>
      <point x="384" y="356" type="line"/>
      <point x="384" y="355" type="line"/>
      <point x="384" y="354" type="line"/>
      <point x="384" y="353" type="line"/>
      <point x="383" y="353" type="line"/>
      <point x="383" y="352" type="line"/>
      <point x="383" y="351" type="line"/>
      <point x="382" y="351" type="line"/>
      <point x="382" y="350" type="line"/>
      <point x="381" y="350" type="line"/>
      <point x="381" y="349" type="line"/>
      <point x="380" y="349" type="line"/>
      <point x="378" y="348" type="line"/>
      <point x="377" y="348" type="line"/>
      <point x="376" y="348" type="line"/>
      <point x="375" y="348" type="line"/>
      <point x="348" y="348" type="line" smooth="yes"/>
      <point x="347" y="348"/>
      <point x="344" y="348"/>
      <point x="343" y="349" type="curve" smooth="yes"/>
      <point x="242" y="425" type="line"/>
      <point x="267" y="298" type="line"/>
      <point x="267" y="297" type="line" smooth="yes"/>
      <point x="267" y="296"/>
      <point x="267" y="293"/>
      <point x="266" y="292" type="curve" smooth="yes"/>
      <point x="238" y="264" type="line"/>
      <point x="238" y="263" type="line"/>
      <point x="236" y="263" type="line"/>
      <point x="234" y="262" type="line"/>
      <point x="234" y="261" type="line"/>
      <point x="233" y="261" type="line"/>
      <point x="232" y="261" type="line"/>
      <point x="231" y="261" type="line"/>
      <point x="230" y="261" type="line"/>
      <point x="229" y="262" type="line"/>
      <point x="228" y="262" type="line"/>
      <point x="227" y="263" type="line"/>
      <point x="226" y="263" type="line"/>
      <point x="226" y="264" type="line"/>
      <point x="198" y="292" type="line" smooth="yes"/>
      <point x="197" y="293"/>
      <point x="196" y="296"/>
      <point x="196" y="297" type="curve" smooth="yes"/>
      <point x="196" y="298" type="line"/>
      <point x="221" y="425" type="line"/>
      <point x="120" y="349" type="line" smooth="yes"/>
      <point x="119" y="348"/>
      <point x="117" y="348"/>
      <point x="116" y="348" type="curve" smooth="yes"/>
      <point x="88" y="348" type="line"/>
      <point x="87" y="348" type="line"/>
      <point x="85" y="348" type="line"/>
      <point x="84" y="349" type="line"/>
      <point x="82" y="349" type="line"/>
      <point x="81" y="350" type="line"/>
      <point x="81" y="351" type="line"/>
      <point x="80" y="351" type="line"/>
      <point x="80" y="352" type="line"/>
      <point x="80" y="353" type="line"/>
      <point x="79" y="353" type="line"/>
      <point x="79" y="354" type="line"/>
      <point x="79" y="355" type="line"/>
      <point x="79" y="356" type="line"/>
      <point x="79" y="384" type="line" smooth="yes"/>
      <point x="79" y="386"/>
      <point x="82" y="389"/>
      <point x="84" y="390" type="curve" smooth="yes"/>
      <point x="212" y="442" type="line"/>
      <point x="84" y="493" type="line" smooth="yes"/>
      <point x="82" y="494"/>
      <point x="79" y="497"/>
      <point x="79" y="499" type="curve" smooth="yes"/>
      <point x="79" y="527" type="line"/>
      <point x="79" y="528" type="line"/>
      <point x="79" y="529" type="line"/>
      <point x="79" y="530" type="line"/>
      <point x="80" y="530" type="line"/>
      <point x="80" y="531" type="line"/>
      <point x="80" y="532" type="line"/>
      <point x="81" y="532" type="line"/>
      <point x="81" y="534" type="line"/>
      <point x="82" y="535" type="line"/>
      <point x="84" y="535" type="line"/>
      <point x="84" y="536" type="line"/>
      <point x="85" y="536" type="line"/>
      <point x="86" y="536" type="line"/>
      <point x="87" y="536" type="line"/>
      <point x="88" y="536" type="line"/>
      <point x="116" y="536" type="line" smooth="yes"/>
      <point x="117" y="536"/>
      <point x="119" y="536"/>
      <point x="120" y="535" type="curve" smooth="yes"/>
      <point x="221" y="459" type="line"/>
      <point x="196" y="585" type="line"/>
      <point x="196" y="586" type="line" smooth="yes"/>
      <point x="196" y="587"/>
      <point x="197" y="591"/>
      <point x="198" y="592" type="curve" smooth="yes"/>
      <point x="226" y="620" type="line"/>
      <point x="227" y="620" type="line"/>
      <point x="227" y="622" type="line"/>
      <point x="229" y="623" type="line"/>
    </contour>
  </outline>
  <lib>
    <dict>
      <key>com.fontlab.hintData</key>
      <dict>
        <key>hhints</key>
        <array>
          <dict>
            <key>position</key>
            <integer>262</integer>
            <key>width</key>
            <integer>361</integer>
          </dict>
        </array>
        <key>vhints</key>
        <array>
          <dict>
            <key>position</key>
            <integer>79</integer>
            <key>width</key>
            <integer>15</integer>
          </dict>
          <dict>
            <key>position</key>
            <integer>196</integer>
            <key>width</key>
            <integer>42</integer>
          </dict>
          <dict>
            <key>position</key>
            <integer>224</integer>
            <key>width</key>
            <integer>14</integer>
          </dict>
          <dict>
            <key>position</key>
            <integer>370</integer>
            <key>width</key>
            <integer>14</integer>
          </dict>
        </array>
      </dict>
    </dict>
  </lib>
</glyph>
