<?xml version="1.0" encoding="UTF-8"?>
<glyph name="zero" format="1">
  <advance width="578"/>
  <unicode hex="0030"/>
  <outline>
    <contour>
      <point x="263" y="607" type="line"/>
      <point x="183" y="581" type="line"/>
      <point x="130" y="500" type="line"/>
      <point x="101" y="360" type="line"/>
      <point x="101" y="276" type="line"/>
      <point x="130" y="135" type="line"/>
      <point x="183" y="55" type="line"/>
      <point x="263" y="29" type="line"/>
      <point x="316" y="29" type="line"/>
      <point x="396" y="55" type="line"/>
      <point x="450" y="135" type="line"/>
      <point x="477" y="276" type="line"/>
      <point x="477" y="360" type="line"/>
      <point x="450" y="500" type="line"/>
      <point x="396" y="581" type="line"/>
      <point x="316" y="607" type="line"/>
    </contour>
    <contour>
      <point x="260" y="637" type="line"/>
      <point x="261" y="637" type="line"/>
      <point x="262" y="637" type="line"/>
      <point x="318" y="637" type="line" smooth="yes"/>
      <point x="319" y="637"/>
      <point x="322" y="636"/>
      <point x="323" y="636" type="curve" smooth="yes"/>
      <point x="410" y="607" type="line" smooth="yes"/>
      <point x="412" y="606"/>
      <point x="416" y="604"/>
      <point x="417" y="602" type="curve" smooth="yes"/>
      <point x="475" y="515" type="line" smooth="yes"/>
      <point x="476" y="514"/>
      <point x="477" y="510"/>
      <point x="477" y="509" type="curve" smooth="yes"/>
      <point x="506" y="364" type="line" smooth="yes"/>
      <point x="506" y="363"/>
      <point x="507" y="363"/>
      <point x="507" y="362" type="curve" smooth="yes"/>
      <point x="507" y="275" type="line" smooth="yes"/>
      <point x="507" y="274"/>
      <point x="506" y="273"/>
      <point x="506" y="272" type="curve" smooth="yes"/>
      <point x="477" y="128" type="line" smooth="yes"/>
      <point x="477" y="127"/>
      <point x="476" y="123"/>
      <point x="475" y="122" type="curve" smooth="yes"/>
      <point x="417" y="35" type="line" smooth="yes"/>
      <point x="416" y="33"/>
      <point x="412" y="31"/>
      <point x="410" y="30" type="curve" smooth="yes"/>
      <point x="323" y="0" type="line"/>
      <point x="318" y="0" type="line"/>
      <point x="261" y="0" type="line"/>
      <point x="256" y="0" type="line"/>
      <point x="169" y="30" type="line" smooth="yes"/>
      <point x="167" y="31"/>
      <point x="163" y="33"/>
      <point x="162" y="35" type="curve" smooth="yes"/>
      <point x="103" y="122" type="line" smooth="yes"/>
      <point x="102" y="123"/>
      <point x="101" y="127"/>
      <point x="101" y="128" type="curve" smooth="yes"/>
      <point x="73" y="272" type="line"/>
      <point x="73" y="275" type="line"/>
      <point x="73" y="362" type="line"/>
      <point x="73" y="364" type="line"/>
      <point x="101" y="509" type="line" smooth="yes"/>
      <point x="101" y="510"/>
      <point x="102" y="514"/>
      <point x="103" y="515" type="curve" smooth="yes"/>
      <point x="162" y="602" type="line" smooth="yes"/>
      <point x="163" y="604"/>
      <point x="167" y="606"/>
      <point x="169" y="607" type="curve" smooth="yes"/>
      <point x="255" y="636" type="line" smooth="yes"/>
      <point x="256" y="636"/>
      <point x="257" y="637"/>
      <point x="258" y="637" type="curve" smooth="yes"/>
    </contour>
  </outline>
  <lib>
    <dict>
      <key>com.fontlab.hintData</key>
      <dict>
        <key>hhints</key>
        <array>
          <dict>
            <key>position</key>
            <integer>0</integer>
            <key>width</key>
            <integer>29</integer>
          </dict>
          <dict>
            <key>position</key>
            <integer>607</integer>
            <key>width</key>
            <integer>30</integer>
          </dict>
        </array>
        <key>vhints</key>
        <array>
          <dict>
            <key>position</key>
            <integer>73</integer>
            <key>width</key>
            <integer>29</integer>
          </dict>
          <dict>
            <key>position</key>
            <integer>477</integer>
            <key>width</key>
            <integer>30</integer>
          </dict>
        </array>
      </dict>
    </dict>
  </lib>
</glyph>
