<?xml version="1.0" encoding="UTF-8"?>
<glyph name="W" format="1">
  <advance width="752"/>
  <unicode hex="0057"/>
  <outline>
    <contour>
      <point x="67" y="608" type="line"/>
      <point x="231" y="34" type="line"/>
      <point x="370" y="530" type="line"/>
      <point x="370" y="531" type="line"/>
      <point x="370" y="532" type="line"/>
      <point x="371" y="532" type="line"/>
      <point x="371" y="534" type="line"/>
      <point x="372" y="535" type="line"/>
      <point x="373" y="535" type="line"/>
      <point x="373" y="536" type="line"/>
      <point x="374" y="536" type="line"/>
      <point x="375" y="536" type="line"/>
      <point x="376" y="536" type="line"/>
      <point x="377" y="536" type="line"/>
      <point x="380" y="536" type="line"/>
      <point x="380" y="535" type="line"/>
      <point x="381" y="535" type="line"/>
      <point x="382" y="534" type="line" smooth="yes"/>
      <point x="383" y="533"/>
      <point x="384" y="530"/>
      <point x="384" y="529" type="curve" smooth="yes"/>
      <point x="521" y="34" type="line"/>
      <point x="685" y="608" type="line"/>
      <point x="671" y="608" type="line"/>
      <point x="528" y="94" type="line"/>
      <point x="528" y="92" type="line"/>
      <point x="528" y="91" type="line"/>
      <point x="527" y="90" type="line"/>
      <point x="527" y="89" type="line"/>
      <point x="526" y="89" type="line"/>
      <point x="526" y="88" type="line"/>
      <point x="525" y="88" type="line"/>
      <point x="524" y="88" type="line"/>
      <point x="522" y="87" type="line"/>
      <point x="521" y="87" type="line"/>
      <point x="520" y="87" type="line"/>
      <point x="519" y="87" type="line"/>
      <point x="518" y="88" type="line"/>
      <point x="517" y="88" type="line"/>
      <point x="516" y="89" type="line"/>
      <point x="515" y="90" type="line" smooth="yes"/>
      <point x="514" y="91"/>
      <point x="514" y="93"/>
      <point x="514" y="94" type="curve" smooth="yes"/>
      <point x="376" y="588" type="line"/>
      <point x="239" y="94" type="line"/>
      <point x="239" y="92" type="line"/>
      <point x="238" y="91" type="line"/>
      <point x="238" y="90" type="line"/>
      <point x="236" y="89" type="line"/>
      <point x="235" y="88" type="line"/>
      <point x="234" y="88" type="line"/>
      <point x="233" y="87" type="line"/>
      <point x="232" y="87" type="line"/>
      <point x="231" y="87" type="line"/>
      <point x="230" y="87" type="line"/>
      <point x="229" y="88" type="line"/>
      <point x="228" y="88" type="line"/>
      <point x="227" y="89" type="line"/>
      <point x="226" y="90" type="line" smooth="yes"/>
      <point x="225" y="91"/>
      <point x="224" y="93"/>
      <point x="224" y="94" type="curve" smooth="yes"/>
      <point x="81" y="608" type="line"/>
    </contour>
    <contour>
      <point x="58" y="623" type="curve" smooth="yes"/>
      <point x="59" y="623" type="line"/>
      <point x="87" y="623" type="line" smooth="yes"/>
      <point x="90" y="623"/>
      <point x="93" y="620"/>
      <point x="94" y="617" type="curve" smooth="yes"/>
      <point x="232" y="121" type="line"/>
      <point x="370" y="617" type="line"/>
      <point x="370" y="618" type="line"/>
      <point x="370" y="619" type="line"/>
      <point x="371" y="619" type="line"/>
      <point x="371" y="620" type="line"/>
      <point x="372" y="620" type="line"/>
      <point x="372" y="622" type="line"/>
      <point x="373" y="622" type="line"/>
      <point x="373" y="623" type="line"/>
      <point x="374" y="623" type="line"/>
      <point x="375" y="623" type="line"/>
      <point x="376" y="623" type="line"/>
      <point x="377" y="623" type="line"/>
      <point x="380" y="623" type="line"/>
      <point x="380" y="622" type="line"/>
      <point x="381" y="622" type="line"/>
      <point x="382" y="620" type="line" smooth="yes"/>
      <point x="383" y="619"/>
      <point x="384" y="617"/>
      <point x="384" y="616" type="curve" smooth="yes"/>
      <point x="521" y="121" type="line"/>
      <point x="659" y="617" type="line" smooth="yes"/>
      <point x="660" y="620"/>
      <point x="663" y="623"/>
      <point x="666" y="623" type="curve" smooth="yes"/>
      <point x="693" y="623" type="line"/>
      <point x="695" y="623" type="line" smooth="yes"/>
      <point x="696" y="623"/>
      <point x="699" y="621"/>
      <point x="700" y="620" type="curve" smooth="yes"/>
      <point x="701" y="620" type="line"/>
      <point x="701" y="619" type="line" smooth="yes"/>
      <point x="701" y="618"/>
      <point x="702" y="617"/>
      <point x="702" y="616" type="curve" smooth="yes"/>
      <point x="702" y="613" type="line"/>
      <point x="528" y="7" type="line"/>
      <point x="528" y="4" type="line"/>
      <point x="527" y="3" type="line"/>
      <point x="527" y="2" type="line"/>
      <point x="526" y="2" type="line"/>
      <point x="526" y="1" type="line"/>
      <point x="525" y="1" type="line"/>
      <point x="524" y="1" type="line"/>
      <point x="522" y="0" type="line"/>
      <point x="521" y="0" type="line"/>
      <point x="520" y="0" type="line"/>
      <point x="519" y="0" type="line"/>
      <point x="519" y="1" type="line"/>
      <point x="518" y="1" type="line" smooth="yes"/>
      <point x="517" y="1"/>
      <point x="516" y="2" type="line" smooth="yes"/>
      <point x="515" y="3"/>
      <point x="514" y="6"/>
      <point x="514" y="7" type="curve" smooth="yes"/>
      <point x="376" y="502" type="line"/>
      <point x="239" y="7" type="line"/>
      <point x="239" y="6" type="line"/>
      <point x="239" y="4" type="line"/>
      <point x="238" y="4" type="line" smooth="yes"/>
      <point x="238" y="3"/>
      <point x="237" y="2"/>
      <point x="236" y="2" type="curve" smooth="yes"/>
      <point x="235" y="2" type="line"/>
      <point x="235" y="1" type="line"/>
      <point x="234" y="1" type="line"/>
      <point x="233" y="1" type="line"/>
      <point x="233" y="0" type="line"/>
      <point x="232" y="0" type="line"/>
      <point x="231" y="0" type="line"/>
      <point x="230" y="0" type="line"/>
      <point x="230" y="1" type="line"/>
      <point x="228" y="1" type="line"/>
      <point x="227" y="2" type="line"/>
      <point x="226" y="3" type="line" smooth="yes"/>
      <point x="226" y="4"/>
      <point x="224" y="6"/>
      <point x="224" y="7" type="curve" smooth="yes"/>
      <point x="52" y="613" type="line" smooth="yes"/>
      <point x="52" y="614"/>
      <point x="51" y="615"/>
      <point x="51" y="616" type="curve" smooth="yes"/>
      <point x="51" y="617" type="line"/>
      <point x="51" y="618" type="line"/>
      <point x="52" y="618" type="line"/>
      <point x="52" y="619" type="line"/>
      <point x="52" y="620" type="line"/>
      <point x="53" y="622" type="line"/>
      <point x="54" y="622" type="line" smooth="yes"/>
      <point x="55" y="622"/>
      <point x="57" y="623"/>
    </contour>
  </outline>
  <lib>
    <dict>
      <key>com.fontlab.hintData</key>
      <dict>
        <key>hhints</key>
        <array>
          <dict>
            <key>position</key>
            <integer>0</integer>
            <key>width</key>
            <integer>23</integer>
          </dict>
          <dict>
            <key>position</key>
            <integer>608</integer>
            <key>width</key>
            <integer>14</integer>
          </dict>
        </array>
        <key>vhints</key>
        <array>
          <dict>
            <key>position</key>
            <integer>224</integer>
            <key>width</key>
            <integer>14</integer>
          </dict>
          <dict>
            <key>position</key>
            <integer>370</integer>
            <key>width</key>
            <integer>14</integer>
          </dict>
          <dict>
            <key>position</key>
            <integer>514</integer>
            <key>width</key>
            <integer>14</integer>
          </dict>
        </array>
      </dict>
    </dict>
  </lib>
</glyph>
