<?xml version="1.0" encoding="UTF-8"?>
<glyph name="seven" format="1">
  <advance width="578"/>
  <unicode hex="0037"/>
  <outline>
    <contour>
      <point x="468" y="581" type="line" smooth="yes"/>
      <point x="467" y="580"/>
      <point x="464" y="580"/>
      <point x="463" y="580" type="curve" smooth="yes"/>
      <point x="454" y="580" type="line"/>
      <point x="185" y="14" type="line"/>
      <point x="198" y="14" type="line"/>
    </contour>
    <contour>
      <point x="468" y="608" type="line"/>
      <point x="461" y="594" type="line"/>
      <point x="463" y="594" type="line" smooth="yes"/>
      <point x="466" y="594"/>
      <point x="471" y="590"/>
      <point x="471" y="587" type="curve" smooth="yes"/>
      <point x="481" y="608" type="line"/>
    </contour>
    <contour>
      <point x="95" y="608" type="line"/>
      <point x="95" y="594" type="line"/>
      <point x="444" y="594" type="line"/>
      <point x="452" y="608" type="line"/>
    </contour>
    <contour>
      <point x="87" y="623" type="curve" smooth="yes"/>
      <point x="88" y="623" type="line"/>
      <point x="462" y="623" type="line"/>
      <point x="463" y="623" type="line"/>
      <point x="464" y="623" type="line"/>
      <point x="492" y="623" type="line" smooth="yes"/>
      <point x="496" y="623"/>
      <point x="499" y="620"/>
      <point x="499" y="616" type="curve" smooth="yes"/>
      <point x="499" y="615"/>
      <point x="498" y="614"/>
      <point x="498" y="613" type="curve" smooth="yes"/>
      <point x="210" y="6" type="line"/>
      <point x="209" y="4" type="line" smooth="yes"/>
      <point x="209" y="3"/>
      <point x="208" y="3" type="line"/>
      <point x="208" y="2" type="line"/>
      <point x="207" y="2" type="line"/>
      <point x="207" y="1" type="line"/>
      <point x="206" y="1" type="line"/>
      <point x="205" y="1" type="line" smooth="yes"/>
      <point x="204" y="1"/>
      <point x="203" y="0"/>
      <point x="202" y="0" type="curve" smooth="yes"/>
      <point x="201" y="0" type="line"/>
      <point x="174" y="0" type="line" smooth="yes"/>
      <point x="170" y="0"/>
      <point x="166" y="4"/>
      <point x="166" y="8" type="curve" smooth="yes"/>
      <point x="166" y="9"/>
      <point x="167" y="10"/>
      <point x="167" y="11" type="curve" smooth="yes"/>
      <point x="438" y="580" type="line"/>
      <point x="87" y="580" type="line" smooth="yes"/>
      <point x="83" y="580"/>
      <point x="79" y="582"/>
      <point x="79" y="586" type="curve" smooth="yes"/>
      <point x="79" y="614" type="line"/>
      <point x="79" y="616" type="line" smooth="yes"/>
      <point x="79" y="617"/>
      <point x="80" y="619"/>
      <point x="81" y="620" type="curve" smooth="yes"/>
      <point x="82" y="622" type="line"/>
      <point x="84" y="622" type="line" smooth="yes"/>
      <point x="85" y="622"/>
      <point x="86" y="623"/>
    </contour>
  </outline>
  <lib>
    <dict>
      <key>com.fontlab.hintData</key>
      <dict>
        <key>hhints</key>
        <array>
          <dict>
            <key>position</key>
            <integer>0</integer>
            <key>width</key>
            <integer>14</integer>
          </dict>
          <dict>
            <key>position</key>
            <integer>580</integer>
            <key>width</key>
            <integer>14</integer>
          </dict>
          <dict>
            <key>position</key>
            <integer>608</integer>
            <key>width</key>
            <integer>14</integer>
          </dict>
        </array>
        <key>vhints</key>
        <array>
          <dict>
            <key>position</key>
            <integer>79</integer>
            <key>width</key>
            <integer>15</integer>
          </dict>
        </array>
      </dict>
    </dict>
  </lib>
</glyph>
