<?xml version="1.0" encoding="UTF-8"?>
<glyph name="Scaron" format="1">
  <advance width="756"/>
  <unicode hex="0160"/>
  <outline>
    <component base="S"/>
    <component base="caron" xOffset="22.3035" yOffset="259"/>
  </outline>
  <lib>
    <dict>
      <key>com.fontlab.hintData</key>
      <dict>
	<key>hhints</key>
	<array>
	  <dict>
	    <key>position</key>	    <integer>-12</integer>
	    <key>width</key>	    <integer>97</integer>
	  </dict>
	  <dict>
	    <key>position</key>	    <integer>672</integer>
	    <key>width</key>	    <integer>110</integer>
	  </dict>
	</array>
	<key>vhints</key>
	<array>
	  <dict>
	    <key>position</key>
	    <integer>80</integer>
	    <key>width</key>
	    <integer>113</integer>
	  </dict>
	  <dict>
	    <key>position</key>
	    <integer>614</integer>
	    <key>width</key>
	    <integer>116</integer>
	  </dict>
	</array>
      </dict>
    </dict>
  </lib>
</glyph>
