<?xml version="1.0" encoding="UTF-8"?>
<glyph name="ibreve" format="1">
  <advance width="348"/>
  <unicode hex="012D"/>
  <outline>
    <component base="breve" xOffset="-53" yOffset="-15.2998"/>
    <component base="dotlessi"/>
  </outline>
  <lib>
    <dict>
      <key>com.fontlab.hintData</key>
      <dict>
	<key>hhints</key>
	<array>
	  <dict>
	    <key>position</key>	    <integer>0</integer>
	    <key>width</key>	    <integer>21</integer>
	  </dict>
	  <dict>
	    <key>position</key>	    <integer>484</integer>
	    <key>width</key>	    <integer>20</integer>
	  </dict>
	  <dict>
	    <key>position</key>	    <integer>561</integer>
	    <key>width</key>	    <integer>64</integer>
	  </dict>
	</array>
	<key>vhints</key>
	<array>
	  <dict>
	    <key>position</key>
	    <integer>82</integer>
	    <key>width</key>
	    <integer>64</integer>
	  </dict>
	  <dict>
	    <key>position</key>
	    <integer>113</integer>
	    <key>width</key>
	    <integer>122</integer>
	  </dict>
	  <dict>
	    <key>position</key>
	    <integer>211</integer>
	    <key>width</key>
	    <integer>64</integer>
	  </dict>
	</array>
      </dict>
    </dict>
  </lib>
</glyph>
