<?xml version="1.0" encoding="UTF-8"?>
<glyph name="Omacron" format="1">
  <advance width="724"/>
  <unicode hex="014C"/>
  <outline>
    <component base="macron" xOffset="108" yOffset="130"/>
    <component base="O"/>
  </outline>
  <lib>
    <dict>
      <key>com.fontlab.hintData</key>
      <dict>
        <key>hhints</key>
        <array>
          <dict>
            <key>position</key>
            <integer>-14</integer>
            <key>width</key>
            <integer>71</integer>
          </dict>
          <dict>
            <key>position</key>
            <integer>717</integer>
            <key>width</key>
            <integer>65</integer>
          </dict>
          <dict>
            <key>position</key>
            <integer>842</integer>
            <key>width</key>
            <integer>56</integer>
          </dict>
        </array>
        <key>vhints</key>
        <array>
          <dict>
            <key>position</key>
            <integer>30</integer>
            <key>width</key>
            <integer>102</integer>
          </dict>
          <dict>
            <key>position</key>
            <integer>214</integer>
            <key>width</key>
            <integer>324</integer>
          </dict>
          <dict>
            <key>position</key>
            <integer>592</integer>
            <key>width</key>
            <integer>102</integer>
          </dict>
        </array>
      </dict>
    </dict>
  </lib>
</glyph>
