<?xml version="1.0" encoding="UTF-8"?>
<glyph name="parenleft" format="1">
  <advance width="236"/>
  <unicode hex="0028"/>
  <outline>
    <contour>
      <point x="185" y="673" type="curve"/>
      <point x="206" y="673" type="line"/>
      <point x="146" y="550"/>
      <point x="119" y="404"/>
      <point x="119" y="256" type="curve" smooth="yes"/>
      <point x="119" y="96"/>
      <point x="151" y="-67"/>
      <point x="206" y="-200" type="curve"/>
      <point x="185" y="-200" type="line"/>
      <point x="90" y="-73"/>
      <point x="30" y="86"/>
      <point x="30" y="250" type="curve" smooth="yes"/>
      <point x="30" y="394"/>
      <point x="76" y="541"/>
    </contour>
  </outline>
  <lib>
    <dict>
      <key>com.fontlab.hintData</key>
      <dict>
        <key>vhints</key>
        <array>
          <dict>
            <key>position</key>
            <integer>30</integer>
            <key>width</key>
            <integer>89</integer>
          </dict>
        </array>
      </dict>
    </dict>
  </lib>
</glyph>
