<?xml version="1.0" encoding="UTF-8"?>
<glyph name="gcircumflex" format="1">
  <advance width="644"/>
  <unicode hex="011D"/>
  <outline>
    <component base="asciicircum" xOffset="94.5435" yOffset="-7"/>
    <component base="g"/>
  </outline>
  <lib>
    <dict>
      <key>com.fontlab.hintData</key>
      <dict>
        <key>hhints</key>
        <array>
          <dict>
            <key>position</key>
            <integer>-214</integer>
            <key>width</key>
            <integer>51</integer>
          </dict>
          <dict>
            <key>position</key>
            <integer>27</integer>
            <key>width</key>
            <integer>63</integer>
          </dict>
          <dict>
            <key>position</key>
            <integer>452</integer>
            <key>width</key>
            <integer>64</integer>
          </dict>
        </array>
        <key>vhints</key>
        <array>
          <dict>
            <key>position</key>
            <integer>60</integer>
            <key>width</key>
            <integer>92</integer>
          </dict>
          <dict>
            <key>position</key>
            <integer>71</integer>
            <key>width</key>
            <integer>110</integer>
          </dict>
          <dict>
            <key>position</key>
            <integer>439</integer>
            <key>width</key>
            <integer>92</integer>
          </dict>
        </array>
      </dict>
    </dict>
  </lib>
</glyph>
