<?xml version="1.0" encoding="UTF-8"?>
<glyph name="abreve" format="1">
  <advance width="581"/>
  <unicode hex="0103"/>
  <outline>
    <component base="breve" xOffset="46.22" yOffset="-10.2998"/>
    <component base="a"/>
  </outline>
  <lib>
    <dict>
      <key>com.fontlab.hintData</key>
      <dict>
        <key>hhints</key>
        <array>
          <dict>
            <key>position</key>
            <integer>-13</integer>
            <key>width</key>
            <integer>50</integer>
          </dict>
          <dict>
            <key>position</key>
            <integer>0</integer>
            <key>width</key>
            <integer>37</integer>
          </dict>
          <dict>
            <key>position</key>
            <integer>465</integer>
            <key>width</key>
            <integer>56</integer>
          </dict>
          <dict>
            <key>position</key>
            <integer>581</integer>
            <key>width</key>
            <integer>34</integer>
          </dict>
        </array>
        <key>vhints</key>
        <array>
          <dict>
            <key>position</key>
            <integer>30</integer>
            <key>width</key>
            <integer>92</integer>
          </dict>
          <dict>
            <key>position</key>
            <integer>47</integer>
            <key>width</key>
            <integer>116</integer>
          </dict>
          <dict>
            <key>position</key>
            <integer>196</integer>
            <key>width</key>
            <integer>34</integer>
          </dict>
          <dict>
            <key>position</key>
            <integer>325</integer>
            <key>width</key>
            <integer>34</integer>
          </dict>
          <dict>
            <key>position</key>
            <integer>377</integer>
            <key>width</key>
            <integer>91</integer>
          </dict>
        </array>
      </dict>
    </dict>
  </lib>
</glyph>
