<?xml version="1.0" encoding="UTF-8"?>
<glyph name="hyphen" format="1">
  <advance width="402"/>
  <unicode hex="002D"/>
  <outline>
    <contour>
      <point x="30" y="348" type="line"/>
      <point x="372" y="348" type="line"/>
      <point x="372" y="264" type="line"/>
      <point x="30" y="264" type="line"/>
    </contour>
  </outline>
  <lib>
    <dict>
      <key>com.fontlab.hintData</key>
      <dict>
        <key>hhints</key>
        <array>
          <dict>
            <key>position</key>
            <integer>264</integer>
            <key>width</key>
            <integer>84</integer>
          </dict>
        </array>
      </dict>
    </dict>
  </lib>
</glyph>
