<?xml version="1.0" encoding="UTF-8"?>
<glyph name="ydieresis" format="1">
  <advance width="715"/>
  <unicode hex="00FF"/>
  <outline>
    <component base="dieresis" xOffset="100.681" yOffset="-40.2998"/>
    <component base="y"/>
  </outline>
  <lib>
    <dict>
      <key>com.fontlab.hintData</key>
      <dict>
        <key>hhints</key>
        <array>
          <dict>
            <key>position</key>
            <integer>-212</integer>
            <key>width</key>
            <integer>50</integer>
          </dict>
          <dict>
            <key>position</key>
            <integer>467</integer>
            <key>width</key>
            <integer>37</integer>
          </dict>
          <dict>
            <key>position</key>
            <integer>608</integer>
            <key>width</key>
            <integer>114</integer>
          </dict>
        </array>
        <key>vhints</key>
        <array>
          <dict>
            <key>position</key>
            <integer>30</integer>
            <key>width</key>
            <integer>97</integer>
          </dict>
          <dict>
            <key>position</key>
            <integer>259</integer>
            <key>width</key>
            <integer>113</integer>
          </dict>
          <dict>
            <key>position</key>
            <integer>440</integer>
            <key>width</key>
            <integer>113</integer>
          </dict>
        </array>
      </dict>
    </dict>
  </lib>
</glyph>
