<?xml version="1.0" encoding="UTF-8"?>
<glyph name="five" format="1">
  <advance width="636"/>
  <unicode hex="0035"/>
  <outline>
    <contour>
      <point x="302" y="524" type="curve" smooth="yes"/>
      <point x="206" y="524"/>
      <point x="129" y="451"/>
      <point x="129" y="451" type="curve"/>
      <point x="129" y="691" type="line"/>
      <point x="129" y="691"/>
      <point x="179" y="638"/>
      <point x="309" y="638" type="curve" smooth="yes"/>
      <point x="439" y="638"/>
      <point x="557" y="687"/>
      <point x="557" y="687" type="curve"/>
      <point x="545" y="704" type="line"/>
      <point x="497" y="681.417"/>
      <point x="461.107" y="730"/>
      <point x="478" y="770" type="curve"/>
      <point x="465" y="786" type="line"/>
      <point x="465" y="786"/>
      <point x="427" y="717"/>
      <point x="307" y="717" type="curve" smooth="yes"/>
      <point x="187" y="717"/>
      <point x="122" y="768"/>
      <point x="122" y="768" type="curve"/>
      <point x="46" y="768" type="line"/>
      <point x="46" y="358" type="line" smooth="yes"/>
      <point x="122" y="337.968" type="line" smooth="yes"/>
      <point x="122" y="337.968"/>
      <point x="190" y="453.206"/>
      <point x="301" y="452.457" type="curve" smooth="yes"/>
      <point x="445" y="451.486"/>
      <point x="486" y="344.236"/>
      <point x="486" y="265" type="curve" smooth="yes"/>
      <point x="486" y="213"/>
      <point x="446" y="52"/>
      <point x="284" y="52" type="curve" smooth="yes"/>
      <point x="226.493" y="52"/>
      <point x="158" y="72"/>
      <point x="158" y="127" type="curve" smooth="yes"/>
      <point x="158" y="184"/>
      <point x="250" y="200"/>
      <point x="250" y="200" type="curve"/>
      <point x="242" y="222" type="line"/>
      <point x="152" y="194.16"/>
      <point x="72.5352" y="210"/>
      <point x="85" y="282" type="curve"/>
      <point x="65" y="287" type="line"/>
      <point x="65" y="287"/>
      <point x="39" y="252.244"/>
      <point x="39" y="194" type="curve" smooth="yes"/>
      <point x="39" y="78"/>
      <point x="141" y="-12"/>
      <point x="285" y="-12" type="curve" smooth="yes"/>
      <point x="482" y="-12"/>
      <point x="578" y="147"/>
      <point x="578" y="268" type="curve" smooth="yes"/>
      <point x="578" y="370.215"/>
      <point x="539" y="524"/>
    </contour>
  </outline>
  <lib>
    <dict>
      <key>com.fontlab.hintData</key>
      <dict>
        <key>hhints</key>
        <array>
          <dict>
            <key>position</key>
            <integer>-12</integer>
            <key>width</key>
            <integer>64</integer>
          </dict>
          <dict>
            <key>position</key>
            <integer>452</integer>
            <key>width</key>
            <integer>72</integer>
          </dict>
          <dict>
            <key>position</key>
            <integer>638</integer>
            <key>width</key>
            <integer>79</integer>
          </dict>
        </array>
        <key>vhints</key>
        <array>
          <dict>
            <key>position</key>
            <integer>39</integer>
            <key>width</key>
            <integer>119</integer>
          </dict>
          <dict>
            <key>position</key>
            <integer>486</integer>
            <key>width</key>
            <integer>92</integer>
          </dict>
        </array>
      </dict>
    </dict>
  </lib>
</glyph>
