<?xml version="1.0" encoding="UTF-8"?>
<glyph name="Yacute" format="1">
  <advance width="756"/>
  <unicode hex="00DD"/>
  <outline>
    <component base="Y"/>
    <component base="acute" xOffset="138" yOffset="259"/>
  </outline>
  <lib>
    <dict>
      <key>com.fontlab.hintData</key>
      <dict>
	<key>hhints</key>
	<array>
	  <dict>
	    <key>position</key>	    <integer>0</integer>
	    <key>width</key>	    <integer>21</integer>
	  </dict>
	  <dict>
	    <key>position</key>	    <integer>748</integer>
	    <key>width</key>	    <integer>20</integer>
	  </dict>
	</array>
	<key>vhints</key>
	<array>
	  <dict>
	    <key>position</key>
	    <integer>305</integer>
	    <key>width</key>
	    <integer>131</integer>
	  </dict>
	</array>
      </dict>
    </dict>
  </lib>
</glyph>
