<?xml version="1.0" encoding="UTF-8"?>
<glyph name="Eacute" format="1">
  <advance width="643"/>
  <unicode hex="00C9"/>
  <outline>
    <component base="acute" xOffset="23.5" yOffset="259"/>
    <component base="E"/>
  </outline>
  <lib>
    <dict>
      <key>com.fontlab.hintData</key>
      <dict>
        <key>hhints</key>
        <array>
          <dict>
            <key>position</key>
            <integer>0</integer>
            <key>width</key>
            <integer>37</integer>
          </dict>
          <dict>
            <key>position</key>
            <integer>0</integer>
            <key>width</key>
            <integer>78</integer>
          </dict>
          <dict>
            <key>position</key>
            <integer>358</integer>
            <key>width</key>
            <integer>69</integer>
          </dict>
          <dict>
            <key>position</key>
            <integer>490</integer>
            <key>width</key>
            <integer>20</integer>
          </dict>
          <dict>
            <key>position</key>
            <integer>690</integer>
            <key>width</key>
            <integer>78</integer>
          </dict>
          <dict>
            <key>position</key>
            <integer>731</integer>
            <key>width</key>
            <integer>37</integer>
          </dict>
          <dict>
            <key>position</key>
            <integer>842</integer>
            <key>width</key>
            <integer>185</integer>
          </dict>
        </array>
        <key>vhints</key>
        <array>
          <dict>
            <key>position</key>
            <integer>113</integer>
            <key>width</key>
            <integer>92</integer>
          </dict>
          <dict>
            <key>position</key>
            <integer>262</integer>
            <key>width</key>
            <integer>173</integer>
          </dict>
          <dict>
            <key>position</key>
            <integer>506</integer>
            <key>width</key>
            <integer>37</integer>
          </dict>
          <dict>
            <key>position</key>
            <integer>577</integer>
            <key>width</key>
            <integer>36</integer>
          </dict>
        </array>
      </dict>
    </dict>
  </lib>
</glyph>
