<?xml version="1.0" encoding="UTF-8"?>
<glyph name="uni261A" format="1">
  <advance width="1645"/>
  <unicode hex="261A"/>
  <outline>
    <contour>
      <point x="1540" y="545" type="curve" smooth="yes"/>
      <point x="1558" y="545"/>
      <point x="1576" y="534"/>
      <point x="1576" y="516" type="curve" smooth="yes"/>
      <point x="1576" y="330"/>
      <point x="1616" y="226"/>
      <point x="1616" y="40" type="curve" smooth="yes"/>
      <point x="1616" y="19"/>
      <point x="1601" y="0"/>
      <point x="1580" y="0" type="curve" smooth="yes"/>
      <point x="1455" y="0"/>
      <point x="1385" y="0"/>
      <point x="1260" y="0" type="curve" smooth="yes"/>
      <point x="1200" y="0"/>
      <point x="1182" y="125"/>
      <point x="1136" y="125" type="curve" smooth="yes"/>
      <point x="1048" y="125"/>
      <point x="990" y="78"/>
      <point x="816" y="78" type="curve" smooth="yes"/>
      <point x="736" y="78"/>
      <point x="724" y="37"/>
      <point x="724" y="37" type="curve"/>
      <point x="729" y="34" type="line"/>
      <point x="729" y="34"/>
      <point x="750" y="71"/>
      <point x="787" y="63" type="curve" smooth="yes"/>
      <point x="799" y="60"/>
      <point x="801" y="41"/>
      <point x="794" y="30" type="curve" smooth="yes"/>
      <point x="771" y="-4"/>
      <point x="743" y="-43"/>
      <point x="700" y="-37" type="curve" smooth="yes"/>
      <point x="627" y="-27"/>
      <point x="580" y="-8"/>
      <point x="573" y="17" type="curve" smooth="yes"/>
      <point x="568" y="34"/>
      <point x="627" y="138"/>
      <point x="727" y="137" type="curve"/>
      <point x="727" y="150" type="line"/>
      <point x="727" y="150"/>
      <point x="711" y="153"/>
      <point x="682" y="151" type="curve" smooth="yes"/>
      <point x="635" y="147"/>
      <point x="583" y="78"/>
      <point x="537" y="78" type="curve" smooth="yes"/>
      <point x="486" y="78"/>
      <point x="472" y="98"/>
      <point x="472" y="116" type="curve" smooth="yes"/>
      <point x="471" y="135"/>
      <point x="510" y="231"/>
      <point x="629" y="266" type="curve"/>
      <point x="627" y="276" type="line"/>
      <point x="489" y="243"/>
      <point x="480" y="173"/>
      <point x="451" y="176" type="curve" smooth="yes"/>
      <point x="408" y="180"/>
      <point x="372" y="208"/>
      <point x="372" y="228" type="curve" smooth="yes"/>
      <point x="372" y="248"/>
      <point x="500" y="400"/>
      <point x="567" y="400" type="curve"/>
      <point x="567" y="400"/>
      <point x="525" y="418"/>
      <point x="464" y="418" type="curve" smooth="yes"/>
      <point x="403" y="418"/>
      <point x="197" y="319"/>
      <point x="119" y="340" type="curve" smooth="yes"/>
      <point x="41" y="361"/>
      <point x="20" y="394"/>
      <point x="35" y="412" type="curve" smooth="yes"/>
      <point x="50" y="430"/>
      <point x="350" y="556"/>
      <point x="518" y="556" type="curve" smooth="yes"/>
      <point x="686" y="556"/>
      <point x="1100" y="475"/>
      <point x="1166" y="475" type="curve" smooth="yes"/>
      <point x="1232" y="475"/>
      <point x="1210" y="516"/>
      <point x="1244" y="516" type="curve" smooth="yes"/>
      <point x="1360" y="516"/>
      <point x="1424" y="545"/>
    </contour>
    <contour>
      <point x="1199" y="442" type="line"/>
      <point x="1263" y="343"/>
      <point x="1255" y="217"/>
      <point x="1232" y="97" type="curve"/>
      <point x="1254" y="65" type="line"/>
      <point x="1280" y="202"/>
      <point x="1288" y="355"/>
      <point x="1229" y="454" type="curve"/>
    </contour>
    <contour>
      <point x="1373" y="448" type="curve" smooth="yes"/>
      <point x="1373" y="435"/>
      <point x="1383" y="425"/>
      <point x="1396" y="425" type="curve" smooth="yes"/>
      <point x="1409" y="425"/>
      <point x="1419" y="435"/>
      <point x="1419" y="448" type="curve" smooth="yes"/>
      <point x="1419" y="461"/>
      <point x="1409" y="471"/>
      <point x="1396" y="471" type="curve" smooth="yes"/>
      <point x="1383" y="471"/>
      <point x="1373" y="461"/>
    </contour>
    <contour>
      <point x="1483" y="355" type="curve" smooth="yes"/>
      <point x="1483" y="342"/>
      <point x="1493" y="332"/>
      <point x="1506" y="332" type="curve" smooth="yes"/>
      <point x="1519" y="332"/>
      <point x="1529" y="342"/>
      <point x="1529" y="355" type="curve" smooth="yes"/>
      <point x="1529" y="368"/>
      <point x="1519" y="378"/>
      <point x="1506" y="378" type="curve" smooth="yes"/>
      <point x="1493" y="378"/>
      <point x="1483" y="368"/>
    </contour>
    <contour>
      <point x="1475" y="445" type="curve" smooth="yes"/>
      <point x="1475" y="432"/>
      <point x="1485" y="422"/>
      <point x="1498" y="422" type="curve" smooth="yes"/>
      <point x="1511" y="422"/>
      <point x="1521" y="432"/>
      <point x="1521" y="445" type="curve" smooth="yes"/>
      <point x="1521" y="458"/>
      <point x="1511" y="468"/>
      <point x="1498" y="468" type="curve" smooth="yes"/>
      <point x="1485" y="468"/>
      <point x="1475" y="458"/>
    </contour>
    <contour>
      <point x="1393" y="356" type="curve" smooth="yes"/>
      <point x="1393" y="343"/>
      <point x="1403" y="333"/>
      <point x="1416" y="333" type="curve" smooth="yes"/>
      <point x="1429" y="333"/>
      <point x="1439" y="343"/>
      <point x="1439" y="356" type="curve" smooth="yes"/>
      <point x="1439" y="369"/>
      <point x="1429" y="379"/>
      <point x="1416" y="379" type="curve" smooth="yes"/>
      <point x="1403" y="379"/>
      <point x="1393" y="369"/>
    </contour>
    <contour>
      <point x="1315" y="395" type="curve" smooth="yes"/>
      <point x="1315" y="382"/>
      <point x="1325" y="372"/>
      <point x="1338" y="372" type="curve" smooth="yes"/>
      <point x="1351" y="372"/>
      <point x="1361" y="382"/>
      <point x="1361" y="395" type="curve" smooth="yes"/>
      <point x="1361" y="408"/>
      <point x="1351" y="418"/>
      <point x="1338" y="418" type="curve" smooth="yes"/>
      <point x="1325" y="418"/>
      <point x="1315" y="408"/>
    </contour>
    <contour>
      <point x="1315" y="285" type="curve" smooth="yes"/>
      <point x="1315" y="272"/>
      <point x="1325" y="262"/>
      <point x="1338" y="262" type="curve" smooth="yes"/>
      <point x="1351" y="262"/>
      <point x="1361" y="272"/>
      <point x="1361" y="285" type="curve" smooth="yes"/>
      <point x="1361" y="298"/>
      <point x="1351" y="308"/>
      <point x="1338" y="308" type="curve" smooth="yes"/>
      <point x="1325" y="308"/>
      <point x="1315" y="298"/>
    </contour>
    <contour>
      <point x="1405" y="255" type="curve" smooth="yes"/>
      <point x="1405" y="242"/>
      <point x="1415" y="232"/>
      <point x="1428" y="232" type="curve" smooth="yes"/>
      <point x="1441" y="232"/>
      <point x="1451" y="242"/>
      <point x="1451" y="255" type="curve" smooth="yes"/>
      <point x="1451" y="268"/>
      <point x="1441" y="278"/>
      <point x="1428" y="278" type="curve" smooth="yes"/>
      <point x="1415" y="278"/>
      <point x="1405" y="268"/>
    </contour>
    <contour>
      <point x="1495" y="255" type="curve" smooth="yes"/>
      <point x="1495" y="242"/>
      <point x="1505" y="232"/>
      <point x="1518" y="232" type="curve" smooth="yes"/>
      <point x="1531" y="232"/>
      <point x="1541" y="242"/>
      <point x="1541" y="255" type="curve" smooth="yes"/>
      <point x="1541" y="268"/>
      <point x="1531" y="278"/>
      <point x="1518" y="278" type="curve" smooth="yes"/>
      <point x="1505" y="278"/>
      <point x="1495" y="268"/>
    </contour>
    <contour>
      <point x="1495" y="165" type="curve" smooth="yes"/>
      <point x="1495" y="152"/>
      <point x="1505" y="142"/>
      <point x="1518" y="142" type="curve" smooth="yes"/>
      <point x="1531" y="142"/>
      <point x="1541" y="152"/>
      <point x="1541" y="165" type="curve" smooth="yes"/>
      <point x="1541" y="178"/>
      <point x="1531" y="188"/>
      <point x="1518" y="188" type="curve" smooth="yes"/>
      <point x="1505" y="188"/>
      <point x="1495" y="178"/>
    </contour>
    <contour>
      <point x="1391" y="165" type="curve" smooth="yes"/>
      <point x="1391" y="152"/>
      <point x="1401" y="142"/>
      <point x="1414" y="142" type="curve" smooth="yes"/>
      <point x="1427" y="142"/>
      <point x="1437" y="152"/>
      <point x="1437" y="165" type="curve" smooth="yes"/>
      <point x="1437" y="178"/>
      <point x="1427" y="188"/>
      <point x="1414" y="188" type="curve" smooth="yes"/>
      <point x="1401" y="188"/>
      <point x="1391" y="178"/>
    </contour>
    <contour>
      <point x="1321" y="195" type="curve" smooth="yes"/>
      <point x="1321" y="182"/>
      <point x="1331" y="172"/>
      <point x="1344" y="172" type="curve" smooth="yes"/>
      <point x="1357" y="172"/>
      <point x="1367" y="182"/>
      <point x="1367" y="195" type="curve" smooth="yes"/>
      <point x="1367" y="208"/>
      <point x="1357" y="218"/>
      <point x="1344" y="218" type="curve" smooth="yes"/>
      <point x="1331" y="218"/>
      <point x="1321" y="208"/>
    </contour>
    <contour>
      <point x="1311" y="95" type="curve" smooth="yes"/>
      <point x="1311" y="82"/>
      <point x="1321" y="72"/>
      <point x="1334" y="72" type="curve" smooth="yes"/>
      <point x="1347" y="72"/>
      <point x="1357" y="82"/>
      <point x="1357" y="95" type="curve" smooth="yes"/>
      <point x="1357" y="108"/>
      <point x="1347" y="118"/>
      <point x="1334" y="118" type="curve" smooth="yes"/>
      <point x="1321" y="118"/>
      <point x="1311" y="108"/>
    </contour>
    <contour>
      <point x="1411" y="75" type="curve" smooth="yes"/>
      <point x="1411" y="62"/>
      <point x="1421" y="52"/>
      <point x="1434" y="52" type="curve" smooth="yes"/>
      <point x="1447" y="52"/>
      <point x="1457" y="62"/>
      <point x="1457" y="75" type="curve" smooth="yes"/>
      <point x="1457" y="88"/>
      <point x="1447" y="98"/>
      <point x="1434" y="98" type="curve" smooth="yes"/>
      <point x="1421" y="98"/>
      <point x="1411" y="88"/>
    </contour>
    <contour>
      <point x="1501" y="75" type="curve" smooth="yes"/>
      <point x="1501" y="62"/>
      <point x="1511" y="52"/>
      <point x="1524" y="52" type="curve" smooth="yes"/>
      <point x="1537" y="52"/>
      <point x="1547" y="62"/>
      <point x="1547" y="75" type="curve" smooth="yes"/>
      <point x="1547" y="88"/>
      <point x="1537" y="98"/>
      <point x="1524" y="98" type="curve" smooth="yes"/>
      <point x="1511" y="98"/>
      <point x="1501" y="88"/>
    </contour>
  </outline>
  <lib>
    <dict>
      <key>com.fontlab.hintData</key>
      <dict>
        <key>hhints</key>
        <array>
          <dict>
            <key>position</key>
            <integer>0</integer>
            <key>width</key>
            <integer>72</integer>
          </dict>
          <dict>
            <key>position</key>
            <integer>0</integer>
            <key>width</key>
            <integer>52</integer>
          </dict>
          <dict>
            <key>position</key>
            <integer>98</integer>
            <key>width</key>
            <integer>44</integer>
          </dict>
          <dict>
            <key>position</key>
            <integer>118</integer>
            <key>width</key>
            <integer>54</integer>
          </dict>
          <dict>
            <key>position</key>
            <integer>125</integer>
            <key>width</key>
            <integer>350</integer>
          </dict>
          <dict>
            <key>position</key>
            <integer>188</integer>
            <key>width</key>
            <integer>44</integer>
          </dict>
          <dict>
            <key>position</key>
            <integer>218</integer>
            <key>width</key>
            <integer>44</integer>
          </dict>
          <dict>
            <key>position</key>
            <integer>278</integer>
            <key>width</key>
            <integer>55</integer>
          </dict>
          <dict>
            <key>position</key>
            <integer>308</integer>
            <key>width</key>
            <integer>64</integer>
          </dict>
          <dict>
            <key>position</key>
            <integer>379</integer>
            <key>width</key>
            <integer>46</integer>
          </dict>
          <dict>
            <key>position</key>
            <integer>418</integer>
            <key>width</key>
            <integer>138</integer>
          </dict>
          <dict>
            <key>position</key>
            <integer>468</integer>
            <key>width</key>
            <integer>77</integer>
          </dict>
        </array>
        <key>vhints</key>
        <array>
          <dict>
            <key>position</key>
            <integer>1357</integer>
            <key>width</key>
            <integer>54</integer>
          </dict>
          <dict>
            <key>position</key>
            <integer>1419</integer>
            <key>width</key>
            <integer>56</integer>
          </dict>
          <dict>
            <key>position</key>
            <integer>1437</integer>
            <key>width</key>
            <integer>58</integer>
          </dict>
          <dict>
            <key>position</key>
            <integer>1439</integer>
            <key>width</key>
            <integer>44</integer>
          </dict>
          <dict>
            <key>position</key>
            <integer>1451</integer>
            <key>width</key>
            <integer>44</integer>
          </dict>
          <dict>
            <key>position</key>
            <integer>1541</integer>
            <key>width</key>
            <integer>75</integer>
          </dict>
        </array>
      </dict>
    </dict>
  </lib>
</glyph>
