<?xml version="1.0" encoding="UTF-8"?>
<glyph name="Oslash" format="1">
  <advance width="788"/>
  <unicode hex="00D8"/>
  <outline>
    <contour>
      <point x="98.7227" y="158.112" type="line"/>
      <point x="58.4873" y="227.06"/>
      <point x="36.5898" y="306.556"/>
      <point x="36.5898" y="391.709" type="curve" smooth="yes"/>
      <point x="36.5898" y="604.492"/>
      <point x="181.05" y="782"/>
      <point x="398.474" y="782" type="curve" smooth="yes"/>
      <point x="505.013" y="782"/>
      <point x="597.387" y="738.45"/>
      <point x="660.73" y="670.554" type="curve"/>
      <point x="687.983" y="696.817" type="line"/>
      <point x="698.59" y="707.038" type="line"/>
      <point x="709.196" y="696.817" type="line"/>
      <point x="760.196" y="647.669" type="line"/>
      <point x="770.803" y="637.448" type="line"/>
      <point x="760.196" y="627.227" type="line"/>
      <point x="716.789" y="585.396" type="line"/>
      <point x="745.325" y="527.354"/>
      <point x="760.59" y="462.299"/>
      <point x="760.59" y="391.709" type="curve" smooth="yes"/>
      <point x="760.59" y="179.495"/>
      <point x="616.741" y="-14"/>
      <point x="398.474" y="-14" type="curve" smooth="yes"/>
      <point x="305.491" y="-14"/>
      <point x="223.27" y="22.7822"/>
      <point x="162.003" y="78.9766" type="curve"/>
      <point x="115.196" y="34.5635" type="line"/>
      <point x="104.792" y="24.5361" type="line"/>
      <point x="94.1895" y="34.3682" type="line"/>
      <point x="41.1895" y="83.5166" type="line"/>
      <point x="30" y="93.8926" type="line"/>
      <point x="41.1475" y="104.31" type="line"/>
    </contour>
    <contour>
      <point x="169.774" y="377" type="curve" smooth="yes"/>
      <point x="169.774" y="320.185"/>
      <point x="177.496" y="268.836"/>
      <point x="192.232" y="225.325" type="curve"/>
      <point x="576.601" y="586.67" type="line"/>
      <point x="536.681" y="651.896"/>
      <point x="476.816" y="687"/>
      <point x="398.474" y="687" type="curve" smooth="yes"/>
      <point x="258.001" y="687"/>
      <point x="169.774" y="569.772"/>
    </contour>
    <contour>
      <point x="617.271" y="510.477" type="curve"/>
      <point x="243.937" y="159.506" type="line"/>
      <point x="282.757" y="112.794"/>
      <point x="333.962" y="87"/>
      <point x="398.474" y="87" type="curve" smooth="yes"/>
      <point x="538.3" y="87"/>
      <point x="627.174" y="213.784"/>
      <point x="627.174" y="407" type="curve" smooth="yes"/>
      <point x="627.174" y="444.396"/>
      <point x="623.789" y="480.009"/>
    </contour>
  </outline>
  <lib>
    <dict>
      <key>com.fontlab.hintData</key>
      <dict>
	<key>hhints</key>
	<array>
	  <dict>
	    <key>position</key>	    <integer>-14</integer>
	    <key>width</key>	    <integer>101</integer>
	  </dict>
	  <dict>
	    <key>position</key>	    <integer>687</integer>
	    <key>width</key>	    <integer>95</integer>
	  </dict>
	</array>
	<key>vhints</key>
	<array>
	  <dict>
	    <key>position</key>
	    <integer>37</integer>
	    <key>width</key>
	    <integer>133</integer>
	  </dict>
	  <dict>
	    <key>position</key>
	    <integer>627</integer>
	    <key>width</key>
	    <integer>133</integer>
	  </dict>
	</array>
      </dict>
    </dict>
  </lib>
</glyph>
