<?xml version="1.0" encoding="UTF-8"?>
<glyph name="ntilde" format="1">
  <advance width="669"/>
  <unicode hex="00F1"/>
  <outline>
    <component base="asciitilde" xOffset="17" yOffset="-61"/>
    <component base="n"/>
  </outline>
  <lib>
    <dict>
      <key>com.fontlab.hintData</key>
      <dict>
        <key>hhints</key>
        <array>
          <dict>
            <key>position</key>
            <integer>0</integer>
            <key>width</key>
            <integer>37</integer>
          </dict>
          <dict>
            <key>position</key>
            <integer>447</integer>
            <key>width</key>
            <integer>69</integer>
          </dict>
          <dict>
            <key>position</key>
            <integer>468</integer>
            <key>width</key>
            <integer>36</integer>
          </dict>
          <dict>
            <key>position</key>
            <integer>576</integer>
            <key>width</key>
            <integer>65</integer>
          </dict>
          <dict>
            <key>position</key>
            <integer>641</integer>
            <key>width</key>
            <integer>63</integer>
          </dict>
        </array>
        <key>vhints</key>
        <array>
          <dict>
            <key>position</key>
            <integer>113</integer>
            <key>width</key>
            <integer>92</integer>
          </dict>
          <dict>
            <key>position</key>
            <integer>464</integer>
            <key>width</key>
            <integer>92</integer>
          </dict>
        </array>
      </dict>
    </dict>
  </lib>
</glyph>
