<?xml version="1.0" encoding="UTF-8"?>
<glyph name="sacute" format="1">
  <advance width="473"/>
  <unicode hex="015B"/>
  <outline>
    <component base="acute" xOffset="-85.7893" yOffset="-7"/>
    <component base="s"/>
  </outline>
  <lib>
    <dict>
      <key>com.fontlab.hintData</key>
      <dict>
        <key>hhints</key>
        <array>
          <dict>
            <key>position</key>
            <integer>-12</integer>
            <key>width</key>
            <integer>66</integer>
          </dict>
          <dict>
            <key>position</key>
            <integer>454</integer>
            <key>width</key>
            <integer>62</integer>
          </dict>
          <dict>
            <key>position</key>
            <integer>484</integer>
            <key>width</key>
            <integer>20</integer>
          </dict>
          <dict>
            <key>position</key>
            <integer>576</integer>
            <key>width</key>
            <integer>185</integer>
          </dict>
        </array>
        <key>vhints</key>
        <array>
          <dict>
            <key>position</key>
            <integer>39</integer>
            <key>width</key>
            <integer>85</integer>
          </dict>
          <dict>
            <key>position</key>
            <integer>88</integer>
            <key>width</key>
            <integer>16</integer>
          </dict>
          <dict>
            <key>position</key>
            <integer>152</integer>
            <key>width</key>
            <integer>173</integer>
          </dict>
          <dict>
            <key>position</key>
            <integer>350</integer>
            <key>width</key>
            <integer>93</integer>
          </dict>
          <dict>
            <key>position</key>
            <integer>357</integer>
            <key>width</key>
            <integer>16</integer>
          </dict>
        </array>
      </dict>
    </dict>
  </lib>
</glyph>
