<?xml version="1.0" encoding="UTF-8" standalone="no"?>
<svg
   xmlns:dc="http://purl.org/dc/elements/1.1/"
   xmlns:cc="http://creativecommons.org/ns#"
   xmlns:rdf="http://www.w3.org/1999/02/22-rdf-syntax-ns#"
   xmlns:svg="http://www.w3.org/2000/svg"
   xmlns="http://www.w3.org/2000/svg"
   xmlns:sodipodi="http://sodipodi.sourceforge.net/DTD/sodipodi-0.dtd"
   xmlns:inkscape="http://www.inkscape.org/namespaces/inkscape"
   data-dec="110"
   id="dec_110"
   width="19"
   height="40"
   version="1.1"
   sodipodi:docname="110.svg"
   inkscape:version="0.92.4 5da689c313, 2019-01-14">
  <metadata
     id="metadata9">
    <rdf:RDF>
      <cc:Work
         rdf:about="">
        <dc:format>image/svg+xml</dc:format>
        <dc:type
           rdf:resource="http://purl.org/dc/dcmitype/StillImage" />
        <dc:title />
      </cc:Work>
    </rdf:RDF>
  </metadata>
  <defs
     id="defs7" />
  <sodipodi:namedview
     pagecolor="#ffffff"
     bordercolor="#666666"
     borderopacity="1"
     objecttolerance="10"
     gridtolerance="10"
     guidetolerance="10"
     inkscape:pageopacity="0"
     inkscape:pageshadow="2"
     inkscape:window-width="1920"
     inkscape:window-height="1043"
     id="namedview5"
     showgrid="true"
     inkscape:zoom="45.254834"
     inkscape:cx="4.9103451"
     inkscape:cy="35.13681"
     inkscape:window-x="0"
     inkscape:window-y="37"
     inkscape:window-maximized="0"
     inkscape:current-layer="dec_110"
     showguides="false">
    <inkscape:grid
       type="xygrid"
       id="grid812" />
  </sodipodi:namedview>
  <path
     id="path2-3"
     style="fill:none;stroke:#000000;stroke-width:1;stroke-linecap:round;stroke-linejoin:round"
     d="M 4,9 V 22 M 5,8 V 22 M 5,12 c 1.0138277,-2.0541175 3.0615743,-3.0307872 5,-4 2.443512,-0.1134838 4.298978,1.6210589 5,3 V 22 M 10,8 c 1.80201,0.5952798 3.200835,1.4016692 4,3 V 22 M 5,8 C 4.569737,9.3005783 3,9 2,9 2.9868979,9 4,9.3810396 4,10 m 10,11 c -0.669032,0.846613 -0.996155,1 -2,1 h 5 c -1.033061,0.153995 -1.304502,-0.304502 -2,-1 M 4,21 C 3.3309683,21.846613 3.0038446,22 2,22 H 7 C 5.9669388,22.153995 5.6954983,21.695498 5,21"
     inkscape:connector-curvature="0"
     sodipodi:nodetypes="cccccccccccccccccccccc" />
</svg>
