<?xml version="1.0" encoding="UTF-8" standalone="no"?>
<svg
   xmlns:dc="http://purl.org/dc/elements/1.1/"
   xmlns:cc="http://creativecommons.org/ns#"
   xmlns:rdf="http://www.w3.org/1999/02/22-rdf-syntax-ns#"
   xmlns:svg="http://www.w3.org/2000/svg"
   xmlns="http://www.w3.org/2000/svg"
   xmlns:sodipodi="http://sodipodi.sourceforge.net/DTD/sodipodi-0.dtd"
   xmlns:inkscape="http://www.inkscape.org/namespaces/inkscape"
   data-dec="38"
   id="dec_67"
   width="20"
   height="40"
   version="1.1"
   sodipodi:docname="38.svg"
   inkscape:version="0.92.2 5c3e80d, 2017-08-06">
  <metadata
     id="metadata9">
    <rdf:RDF>
      <cc:Work
         rdf:about="">
        <dc:format>image/svg+xml</dc:format>
        <dc:type
           rdf:resource="http://purl.org/dc/dcmitype/StillImage" />
        <dc:title />
      </cc:Work>
    </rdf:RDF>
  </metadata>
  <defs
     id="defs7" />
  <sodipodi:namedview
     pagecolor="#ffffff"
     bordercolor="#666666"
     borderopacity="1"
     objecttolerance="10"
     gridtolerance="10"
     guidetolerance="10"
     inkscape:pageopacity="0"
     inkscape:pageshadow="2"
     inkscape:window-width="1920"
     inkscape:window-height="1035"
     id="namedview5"
     showgrid="true"
     inkscape:zoom="28.602469"
     inkscape:cx="7.8423615"
     inkscape:cy="29.459354"
     inkscape:window-x="0"
     inkscape:window-y="0"
     inkscape:window-maximized="0"
     inkscape:current-layer="dec_67"
     showguides="false"
     inkscape:guide-bbox="true">
    <inkscape:grid
       type="xygrid"
       id="grid7" />
    <sodipodi:guide
       position="17,22"
       orientation="1,0"
       id="guide994"
       inkscape:locked="false" />
  </sodipodi:namedview>
  <path
     id="path1077"
     style="fill:none;fill-rule:evenodd;stroke:#000000;stroke-width:1px;stroke-linecap:round;stroke-linejoin:round;stroke-opacity:1"
     d="M 8,9 C 6,8 6.0517555,6.0464127 6,4 6.5952798,2.1979898 7.4016692,1.7991654 9,1 M 8,9 C 7.2381245,8.4224547 3.5617989,7.9960935 5,4 5.5952798,2.1979898 7.2008346,1.3995827 9,1 11.366613,1.2981271 12.594354,2 13,4 13.338013,5.0085151 12.9915,5.3285896 12,5 11.526251,1.3813544 10.231308,1.3288501 9,1 m 6.454506,5 C 15.802138,6.6567092 15.677772,7.3228345 15,8 13.734732,8.4300101 13.827023,7.7480501 14,7 14,6 14.366714,5.8271498 15.454506,6 16.626228,6 16.685403,6.3066438 17,7.5105318 16.848757,10.35269 12.350351,10.657322 10,12 c -2.5017984,1.199365 -3,2.466371 -3,5 -0.3804489,1.09685 -0.079471,1.777805 1,1 0.3335652,-2.566505 -1.2687337,-4.340709 2,-6 2.924089,-0.05965 5.117238,1.807642 5.074092,4.454569 C 15,21 12,22 10,22 5.8880658,21.61751 3.3002142,19.563342 3,15 2.8198353,12.043253 6.633579,9.4946383 8,9 m 0,0 c -3.0793723,0.048106 -5.858853,3.750049 -6,6 -0.1171098,5.605107 3.0786199,6.678369 8,7 3.259581,0.159328 5.996736,-1.033794 6,-5.370684 C 16.003264,12.292427 12.964303,12 10,12" />
</svg>
