<svg xmlns:dc="http://purl.org/dc/elements/1.1/" xmlns:cc="http://creativecommons.org/ns#" xmlns:rdf="http://www.w3.org/1999/02/22-rdf-syntax-ns#" xmlns:svg="http://www.w3.org/2000/svg" xmlns="http://www.w3.org/2000/svg" xmlns:sodipodi="http://sodipodi.sourceforge.net/DTD/sodipodi-0.dtd" xmlns:inkscape="http://www.inkscape.org/namespaces/inkscape" data-dec="1237" id="dec_101" width="25" height="40" version="1.1" sodipodi:docname="1237.svg" inkscape:version="0.92.3 (2405546, 2018-03-11)">
  <metadata id="metadata9">
    <rdf:RDF>
      <cc:Work rdf:about="">
        <dc:format>image/svg+xml</dc:format>
        <dc:type rdf:resource="http://purl.org/dc/dcmitype/StillImage"/>
        <dc:title/>
      </cc:Work>
    </rdf:RDF>
  </metadata>
  <defs id="defs7"/>
  <sodipodi:namedview pagecolor="#ffffff" bordercolor="#666666" borderopacity="1" objecttolerance="10" gridtolerance="10" guidetolerance="10" inkscape:pageopacity="0" inkscape:pageshadow="2" inkscape:window-width="1403" inkscape:window-height="872" id="namedview5" showgrid="true" showguides="true" inkscape:zoom="16.883853" inkscape:cx="4.6111986" inkscape:cy="26.847168" inkscape:window-x="37" inkscape:window-y="0" inkscape:window-maximized="1" inkscape:current-layer="dec_101">
    <inkscape:grid type="xygrid" id="grid819"/>
  </sodipodi:namedview>
  <path id="path2" style="fill:none;stroke:#000000;stroke-width:1;stroke-linecap:round;stroke-linejoin:round;stroke-opacity:0.98809521" d="m 7,8 -2,1 L 4,12 H 3 v -1 l 2,-2 2,-1 h 3 l 1,1 1,1 V 12 19 M 6,14 4,16 3,18 v 2 l 1,2 m 8,-3 -1,-2 V 10 l -1,-2 M 11,13 v 0 l -5,1 -3,2 -1,2 v 2 l 2,2 h 3 l 2,-1 2,-2 V 17 M 22,14 21,11 20,9 m 1,12 1,-1 m -6,2 h 1 l -2,-1 -2,-2 -1,-2 v -4 l 1,-3 1,-1 2,-1 h 2 l 2,1 2,2 1,3 H 12 m 4,-6 -2,1 -2,2 -1,2 v 4 l 1,2 2,2 2,1 h 3 l 2,-1     " inkscape:connector-curvature="0"/>
</svg>