<?xml version="1.0"?><!DOCTYPE svg PUBLIC "-//W3C//DTD SVG 1.1//EN" "http://www.w3.org/Graphics/SVG/1.1/DTD/svg11.dtd"><svg xmlns="http://www.w3.org/2000/svg" xmlns:xlink="http://www.w3.org/1999/xlink" width="350" height="1000" viewBox="0 0 10 26" >
            
                ['<path class="dot" d="M 7.519583333333333,0.1402708333333331 L 7.519583333333332,0.1402708333333331 C 7.229583333333332,-0.14972916666666694 6.780083333333333,-0.149729166666667 6.490083333333333,0.1402708333333331 L 6.113083333333333,0.5172708333333332 C 5.823083333333333,0.8072708333333332 5.823083333333333,1.2567708333333332 6.113083333333333,1.5467708333333332 L 6.504583333333333,1.938270833333333 C 6.794583333333333,2.228270833333333 7.244083333333332,2.228270833333333 7.534083333333332,1.938270833333333 L 7.911083333333333,1.5467708333333332 C 8.201083333333333,1.2567708333333332 8.201083333333333,0.8072708333333333 7.911083333333333,0.5172708333333331 L 7.519583333333333,0.14027083333333312" stroke-linejoin="round"/>', '<path class="dot" d="M 5.519583333333332,1.1402708333333331 L 5.519583333333332,1.1402708333333331 C 5.229583333333332,0.8502708333333331 4.780083333333332,0.850270833333333 4.490083333333332,1.1402708333333331 L 4.113083333333332,1.5172708333333333 C 3.823083333333332,1.8072708333333332 3.823083333333332,2.2567708333333334 4.113083333333332,2.5467708333333334 L 4.504583333333332,2.938270833333333 C 4.794583333333332,3.228270833333333 5.244083333333332,3.228270833333333 5.534083333333332,2.938270833333333 L 5.911083333333332,2.5467708333333334 C 6.201083333333333,2.2567708333333334 6.201083333333333,1.8072708333333334 5.911083333333332,1.5172708333333331 L 5.519583333333332,1.1402708333333331" stroke-linejoin="round"/>', '<path class="dot" d="M 4.519583333333332,4.140270833333333 L 4.519583333333332,4.140270833333333 C 4.229583333333332,3.8502708333333326 3.7800833333333324,3.8502708333333326 3.4900833333333323,4.140270833333333 L 3.113083333333332,4.517270833333333 C 2.823083333333332,4.807270833333333 2.823083333333332,5.2567708333333325 3.113083333333332,5.546770833333333 L 3.5045833333333323,5.938270833333332 C 3.794583333333332,6.228270833333333 4.244083333333332,6.228270833333333 4.534083333333332,5.938270833333332 L 4.911083333333332,5.546770833333333 C 5.201083333333333,5.2567708333333325 5.201083333333333,4.807270833333333 4.911083333333332,4.517270833333333 L 4.519583333333332,4.140270833333333" stroke-linejoin="round"/>', '<path class="dot" d="M 5.519583333333333,6.140270833333333 L 5.519583333333333,6.140270833333333 C 5.229583333333333,5.850270833333333 4.780083333333333,5.850270833333333 4.490083333333333,6.140270833333333 L 4.113083333333333,6.517270833333333 C 3.823083333333333,6.807270833333333 3.823083333333333,7.2567708333333325 4.113083333333333,7.546770833333333 L 4.504583333333333,7.938270833333332 C 4.794583333333333,8.228270833333333 5.244083333333333,8.228270833333333 5.534083333333333,7.938270833333332 L 5.911083333333334,7.546770833333333 C 6.201083333333333,7.2567708333333325 6.201083333333333,6.807270833333333 5.911083333333334,6.517270833333333 L 5.519583333333333,6.140270833333333" stroke-linejoin="round"/>', '<path class="dot" d="M 5.519583333333333,8.140270833333332 L 5.519583333333333,8.140270833333332 C 5.229583333333333,7.850270833333333 4.780083333333333,7.850270833333333 4.490083333333333,8.140270833333332 L 4.113083333333333,8.517270833333333 C 3.823083333333333,8.807270833333334 3.823083333333333,9.256770833333333 4.113083333333333,9.546770833333333 L 4.504583333333333,9.938270833333332 C 4.794583333333333,10.228270833333333 5.244083333333333,10.228270833333333 5.534083333333333,9.938270833333332 L 5.911083333333334,9.546770833333333 C 6.201083333333333,9.256770833333333 6.201083333333333,8.807270833333334 5.911083333333334,8.517270833333333 L 5.519583333333333,8.140270833333332" stroke-linejoin="round"/>', '<path class="dot" d="M 3.5195833333333333,9.140270833333332 L 3.5195833333333333,9.140270833333332 C 3.2295833333333333,8.850270833333333 2.7800833333333332,8.850270833333333 2.490083333333333,9.140270833333332 L 2.113083333333333,9.517270833333333 C 1.8230833333333332,9.807270833333334 1.8230833333333332,10.256770833333333 2.113083333333333,10.546770833333333 L 2.504583333333333,10.938270833333332 C 2.7945833333333328,11.228270833333333 3.244083333333333,11.228270833333333 3.5340833333333332,10.938270833333332 L 3.9110833333333335,10.546770833333333 C 4.201083333333333,10.256770833333333 4.201083333333333,9.807270833333334 3.9110833333333335,9.517270833333333 L 3.5195833333333333,9.140270833333332" stroke-linejoin="round"/>', '<path class="dot" d="M 5.519583333333333,10.140270833333332 L 5.519583333333333,10.140270833333332 C 5.229583333333333,9.850270833333333 4.780083333333333,9.850270833333333 4.490083333333333,10.140270833333332 L 4.113083333333333,10.517270833333333 C 3.823083333333333,10.807270833333334 3.823083333333333,11.256770833333333 4.113083333333333,11.546770833333333 L 4.504583333333333,11.938270833333332 C 4.794583333333333,12.228270833333333 5.244083333333333,12.228270833333333 5.534083333333333,11.938270833333332 L 5.911083333333334,11.546770833333333 C 6.201083333333333,11.256770833333333 6.201083333333333,10.807270833333334 5.911083333333334,10.517270833333333 L 5.519583333333333,10.140270833333332" stroke-linejoin="round"/>', '<path class="dot" d="M 5.519583333333333,12.140270833333332 L 5.519583333333333,12.140270833333332 C 5.229583333333333,11.850270833333333 4.780083333333333,11.850270833333333 4.490083333333333,12.140270833333332 L 4.113083333333333,12.517270833333333 C 3.823083333333333,12.807270833333334 3.823083333333333,13.256770833333333 4.113083333333333,13.546770833333333 L 4.504583333333333,13.938270833333332 C 4.794583333333333,14.228270833333333 5.244083333333333,14.228270833333333 5.534083333333333,13.938270833333332 L 5.911083333333334,13.546770833333333 C 6.201083333333333,13.256770833333333 6.201083333333333,12.807270833333334 5.911083333333334,12.517270833333333 L 5.519583333333333,12.140270833333332" stroke-linejoin="round"/>', '<path class="dot" d="M 4.519583333333334,14.140270833333332 L 4.519583333333334,14.140270833333332 C 4.229583333333334,13.850270833333333 3.780083333333334,13.850270833333333 3.490083333333334,14.140270833333332 L 3.113083333333334,14.517270833333333 C 2.823083333333334,14.807270833333334 2.823083333333334,15.256770833333333 3.113083333333334,15.546770833333333 L 3.504583333333334,15.938270833333332 C 3.7945833333333336,16.228270833333333 4.244083333333334,16.228270833333333 4.534083333333334,15.938270833333332 L 4.911083333333334,15.546770833333333 C 5.201083333333335,15.256770833333333 5.201083333333335,14.807270833333334 4.911083333333334,14.517270833333333 L 4.519583333333334,14.140270833333332" stroke-linejoin="round"/>', '<path class="dot" d="M 5.519583333333334,17.140270833333336 L 5.519583333333334,17.140270833333336 C 5.229583333333334,16.850270833333333 4.780083333333334,16.850270833333333 4.490083333333334,17.140270833333336 L 4.113083333333334,17.517270833333335 C 3.823083333333334,17.807270833333334 3.823083333333334,18.256770833333334 4.113083333333334,18.546770833333333 L 4.504583333333334,18.938270833333334 C 4.794583333333334,19.228270833333333 5.244083333333334,19.228270833333333 5.534083333333334,18.938270833333334 L 5.911083333333334,18.546770833333333 C 6.201083333333335,18.256770833333334 6.201083333333335,17.807270833333334 5.911083333333334,17.517270833333335 L 5.519583333333334,17.140270833333336" stroke-linejoin="round"/>', '<path class="dot" d="M 7.519583333333335,18.140270833333336 L 7.519583333333334,18.140270833333336 C 7.229583333333334,17.850270833333333 6.780083333333335,17.850270833333333 6.4900833333333345,18.140270833333336 L 6.113083333333335,18.517270833333335 C 5.823083333333335,18.807270833333334 5.823083333333335,19.256770833333334 6.113083333333335,19.546770833333333 L 6.5045833333333345,19.938270833333334 C 6.7945833333333345,20.228270833333333 7.244083333333334,20.228270833333333 7.534083333333334,19.938270833333334 L 7.911083333333335,19.546770833333333 C 8.201083333333335,19.256770833333334 8.201083333333335,18.807270833333334 7.911083333333335,18.517270833333335 L 7.519583333333335,18.140270833333336" stroke-linejoin="round"/>']
            
            
            <path d="M 6.999999999999999,1.0 L 4.999999999999999,2.0 L 3.999999999999999,5.0 L 5.0,7.0 L 5.0,9.0 L 3.0,10.0 L 5.0,11.0 L 5.0,13.0 L 4.000000000000001,15.0 L 5.000000000000001,18.0 L 7.000000000000001,19.0" fill="none"
            stroke="black"
            stroke-width="1.5"
            stroke-linecap="round"
            stroke-linejoin="round"
            />
            
            
        </svg>