<?xml version="1.0" encoding="UTF-8" standalone="no"?>
<svg
   width="6"
   height="10.000001"
   viewBox="0 0 6 10.000001"
   version="1.1"
   id="svg25"
   xml:space="preserve"
   sodipodi:docname="w.svg"
   inkscape:version="1.3.2 (091e20ef0f, 2023-11-25, custom)"
   xmlns:inkscape="http://www.inkscape.org/namespaces/inkscape"
   xmlns:sodipodi="http://sodipodi.sourceforge.net/DTD/sodipodi-0.dtd"
   xmlns="http://www.w3.org/2000/svg"
   xmlns:svg="http://www.w3.org/2000/svg"><sodipodi:namedview
   id="namedview1"
   pagecolor="#ffffff"
   bordercolor="#666666"
   borderopacity="1.0"
   inkscape:showpageshadow="2"
   inkscape:pageopacity="0.0"
   inkscape:pagecheckerboard="0"
   inkscape:deskcolor="#d1d1d1"
   inkscape:zoom="90.509668"
   inkscape:cx="6.7396115"
   inkscape:cy="4.2094951"
   inkscape:window-width="2560"
   inkscape:window-height="1371"
   inkscape:window-x="0"
   inkscape:window-y="0"
   inkscape:window-maximized="1"
   inkscape:current-layer="svg25" /><defs
   id="defs25" />
            
                ['', '']
            
                ['', '', '', '', '', '', '', '', '', '']
            
                ['', '', '', '', '', '', '', '', '', '']
            
            
            <path
   d="M 3.0000001,0 1,10.000001 0,0 M 6,0 4.9999999,10.000001 2.9999999,0"
   style="fill:none;stroke:none;stroke-width:0.0792825;stroke-linecap:round;stroke-linejoin:round"
   id="path13223" /></svg>
