<?xml version="1.0" encoding="UTF-8" standalone="no"?>
<svg
   width="6"
   height="10.000001"
   viewBox="0 0 6 10.000001"
   version="1.1"
   id="svg25"
   sodipodi:docname="pont.svg"
   inkscape:version="1.3.2 (091e20ef0f, 2023-11-25, custom)"
   xmlns:inkscape="http://www.inkscape.org/namespaces/inkscape"
   xmlns:sodipodi="http://sodipodi.sourceforge.net/DTD/sodipodi-0.dtd"
   xmlns="http://www.w3.org/2000/svg"
   xmlns:svg="http://www.w3.org/2000/svg"><sodipodi:namedview
   id="namedview1"
   pagecolor="#ffffff"
   bordercolor="#666666"
   borderopacity="1.0"
   inkscape:showpageshadow="2"
   inkscape:pageopacity="0.0"
   inkscape:pagecheckerboard="0"
   inkscape:deskcolor="#d1d1d1"
   showgrid="true"
   inkscape:zoom="60.699994"
   inkscape:cx="1.8286657"
   inkscape:cy="5.7990121"
   inkscape:window-width="2560"
   inkscape:window-height="1403"
   inkscape:window-x="0"
   inkscape:window-y="0"
   inkscape:window-maximized="1"
   inkscape:current-layer="svg25">
  <inkscape:grid
     id="grid1"
     units="px"
     originx="0"
     originy="0"
     spacingx="1"
     spacingy="1"
     empcolor="#0099e5"
     empopacity="0.30196078"
     color="#0099e5"
     opacity="0.14901961"
     empspacing="5"
     dotted="false"
     gridanglex="30"
     gridanglez="30"
     visible="true" />
</sodipodi:namedview>
<defs
   id="defs25" />


            
                ['', '']
            
                ['', '', '', '', '', '', '', '', '', '']
            
                ['', '', '', '', '', '', '', '', '', '']
            
            
            <path
   d="M 0,3.0000001 0.99999996,0.99999996 1.9999999,2.4999999e-7 3.9999998,0 l 1,0.99999996 1,1.99999994 L 6,10"
   fill="none"
   stroke="#000000"
   stroke-width="85.3912"
   stroke-linecap="round"
   stroke-linejoin="round"
   id="path11"
   style="stroke:none;stroke-width:1" />
</svg>
