<?xml version="1.0"?><!DOCTYPE svg PUBLIC "-//W3C//DTD SVG 1.1//EN" "http://www.w3.org/Graphics/SVG/1.1/DTD/svg11.dtd"><svg xmlns="http://www.w3.org/2000/svg" xmlns:xlink="http://www.w3.org/1999/xlink" width="350" height="1000" viewBox="0 0 14 40" >
            
                ['<path class="dot" d="M 3.7909438775510207,6.777203877551018 L 3.79094387755102,6.777203877551018 C 3.3409438775510196,6.3272038775510175 2.64344387755102,6.3272038775510175 2.19344387755102,6.777203877551018 L 1.60844387755102,7.362203877551018 C 1.15844387755102,7.812203877551018 1.15844387755102,8.509703877551019 1.60844387755102,8.959703877551018 L 2.2159438775510196,9.567203877551018 C 2.66594387755102,10.017203877551017 3.3634438775510196,10.017203877551017 3.8134438775510198,9.567203877551018 L 4.398443877551021,8.959703877551018 C 4.84844387755102,8.509703877551019 4.84844387755102,7.812203877551018 4.398443877551021,7.362203877551018 L 3.7909438775510207,6.777203877551018" stroke-linejoin="round"/>', '<path class="dot" d="M 11.790943877551019,6.777203877551018 L 11.790943877551019,6.777203877551018 C 11.34094387755102,6.3272038775510175 10.64344387755102,6.3272038775510175 10.193443877551019,6.777203877551018 L 9.60844387755102,7.362203877551018 C 9.158443877551019,7.812203877551018 9.158443877551019,8.509703877551019 9.60844387755102,8.959703877551018 L 10.21594387755102,9.567203877551018 C 10.665943877551019,10.017203877551017 11.363443877551019,10.017203877551017 11.81344387755102,9.567203877551018 L 12.39844387755102,8.959703877551018 C 12.84844387755102,8.509703877551019 12.84844387755102,7.812203877551018 12.39844387755102,7.362203877551018 L 11.790943877551019,6.777203877551018" stroke-linejoin="round"/>']
            
                ['<path class="dot" d="M 11.790943877551019,6.777193877551018 L 11.790943877551019,6.777193877551018 C 11.34094387755102,6.327193877551018 10.64344387755102,6.327193877551018 10.193443877551019,6.777193877551018 L 9.60844387755102,7.362193877551018 C 9.158443877551019,7.812193877551018 9.158443877551019,8.509693877551019 9.60844387755102,8.959693877551018 L 10.21594387755102,9.567193877551018 C 10.665943877551019,10.017193877551017 11.363443877551019,10.017193877551017 11.81344387755102,9.567193877551018 L 12.39844387755102,8.959693877551018 C 12.84844387755102,8.509693877551019 12.84844387755102,7.812193877551018 12.39844387755102,7.362193877551018 L 11.790943877551019,6.777193877551018" stroke-linejoin="round"/>', '<path class="dot" d="M 3.7909438775510207,20.777193877551017 L 3.79094387755102,20.777193877551017 C 3.3409438775510196,20.327193877551018 2.64344387755102,20.327193877551018 2.19344387755102,20.777193877551017 L 1.60844387755102,21.362193877551018 C 1.15844387755102,21.812193877551017 1.15844387755102,22.50969387755102 1.60844387755102,22.959693877551018 L 2.2159438775510196,23.56719387755102 C 2.66594387755102,24.01719387755102 3.3634438775510196,24.01719387755102 3.8134438775510198,23.56719387755102 L 4.398443877551021,22.959693877551018 C 4.84844387755102,22.50969387755102 4.84844387755102,21.812193877551017 4.398443877551021,21.362193877551018 L 3.7909438775510207,20.777193877551017" stroke-linejoin="round"/>']
            
                ['<path class="dot" d="M 3.7909438775510207,20.777203877551017 L 3.79094387755102,20.777203877551017 C 3.3409438775510196,20.327203877551018 2.64344387755102,20.327203877551018 2.19344387755102,20.777203877551017 L 1.60844387755102,21.362203877551018 C 1.15844387755102,21.812203877551017 1.15844387755102,22.50970387755102 1.60844387755102,22.959703877551018 L 2.2159438775510196,23.56720387755102 C 2.66594387755102,24.01720387755102 3.3634438775510196,24.01720387755102 3.8134438775510198,23.56720387755102 L 4.398443877551021,22.959703877551018 C 4.84844387755102,22.50970387755102 4.84844387755102,21.812203877551017 4.398443877551021,21.362203877551018 L 3.7909438775510207,20.777203877551017" stroke-linejoin="round"/>', '<path class="dot" d="M 11.790943877551019,20.777203877551017 L 11.790943877551019,20.777203877551017 C 11.34094387755102,20.327203877551018 10.64344387755102,20.327203877551018 10.193443877551019,20.777203877551017 L 9.60844387755102,21.362203877551018 C 9.158443877551019,21.812203877551017 9.158443877551019,22.50970387755102 9.60844387755102,22.959703877551018 L 10.21594387755102,23.56720387755102 C 10.665943877551019,24.01720387755102 11.363443877551019,24.01720387755102 11.81344387755102,23.56720387755102 L 12.39844387755102,22.959703877551018 C 12.84844387755102,22.50970387755102 12.84844387755102,21.812203877551017 12.39844387755102,21.362203877551018 L 11.790943877551019,20.777203877551017" stroke-linejoin="round"/>']
            
            
            <path d="M 3.0,8.00001 L 11.0,8.00001" fill="none"
            stroke="black"
            stroke-width="2.5"
            stroke-linecap="round"
            stroke-linejoin="round"
            />
            
            <path d="M 11.0,8.0 L 3.0,22.0" fill="none"
            stroke="black"
            stroke-width="2.5"
            stroke-linecap="round"
            stroke-linejoin="round"
            />
            
            <path d="M 3.0,22.00001 L 11.0,22.00001" fill="none"
            stroke="black"
            stroke-width="2.5"
            stroke-linecap="round"
            stroke-linejoin="round"
            />
            
            
        </svg>