<?xml version="1.0"?><!DOCTYPE svg PUBLIC "-//W3C//DTD SVG 1.1//EN" "http://www.w3.org/Graphics/SVG/1.1/DTD/svg11.dtd"><svg xmlns="http://www.w3.org/2000/svg" xmlns:xlink="http://www.w3.org/1999/xlink" width="350" height="1000" viewBox="0 0 14 40" >
            
                ['<path class="dot" d="M 2.7909438775510207,8.777193877551019 L 2.79094387755102,8.777193877551019 C 2.3409438775510196,8.327193877551018 1.6434438775510198,8.327193877551018 1.19344387755102,8.777193877551019 L 0.6084438775510199,9.362193877551018 C 0.15844387755101996,9.81219387755102 0.15844387755101985,10.509693877551019 0.6084438775510199,10.959693877551018 L 1.2159438775510198,11.567193877551018 C 1.6659438775510198,12.01719387755102 2.3634438775510196,12.01719387755102 2.8134438775510198,11.567193877551018 L 3.3984438775510206,10.959693877551018 C 3.84844387755102,10.509693877551019 3.84844387755102,9.81219387755102 3.3984438775510206,9.362193877551018 L 2.7909438775510207,8.777193877551019" stroke-linejoin="round"/>', '<path class="dot" d="M 12.790943877551019,8.777193877551019 L 12.790943877551019,8.777193877551019 C 12.34094387755102,8.327193877551018 11.64344387755102,8.327193877551018 11.193443877551019,8.777193877551019 L 10.60844387755102,9.362193877551018 C 10.158443877551019,9.81219387755102 10.158443877551019,10.509693877551019 10.60844387755102,10.959693877551018 L 11.21594387755102,11.567193877551018 C 11.665943877551019,12.01719387755102 12.363443877551019,12.01719387755102 12.81344387755102,11.567193877551018 L 13.39844387755102,10.959693877551018 C 13.84844387755102,10.509693877551019 13.84844387755102,9.81219387755102 13.39844387755102,9.362193877551018 L 12.790943877551019,8.777193877551019" stroke-linejoin="round"/>']
            
                ['<path class="dot" d="M 2.7909438775510207,14.777193877551019 L 2.79094387755102,14.777193877551019 C 2.3409438775510196,14.327193877551018 1.6434438775510198,14.327193877551018 1.19344387755102,14.777193877551019 L 0.6084438775510199,15.362193877551018 C 0.15844387755101996,15.81219387755102 0.15844387755101985,16.50969387755102 0.6084438775510199,16.959693877551018 L 1.2159438775510198,17.56719387755102 C 1.6659438775510198,18.01719387755102 2.3634438775510196,18.01719387755102 2.8134438775510198,17.56719387755102 L 3.3984438775510206,16.959693877551018 C 3.84844387755102,16.50969387755102 3.84844387755102,15.81219387755102 3.3984438775510206,15.362193877551018 L 2.7909438775510207,14.777193877551019" stroke-linejoin="round"/>', '<path class="dot" d="M 12.790943877551019,14.777193877551019 L 12.790943877551019,14.777193877551019 C 12.34094387755102,14.327193877551018 11.64344387755102,14.327193877551018 11.193443877551019,14.777193877551019 L 10.60844387755102,15.362193877551018 C 10.158443877551019,15.81219387755102 10.158443877551019,16.50969387755102 10.60844387755102,16.959693877551018 L 11.21594387755102,17.56719387755102 C 11.665943877551019,18.01719387755102 12.363443877551019,18.01719387755102 12.81344387755102,17.56719387755102 L 13.39844387755102,16.959693877551018 C 13.84844387755102,16.50969387755102 13.84844387755102,15.81219387755102 13.39844387755102,15.362193877551018 L 12.790943877551019,14.777193877551019" stroke-linejoin="round"/>']
            
            
            <path d="M 2.0,10.0 L 12.0,10.0" fill="none"
            stroke="black"
            stroke-width="2.5"
            stroke-linecap="round"
            stroke-linejoin="round"
            />
            
            <path d="M 2.0,16.0 L 12.0,16.0" fill="none"
            stroke="black"
            stroke-width="2.5"
            stroke-linecap="round"
            stroke-linejoin="round"
            />
            
            
        </svg>