<?xml version="1.0"?><!DOCTYPE svg PUBLIC "-//W3C//DTD SVG 1.1//EN" "http://www.w3.org/Graphics/SVG/1.1/DTD/svg11.dtd"><svg xmlns="http://www.w3.org/2000/svg" xmlns:xlink="http://www.w3.org/1999/xlink" width="350" height="1000" viewBox="0 0 14 40" >
            
                ['<path class="dot" d="M 7.790943877551021,0.7835938775510172 L 7.79094387755102,0.7835938775510172 C 7.34094387755102,0.3335938775510172 6.64344387755102,0.3335938775510171 6.1934438775510205,0.7835938775510172 L 5.608443877551021,1.3685938775510176 C 5.15844387755102,1.8185938775510175 5.15844387755102,2.5160938775510173 5.608443877551021,2.9660938775510175 L 6.21594387755102,3.5735938775510174 C 6.66594387755102,4.023593877551017 7.3634438775510205,4.023593877551017 7.81344387755102,3.5735938775510174 L 8.39844387755102,2.9660938775510175 C 8.84844387755102,2.5160938775510173 8.84844387755102,1.8185938775510175 8.39844387755102,1.3685938775510174 L 7.790943877551021,0.7835938775510174" stroke-linejoin="round"/>', '<path class="dot" d="M 5.790943877551021,1.7835938775510172 L 5.79094387755102,1.7835938775510172 C 5.34094387755102,1.3335938775510172 4.64344387755102,1.3335938775510172 4.1934438775510205,1.7835938775510172 L 3.60844387755102,2.3685938775510174 C 3.1584438775510204,2.8185938775510175 3.15844387755102,3.5160938775510173 3.60844387755102,3.9660938775510175 L 4.21594387755102,4.573593877551017 C 4.66594387755102,5.023593877551017 5.3634438775510205,5.023593877551017 5.81344387755102,4.573593877551017 L 6.398443877551021,3.9660938775510175 C 6.84844387755102,3.5160938775510173 6.84844387755102,2.8185938775510175 6.398443877551021,2.3685938775510174 L 5.790943877551021,1.7835938775510174" stroke-linejoin="round"/>', '<path class="dot" d="M 3.7909438775510207,0.7835938775510172 L 3.79094387755102,0.7835938775510172 C 3.3409438775510196,0.3335938775510172 2.64344387755102,0.3335938775510171 2.19344387755102,0.7835938775510172 L 1.60844387755102,1.3685938775510176 C 1.15844387755102,1.8185938775510175 1.15844387755102,2.5160938775510173 1.60844387755102,2.9660938775510175 L 2.2159438775510196,3.5735938775510174 C 2.66594387755102,4.023593877551017 3.3634438775510196,4.023593877551017 3.8134438775510198,3.5735938775510174 L 4.398443877551021,2.9660938775510175 C 4.84844387755102,2.5160938775510173 4.84844387755102,1.8185938775510175 4.398443877551021,1.3685938775510174 L 3.7909438775510207,0.7835938775510174" stroke-linejoin="round"/>', '<path class="dot" d="M 5.790943877551021,-0.21640612244898277 L 5.79094387755102,-0.21640612244898277 C 5.34094387755102,-0.6664061224489828 4.64344387755102,-0.6664061224489829 4.1934438775510205,-0.21640612244898277 L 3.60844387755102,0.3685938775510176 C 3.1584438775510204,0.8185938775510175 3.15844387755102,1.5160938775510175 3.60844387755102,1.9660938775510177 L 4.21594387755102,2.5735938775510174 C 4.66594387755102,3.0235938775510167 5.3634438775510205,3.0235938775510167 5.81344387755102,2.5735938775510174 L 6.398443877551021,1.9660938775510177 C 6.84844387755102,1.5160938775510175 6.84844387755102,0.8185938775510175 6.398443877551021,0.36859387755101736 L 5.790943877551021,-0.2164061224489826" stroke-linejoin="round"/>', '<path class="dot" d="M 7.790943877551021,0.7835938775510172 L 7.79094387755102,0.7835938775510172 C 7.34094387755102,0.3335938775510172 6.64344387755102,0.3335938775510171 6.1934438775510205,0.7835938775510172 L 5.608443877551021,1.3685938775510176 C 5.15844387755102,1.8185938775510175 5.15844387755102,2.5160938775510173 5.608443877551021,2.9660938775510175 L 6.21594387755102,3.5735938775510174 C 6.66594387755102,4.023593877551017 7.3634438775510205,4.023593877551017 7.81344387755102,3.5735938775510174 L 8.39844387755102,2.9660938775510175 C 8.84844387755102,2.5160938775510173 8.84844387755102,1.8185938775510175 8.39844387755102,1.3685938775510174 L 7.790943877551021,0.7835938775510174" stroke-linejoin="round"/>', '<path class="dot" d="M 7.790943877551021,4.777193877551017 L 7.79094387755102,4.777193877551017 C 7.34094387755102,4.327193877551017 6.64344387755102,4.327193877551017 6.1934438775510205,4.777193877551017 L 5.608443877551021,5.362193877551017 C 5.15844387755102,5.812193877551017 5.15844387755102,6.509693877551017 5.608443877551021,6.959693877551017 L 6.21594387755102,7.567193877551016 C 6.66594387755102,8.017193877551016 7.3634438775510205,8.017193877551016 7.81344387755102,7.567193877551016 L 8.39844387755102,6.959693877551017 C 8.84844387755102,6.509693877551017 8.84844387755102,5.812193877551017 8.39844387755102,5.362193877551017 L 7.790943877551021,4.777193877551017" stroke-linejoin="round"/>', '<path class="dot" d="M 3.7909438775510207,6.777193877551017 L 3.79094387755102,6.777193877551017 C 3.3409438775510196,6.327193877551017 2.64344387755102,6.327193877551017 2.19344387755102,6.777193877551017 L 1.60844387755102,7.362193877551017 C 1.15844387755102,7.812193877551017 1.15844387755102,8.509693877551017 1.60844387755102,8.959693877551018 L 2.2159438775510196,9.567193877551016 C 2.66594387755102,10.017193877551016 3.3634438775510196,10.017193877551016 3.8134438775510198,9.567193877551016 L 4.398443877551021,8.959693877551018 C 4.84844387755102,8.509693877551017 4.84844387755102,7.812193877551017 4.398443877551021,7.362193877551017 L 3.7909438775510207,6.777193877551017" stroke-linejoin="round"/>']
            
            
            <path d="M 7.0,2.0063999999999993 L 5.0,3.0063999999999993 L 3.0,2.0063999999999993 L 5.0,1.0063999999999993 L 7.0,2.0063999999999993 L 7.0,5.999999999999999 L 3.0,7.999999999999999" fill="none"
            stroke="black"
            stroke-width="2.5"
            stroke-linecap="round"
            stroke-linejoin="round"
            />
            
            
        </svg>