<?xml version="1.0"?><!DOCTYPE svg PUBLIC "-//W3C//DTD SVG 1.1//EN" "http://www.w3.org/Graphics/SVG/1.1/DTD/svg11.dtd"><svg xmlns="http://www.w3.org/2000/svg" xmlns:xlink="http://www.w3.org/1999/xlink" width="350" height="1000" viewBox="0 0 14 40" >
            
                ['<path class="dot" d="M 7.7909437775510195,-0.22280612244898207 L 7.790943777551019,-0.22280612244898207 C 7.3409437775510185,-0.6728061224489821 6.643443777551019,-0.6728061224489822 6.193443777551019,-0.22280612244898207 L 5.608443777551019,0.3621938775510183 C 5.158443777551019,0.8121938775510182 5.158443777551019,1.5096938775510182 5.608443777551019,1.9596938775510184 L 6.2159437775510185,2.567193877551018 C 6.665943777551019,3.0171938775510174 7.363443777551019,3.0171938775510174 7.813443777551019,2.567193877551018 L 8.39844377755102,1.9596938775510184 C 8.848443777551019,1.5096938775510182 8.848443777551019,0.8121938775510182 8.39844377755102,0.36219387755101806 L 7.7909437775510195,-0.2228061224489819" stroke-linejoin="round"/>', '<path class="dot" d="M 7.7909437775510195,-0.22280612244898207 L 7.790943777551019,-0.22280612244898207 C 7.3409437775510185,-0.6728061224489821 6.643443777551019,-0.6728061224489822 6.193443777551019,-0.22280612244898207 L 5.608443777551019,0.3621938775510183 C 5.158443777551019,0.8121938775510182 5.158443777551019,1.5096938775510182 5.608443777551019,1.9596938775510184 L 6.2159437775510185,2.567193877551018 C 6.665943777551019,3.0171938775510174 7.363443777551019,3.0171938775510174 7.813443777551019,2.567193877551018 L 8.39844377755102,1.9596938775510184 C 8.848443777551019,1.5096938775510182 8.848443777551019,0.8121938775510182 8.39844377755102,0.36219387755101806 L 7.7909437775510195,-0.2228061224489819" stroke-linejoin="round"/>', '<path class="dot" d="M 13.790943877551019,20.777193877551017 L 13.790943877551019,20.777193877551017 C 13.34094387755102,20.327193877551018 12.64344387755102,20.327193877551018 12.193443877551019,20.777193877551017 L 11.60844387755102,21.362193877551018 C 11.158443877551019,21.812193877551017 11.158443877551019,22.50969387755102 11.60844387755102,22.959693877551018 L 12.21594387755102,23.56719387755102 C 12.665943877551019,24.01719387755102 13.363443877551019,24.01719387755102 13.81344387755102,23.56719387755102 L 14.39844387755102,22.959693877551018 C 14.84844387755102,22.50969387755102 14.84844387755102,21.812193877551017 14.39844387755102,21.362193877551018 L 13.790943877551019,20.777193877551017" stroke-linejoin="round"/>']
            
                ['<path class="dot" d="M 3.7909438775510207,12.777193877551019 L 3.79094387755102,12.777193877551019 C 3.3409438775510196,12.327193877551018 2.64344387755102,12.327193877551018 2.19344387755102,12.777193877551019 L 1.60844387755102,13.362193877551018 C 1.15844387755102,13.81219387755102 1.15844387755102,14.509693877551019 1.60844387755102,14.959693877551018 L 2.2159438775510196,15.567193877551018 C 2.66594387755102,16.01719387755102 3.3634438775510196,16.01719387755102 3.8134438775510198,15.567193877551018 L 4.398443877551021,14.959693877551018 C 4.84844387755102,14.509693877551019 4.84844387755102,13.81219387755102 4.398443877551021,13.362193877551018 L 3.7909438775510207,12.777193877551019" stroke-linejoin="round"/>', '<path class="dot" d="M 11.790943577551019,12.777193877551019 L 11.790943577551019,12.777193877551019 C 11.34094357755102,12.327193877551018 10.64344357755102,12.327193877551018 10.193443577551019,12.777193877551019 L 9.60844357755102,13.362193877551018 C 9.158443577551019,13.81219387755102 9.158443577551019,14.509693877551019 9.60844357755102,14.959693877551018 L 10.21594357755102,15.567193877551018 C 10.665943577551019,16.01719387755102 11.363443577551019,16.01719387755102 11.81344357755102,15.567193877551018 L 12.39844357755102,14.959693877551018 C 12.84844357755102,14.509693877551019 12.84844357755102,13.81219387755102 12.39844357755102,13.362193877551018 L 11.790943577551019,12.777193877551019" stroke-linejoin="round"/>']
            
                ['<path class="dot" d="M 3.7474655408214383,-9.15185592530326 L 3.7474655408214375,-9.15185592530326 C 3.2974655408214373,-9.60185592530326 2.5999655408214375,-9.60185592530326 2.1499655408214378,-9.15185592530326 L 1.5649655408214376,-8.566855925303258 C 1.1149655408214376,-8.116855925303259 1.1149655408214376,-7.419355925303259 1.5649655408214376,-6.969355925303259 L 2.1724655408214373,-6.36185592530326 C 2.6224655408214375,-5.91185592530326 3.3199655408214372,-5.91185592530326 3.7699655408214374,-6.36185592530326 L 4.354965540821438,-6.969355925303259 C 4.804965540821438,-7.419355925303259 4.804965540821438,-8.116855925303259 4.354965540821438,-8.56685592530326 L 3.7474655408214383,-9.15185592530326" stroke-linejoin="round"/>', '<path class="dot" d="M 11.8344221142806,-4.293756319594705 L 11.8344221142806,-4.293756319594705 C 11.3844221142806,-4.743756319594705 10.6869221142806,-4.743756319594705 10.236922114280599,-4.293756319594705 L 9.6519221142806,-3.7087563195947046 C 9.201922114280599,-3.2587563195947045 9.201922114280599,-2.5612563195947047 9.6519221142806,-2.1112563195947045 L 10.2594221142806,-1.503756319594705 C 10.7094221142806,-1.0537563195947053 11.406922114280599,-1.0537563195947053 11.8569221142806,-1.503756319594705 L 12.441922114280601,-2.1112563195947045 C 12.8919221142806,-2.5612563195947047 12.8919221142806,-3.2587563195947045 12.441922114280601,-3.7087563195947046 L 11.8344221142806,-4.293756319594705" stroke-linejoin="round"/>']
            
            
            <path d="M 6.999999899999999,1.0 L 1.0000000000000009,22.0 M 6.999999899999999,1.0 L 13.0,22.0" fill="none"
            stroke="black"
            stroke-width="2.5"
            stroke-linecap="round"
            stroke-linejoin="round"
            />
            
            <path d="M 3.0,14.0 L 10.9999997,14.0" fill="none"
            stroke="black"
            stroke-width="2.5"
            stroke-linecap="round"
            stroke-linejoin="round"
            />
            
            <path d="M 2.9565216632704177,-7.929049802854277 L 11.04347823672958,-3.0709501971457227" fill="none"
            stroke="black"
            stroke-width="2.5"
            stroke-linecap="round"
            stroke-linejoin="round"
            />
            
            
        </svg>