<?xml version="1.0"?><!DOCTYPE svg PUBLIC "-//W3C//DTD SVG 1.1//EN" "http://www.w3.org/Graphics/SVG/1.1/DTD/svg11.dtd"><svg xmlns="http://www.w3.org/2000/svg" xmlns:xlink="http://www.w3.org/1999/xlink" width="350" height="1000" viewBox="0 0 7 17" >
            
                ['<path class="dot" d="M 2.385,3.318 L 2.385,3.318 C 2.165,3.098 1.8239999999999998,3.098 1.6039999999999999,3.318 L 1.3179999999999998,3.604 C 1.0979999999999999,3.8240000000000003 1.0979999999999996,4.165 1.3179999999999998,4.385 L 1.6149999999999998,4.682 C 1.8349999999999997,4.902 2.176,4.902 2.396,4.682 L 2.6820000000000004,4.385 C 2.902,4.165 2.902,3.8240000000000003 2.6820000000000004,3.604 L 2.385,3.318" stroke-linejoin="round"/>', '<path class="dot" d="M 6.385,3.318 L 6.385,3.318 C 6.164999999999999,3.098 5.824,3.098 5.603999999999999,3.318 L 5.318,3.604 C 5.098,3.8240000000000003 5.098,4.165 5.318,4.385 L 5.614999999999999,4.682 C 5.834999999999999,4.902 6.176,4.902 6.395999999999999,4.682 L 6.682,4.385 C 6.902,4.165 6.902,3.8240000000000003 6.682,3.604 L 6.385,3.318" stroke-linejoin="round"/>']
            
                ['<path class="dot" d="M 2.4149905973627153,10.334967863589414 L 2.4149905973627153,10.334967863589414 C 2.1949905973627155,10.114967863589415 1.8539905973627153,10.114967863589415 1.6339905973627153,10.334967863589414 L 1.3479905973627153,10.620967863589415 C 1.1279905973627153,10.840967863589414 1.1279905973627151,11.181967863589415 1.3479905973627153,11.401967863589416 L 1.6449905973627152,11.698967863589415 C 1.8649905973627152,11.918967863589415 2.2059905973627156,11.918967863589415 2.4259905973627154,11.698967863589415 L 2.711990597362716,11.401967863589416 C 2.9319905973627156,11.181967863589415 2.9319905973627156,10.840967863589414 2.711990597362716,10.620967863589415 L 2.4149905973627153,10.334967863589416" stroke-linejoin="round"/>', '<path class="dot" d="M 6.355009402637284,3.3010321364105857 L 6.355009402637284,3.3010321364105857 C 6.135009402637284,3.0810321364105855 5.794009402637284,3.0810321364105855 5.574009402637284,3.3010321364105857 L 5.288009402637284,3.5870321364105857 C 5.068009402637284,3.807032136410586 5.068009402637284,4.148032136410586 5.288009402637284,4.368032136410585 L 5.585009402637284,4.665032136410586 C 5.805009402637284,4.885032136410586 6.146009402637285,4.885032136410586 6.3660094026372835,4.665032136410586 L 6.652009402637285,4.368032136410585 C 6.872009402637285,4.148032136410586 6.872009402637285,3.807032136410586 6.652009402637285,3.5870321364105857 L 6.355009402637284,3.3010321364105857" stroke-linejoin="round"/>']
            
                ['<path class="dot" d="M 2.385,10.318 L 2.385,10.318 C 2.165,10.098 1.8239999999999998,10.098 1.6039999999999999,10.318 L 1.3179999999999998,10.604000000000001 C 1.0979999999999999,10.824 1.0979999999999996,11.165000000000001 1.3179999999999998,11.385000000000002 L 1.6149999999999998,11.682 C 1.8349999999999997,11.902000000000001 2.176,11.902000000000001 2.396,11.682 L 2.6820000000000004,11.385000000000002 C 2.902,11.165000000000001 2.902,10.824 2.6820000000000004,10.604000000000001 L 2.385,10.318000000000001" stroke-linejoin="round"/>', '<path class="dot" d="M 6.385,10.318 L 6.385,10.318 C 6.164999999999999,10.098 5.824,10.098 5.603999999999999,10.318 L 5.318,10.604000000000001 C 5.098,10.824 5.098,11.165000000000001 5.318,11.385000000000002 L 5.614999999999999,11.682 C 5.834999999999999,11.902000000000001 6.176,11.902000000000001 6.395999999999999,11.682 L 6.682,11.385000000000002 C 6.902,11.165000000000001 6.902,10.824 6.682,10.604000000000001 L 6.385,10.318000000000001" stroke-linejoin="round"/>']
            
            
            <path d="M 2.0,4.0 L 6.0,4.0" fill="none"
            stroke="black"
            stroke-width="1"
            stroke-linecap="round"
            stroke-linejoin="round"
            />
            
            <path d="M 2.0299905973627155,11.016967863589414 L 5.9700094026372845,3.9830321364105856" fill="none"
            stroke="black"
            stroke-width="1"
            stroke-linecap="round"
            stroke-linejoin="round"
            />
            
            <path d="M 2.0,11.0 L 6.0,11.0" fill="none"
            stroke="black"
            stroke-width="1"
            stroke-linecap="round"
            stroke-linejoin="round"
            />
            
            
        </svg>