<?xml version="1.0" encoding="UTF-8" standalone="no"?>
<svg
   xmlns:dc="http://purl.org/dc/elements/1.1/"
   xmlns:cc="http://creativecommons.org/ns#"
   xmlns:rdf="http://www.w3.org/1999/02/22-rdf-syntax-ns#"
   xmlns:svg="http://www.w3.org/2000/svg"
   xmlns="http://www.w3.org/2000/svg"
   xmlns:sodipodi="http://sodipodi.sourceforge.net/DTD/sodipodi-0.dtd"
   xmlns:inkscape="http://www.inkscape.org/namespaces/inkscape"
   data-dec="97"
   width="9.9999997e-06"
   height="21"
   version="1.1"
   id="svg1135"
   sodipodi:docname="fut-asc.svg"
   inkscape:version="0.92.2 5c3e80d, 2017-08-06">
  <metadata
     id="metadata1141">
    <rdf:RDF>
      <cc:Work
         rdf:about="">
        <dc:format>image/svg+xml</dc:format>
        <dc:type
           rdf:resource="http://purl.org/dc/dcmitype/StillImage" />
        <dc:title></dc:title>
      </cc:Work>
    </rdf:RDF>
  </metadata>
  <defs
     id="defs1139" />
  <sodipodi:namedview
     pagecolor="#ffffff"
     bordercolor="#666666"
     borderopacity="1"
     objecttolerance="10"
     gridtolerance="10"
     guidetolerance="10"
     inkscape:pageopacity="0"
     inkscape:pageshadow="2"
     inkscape:window-width="1440"
     inkscape:window-height="856"
     id="namedview1137"
     showgrid="true"
     inkscape:zoom="15.375122"
     inkscape:cx="-3.6891399"
     inkscape:cy="3.0364711"
     inkscape:window-x="21"
     inkscape:window-y="65"
     inkscape:window-maximized="0"
     inkscape:current-layer="svg1135">
    <inkscape:grid
       type="xygrid"
       id="grid1143" />
  </sodipodi:namedview>
  <path
     d="M 0,0 V 21"
     style="fill:none;stroke:none;stroke-width:2.47847891;stroke-linecap:round;stroke-linejoin:round;stroke-opacity:1"
     id="path1133"
     inkscape:connector-curvature="0"
     sodipodi:nodetypes="cc" />
</svg>
