<?xml version="1.0"?><!DOCTYPE svg PUBLIC "-//W3C//DTD SVG 1.1//EN" "http://www.w3.org/Graphics/SVG/1.1/DTD/svg11.dtd"><svg xmlns="http://www.w3.org/2000/svg" xmlns:xlink="http://www.w3.org/1999/xlink" width="350" height="1000" viewBox="0 0 10 26" >
            
                ['<path class="dot" d="M 5.519583333333333,1.1402708333333331 L 5.519583333333333,1.1402708333333331 C 5.229583333333333,0.8502708333333331 4.780083333333333,0.850270833333333 4.490083333333333,1.1402708333333331 L 4.113083333333333,1.5172708333333333 C 3.823083333333333,1.8072708333333332 3.823083333333333,2.2567708333333334 4.113083333333333,2.5467708333333334 L 4.504583333333333,2.938270833333333 C 4.794583333333333,3.228270833333333 5.244083333333333,3.228270833333333 5.534083333333333,2.938270833333333 L 5.911083333333334,2.5467708333333334 C 6.201083333333333,2.2567708333333334 6.201083333333333,1.8072708333333334 5.911083333333334,1.5172708333333331 L 5.519583333333333,1.1402708333333331" stroke-linejoin="round"/>', '<path class="dot" d="M 4.519583333333333,2.1402710333333332 L 4.519583333333333,2.1402710333333332 C 4.229583333333333,1.8502710333333332 3.7800833333333332,1.8502710333333332 3.490083333333333,2.1402710333333332 L 3.113083333333333,2.5172710333333335 C 2.823083333333333,2.8072710333333335 2.823083333333333,3.256771033333333 3.113083333333333,3.546771033333333 L 3.504583333333333,3.938271033333333 C 3.7945833333333328,4.228271033333333 4.244083333333333,4.228271033333333 4.534083333333333,3.938271033333333 L 4.911083333333334,3.546771033333333 C 5.201083333333333,3.256771033333333 5.201083333333333,2.8072710333333335 4.911083333333334,2.5172710333333335 L 4.519583333333333,2.1402710333333332" stroke-linejoin="round"/>', '<path class="dot" d="M 3.5195833333333333,1.1402708333333331 L 3.5195833333333333,1.1402708333333331 C 3.2295833333333333,0.8502708333333331 2.7800833333333332,0.850270833333333 2.490083333333333,1.1402708333333331 L 2.113083333333333,1.5172708333333333 C 1.8230833333333332,1.8072708333333332 1.8230833333333332,2.2567708333333334 2.113083333333333,2.5467708333333334 L 2.504583333333333,2.938270833333333 C 2.7945833333333328,3.228270833333333 3.244083333333333,3.228270833333333 3.5340833333333332,2.938270833333333 L 3.9110833333333335,2.5467708333333334 C 4.201083333333333,2.2567708333333334 4.201083333333333,1.8072708333333334 3.9110833333333335,1.5172708333333331 L 3.5195833333333333,1.1402708333333331" stroke-linejoin="round"/>', '<path class="dot" d="M 4.519583333333333,0.1402708333333331 L 4.519583333333333,0.1402708333333331 C 4.229583333333333,-0.14972916666666694 3.7800833333333332,-0.149729166666667 3.490083333333333,0.1402708333333331 L 3.113083333333333,0.5172708333333332 C 2.823083333333333,0.8072708333333332 2.823083333333333,1.2567708333333332 3.113083333333333,1.5467708333333332 L 3.504583333333333,1.938270833333333 C 3.7945833333333328,2.228270833333333 4.244083333333333,2.228270833333333 4.534083333333333,1.938270833333333 L 4.911083333333334,1.5467708333333332 C 5.201083333333333,1.2567708333333332 5.201083333333333,0.8072708333333333 4.911083333333334,0.5172708333333331 L 4.519583333333333,0.14027083333333312" stroke-linejoin="round"/>', '<path class="dot" d="M 5.519583333333333,1.1402708333333331 L 5.519583333333333,1.1402708333333331 C 5.229583333333333,0.8502708333333331 4.780083333333333,0.850270833333333 4.490083333333333,1.1402708333333331 L 4.113083333333333,1.5172708333333333 C 3.823083333333333,1.8072708333333332 3.823083333333333,2.2567708333333334 4.113083333333333,2.5467708333333334 L 4.504583333333333,2.938270833333333 C 4.794583333333333,3.228270833333333 5.244083333333333,3.228270833333333 5.534083333333333,2.938270833333333 L 5.911083333333334,2.5467708333333334 C 6.201083333333333,2.2567708333333334 6.201083333333333,1.8072708333333334 5.911083333333334,1.5172708333333331 L 5.519583333333333,1.1402708333333331" stroke-linejoin="round"/>', '<path class="dot" d="M 5.519583333333333,4.140270833333333 L 5.519583333333333,4.140270833333333 C 5.229583333333333,3.8502708333333326 4.780083333333333,3.8502708333333326 4.490083333333333,4.140270833333333 L 4.113083333333333,4.517270833333333 C 3.823083333333333,4.807270833333333 3.823083333333333,5.2567708333333325 4.113083333333333,5.546770833333333 L 4.504583333333333,5.938270833333332 C 4.794583333333333,6.228270833333333 5.244083333333333,6.228270833333333 5.534083333333333,5.938270833333332 L 5.911083333333334,5.546770833333333 C 6.201083333333333,5.2567708333333325 6.201083333333333,4.807270833333333 5.911083333333334,4.517270833333333 L 5.519583333333333,4.140270833333333" stroke-linejoin="round"/>', '<path class="dot" d="M 3.5195833333333333,6.140270833333333 L 3.5195833333333333,6.140270833333333 C 3.2295833333333333,5.850270833333333 2.7800833333333332,5.850270833333333 2.490083333333333,6.140270833333333 L 2.113083333333333,6.517270833333333 C 1.8230833333333332,6.807270833333333 1.8230833333333332,7.2567708333333325 2.113083333333333,7.546770833333333 L 2.504583333333333,7.938270833333332 C 2.7945833333333328,8.228270833333333 3.244083333333333,8.228270833333333 3.5340833333333332,7.938270833333332 L 3.9110833333333335,7.546770833333333 C 4.201083333333333,7.2567708333333325 4.201083333333333,6.807270833333333 3.9110833333333335,6.517270833333333 L 3.5195833333333333,6.140270833333333" stroke-linejoin="round"/>']
            
            
            <path d="M 5.0,2.0 L 4.0,3.0000002 L 3.0,2.0 L 4.0,1.0 L 5.0,2.0 L 5.0,5.0 L 3.0,7.0" fill="none"
            stroke="black"
            stroke-width="1.5"
            stroke-linecap="round"
            stroke-linejoin="round"
            />
            
            
        </svg>