<?xml version="1.0"?><!DOCTYPE svg PUBLIC "-//W3C//DTD SVG 1.1//EN" "http://www.w3.org/Graphics/SVG/1.1/DTD/svg11.dtd"><svg xmlns="http://www.w3.org/2000/svg" xmlns:xlink="http://www.w3.org/1999/xlink" width="350" height="1000" viewBox="0 0 10 26" >
            
                ['<path class="dot" d="M 2.5195833333333333,4.140270833333333 L 2.5195833333333333,4.140270833333333 C 2.2295833333333333,3.8502708333333326 1.7800833333333332,3.8502708333333326 1.4900833333333332,4.140270833333333 L 1.1130833333333332,4.517270833333333 C 0.8230833333333332,4.807270833333333 0.8230833333333331,5.2567708333333325 1.1130833333333332,5.546770833333333 L 1.5045833333333332,5.938270833333332 C 1.794583333333333,6.228270833333333 2.244083333333333,6.228270833333333 2.5340833333333332,5.938270833333332 L 2.9110833333333335,5.546770833333333 C 3.2010833333333335,5.2567708333333325 3.2010833333333335,4.807270833333333 2.9110833333333335,4.517270833333333 L 2.5195833333333333,4.140270833333333" stroke-linejoin="round"/>', '<path class="dot" d="M 8.519583333333333,4.140270833333333 L 8.519583333333333,4.140270833333333 C 8.229583333333332,3.8502708333333326 7.780083333333333,3.8502708333333326 7.490083333333333,4.140270833333333 L 7.113083333333333,4.517270833333333 C 6.823083333333333,4.807270833333333 6.823083333333333,5.2567708333333325 7.113083333333333,5.546770833333333 L 7.504583333333333,5.938270833333332 C 7.794583333333333,6.228270833333333 8.244083333333332,6.228270833333333 8.534083333333333,5.938270833333332 L 8.911083333333334,5.546770833333333 C 9.201083333333333,5.2567708333333325 9.201083333333333,4.807270833333333 8.911083333333334,4.517270833333333 L 8.519583333333333,4.140270833333333" stroke-linejoin="round"/>']
            
                ['<path class="dot" d="M 8.519583333333333,4.140270833333333 L 8.519583333333333,4.140270833333333 C 8.229583333333332,3.8502708333333326 7.780083333333333,3.8502708333333326 7.490083333333333,4.140270833333333 L 7.113083333333333,4.517270833333333 C 6.823083333333333,4.807270833333333 6.823083333333333,5.2567708333333325 7.113083333333333,5.546770833333333 L 7.504583333333333,5.938270833333332 C 7.794583333333333,6.228270833333333 8.244083333333332,6.228270833333333 8.534083333333333,5.938270833333332 L 8.911083333333334,5.546770833333333 C 9.201083333333333,5.2567708333333325 9.201083333333333,4.807270833333333 8.911083333333334,4.517270833333333 L 8.519583333333333,4.140270833333333" stroke-linejoin="round"/>', '<path class="dot" d="M 2.5195833333333333,14.140270833333332 L 2.5195833333333333,14.140270833333332 C 2.2295833333333333,13.850270833333333 1.7800833333333332,13.850270833333333 1.4900833333333332,14.140270833333332 L 1.1130833333333332,14.517270833333333 C 0.8230833333333332,14.807270833333334 0.8230833333333331,15.256770833333333 1.1130833333333332,15.546770833333333 L 1.5045833333333332,15.938270833333332 C 1.794583333333333,16.228270833333333 2.244083333333333,16.228270833333333 2.5340833333333332,15.938270833333332 L 2.9110833333333335,15.546770833333333 C 3.2010833333333335,15.256770833333333 3.2010833333333335,14.807270833333334 2.9110833333333335,14.517270833333333 L 2.5195833333333333,14.140270833333332" stroke-linejoin="round"/>']
            
                ['<path class="dot" d="M 2.5195833333333333,14.140270833333332 L 2.5195833333333333,14.140270833333332 C 2.2295833333333333,13.850270833333333 1.7800833333333332,13.850270833333333 1.4900833333333332,14.140270833333332 L 1.1130833333333332,14.517270833333333 C 0.8230833333333332,14.807270833333334 0.8230833333333331,15.256770833333333 1.1130833333333332,15.546770833333333 L 1.5045833333333332,15.938270833333332 C 1.794583333333333,16.228270833333333 2.244083333333333,16.228270833333333 2.5340833333333332,15.938270833333332 L 2.9110833333333335,15.546770833333333 C 3.2010833333333335,15.256770833333333 3.2010833333333335,14.807270833333334 2.9110833333333335,14.517270833333333 L 2.5195833333333333,14.140270833333332" stroke-linejoin="round"/>', '<path class="dot" d="M 8.519583333333333,14.140270833333332 L 8.519583333333333,14.140270833333332 C 8.229583333333332,13.850270833333333 7.780083333333333,13.850270833333333 7.490083333333333,14.140270833333332 L 7.113083333333333,14.517270833333333 C 6.823083333333333,14.807270833333334 6.823083333333333,15.256770833333333 7.113083333333333,15.546770833333333 L 7.504583333333333,15.938270833333332 C 7.794583333333333,16.228270833333333 8.244083333333332,16.228270833333333 8.534083333333333,15.938270833333332 L 8.911083333333334,15.546770833333333 C 9.201083333333333,15.256770833333333 9.201083333333333,14.807270833333334 8.911083333333334,14.517270833333333 L 8.519583333333333,14.140270833333332" stroke-linejoin="round"/>']
            
            
            <path d="M 2.0,5.0 L 8.0,5.0" fill="none"
            stroke="black"
            stroke-width="1.5"
            stroke-linecap="round"
            stroke-linejoin="round"
            />
            
            <path d="M 8.0,5.0 L 2.0,15.0" fill="none"
            stroke="black"
            stroke-width="1.5"
            stroke-linecap="round"
            stroke-linejoin="round"
            />
            
            <path d="M 2.0,15.0 L 8.0,15.0" fill="none"
            stroke="black"
            stroke-width="1.5"
            stroke-linecap="round"
            stroke-linejoin="round"
            />
            
            
        </svg>