<?xml version="1.0" encoding="UTF-8" standalone="no"?>
<svg
   width="6.0000005"
   height="6.0000114"
   viewBox="0 0 6.0000005 6.0000115"
   version="1.1"
   id="svg25"
   sodipodi:docname="petite-petite-panse.svg"
   inkscape:version="1.3.2 (091e20ef0f, 2023-11-25, custom)"
   xmlns:inkscape="http://www.inkscape.org/namespaces/inkscape"
   xmlns:sodipodi="http://sodipodi.sourceforge.net/DTD/sodipodi-0.dtd"
   xmlns="http://www.w3.org/2000/svg"
   xmlns:svg="http://www.w3.org/2000/svg"><sodipodi:namedview
   id="namedview1"
   pagecolor="#ffffff"
   bordercolor="#666666"
   borderopacity="1.0"
   inkscape:showpageshadow="2"
   inkscape:pageopacity="0.0"
   inkscape:pagecheckerboard="0"
   inkscape:deskcolor="#d1d1d1"
   inkscape:zoom="196.99962"
   inkscape:cx="3.0000057"
   inkscape:cy="3.0000057"
   inkscape:window-width="2560"
   inkscape:window-height="1371"
   inkscape:window-x="0"
   inkscape:window-y="0"
   inkscape:window-maximized="1"
   inkscape:current-layer="svg25" />
<defs
   id="defs25" />


            
                ['', '']
            
                ['', '', '', '', '', '', '', '', '', '']
            
                ['', '', '', '', '', '', '', '', '', '']
            
            
            <path
   d="M 4.9999996e-7,0 3.0000003,1.1249999e-5 5.0000001,1.0000112 6,2.0000111 v 1.9999998 l -0.9999999,0.9999999 -1.9999998,1 L 0,6.0000105"
   fill="none"
   stroke="black"
   stroke-width="2.5"
   stroke-linecap="round"
   stroke-linejoin="round"
   id="path25-5"
   style="stroke:none" />
</svg>
