<?xml version="1.0"?><!DOCTYPE svg PUBLIC "-//W3C//DTD SVG 1.1//EN" "http://www.w3.org/Graphics/SVG/1.1/DTD/svg11.dtd"><svg xmlns="http://www.w3.org/2000/svg" xmlns:xlink="http://www.w3.org/1999/xlink" width="350" height="1000" viewBox="0 0 7 17" >
            
                ['<path class="dot" d="M 5.385,6.3180000000000005 L 5.385,6.3180000000000005 C 5.164999999999999,6.098000000000001 4.824,6.098000000000001 4.603999999999999,6.3180000000000005 L 4.318,6.604000000000001 C 4.098,6.824000000000001 4.098,7.165000000000001 4.318,7.385000000000001 L 4.614999999999999,7.682 C 4.834999999999999,7.902 5.176,7.902 5.395999999999999,7.682 L 5.682,7.385000000000001 C 5.902,7.165000000000001 5.902,6.824000000000001 5.682,6.604000000000001 L 5.385,6.3180000000000005" stroke-linejoin="round"/>', '<path class="dot" d="M 4.385,7.3180000000000005 L 4.385,7.3180000000000005 C 4.164999999999999,7.098000000000001 3.824,7.098000000000001 3.6039999999999996,7.3180000000000005 L 3.3179999999999996,7.604000000000001 C 3.0979999999999994,7.824000000000001 3.0979999999999994,8.165000000000001 3.3179999999999996,8.385000000000002 L 3.6149999999999993,8.682 C 3.8349999999999995,8.902000000000001 4.176,8.902000000000001 4.395999999999999,8.682 L 4.682,8.385000000000002 C 4.902,8.165000000000001 4.902,7.824000000000001 4.682,7.604000000000001 L 4.385,7.3180000000000005" stroke-linejoin="round"/>', '<path class="dot" d="M 3.385,6.3180000000000005 L 3.385,6.3180000000000005 C 3.1649999999999996,6.098000000000001 2.824,6.098000000000001 2.6039999999999996,6.3180000000000005 L 2.3179999999999996,6.604000000000001 C 2.0979999999999994,6.824000000000001 2.0979999999999994,7.165000000000001 2.3179999999999996,7.385000000000001 L 2.6149999999999993,7.682 C 2.8349999999999995,7.902 3.1759999999999997,7.902 3.3959999999999995,7.682 L 3.682,7.385000000000001 C 3.902,7.165000000000001 3.902,6.824000000000001 3.682,6.604000000000001 L 3.385,6.3180000000000005" stroke-linejoin="round"/>', '<path class="dot" d="M 2.385,7.3180000000000005 L 2.385,7.3180000000000005 C 2.165,7.098000000000001 1.8239999999999998,7.098000000000001 1.6039999999999999,7.3180000000000005 L 1.3179999999999998,7.604000000000001 C 1.0979999999999999,7.824000000000001 1.0979999999999996,8.165000000000001 1.3179999999999998,8.385000000000002 L 1.6149999999999998,8.682 C 1.8349999999999997,8.902000000000001 2.176,8.902000000000001 2.396,8.682 L 2.6820000000000004,8.385000000000002 C 2.902,8.165000000000001 2.902,7.824000000000001 2.6820000000000004,7.604000000000001 L 2.385,7.3180000000000005" stroke-linejoin="round"/>']
            
            
            <path d="M 5.0,7.0 L 4.0,8.0 L 3.0,7.0 L 2.0,8.0" fill="none"
            stroke="black"
            stroke-width="1"
            stroke-linecap="round"
            stroke-linejoin="round"
            />
            
            
        </svg>