<?xml version="1.0"?><!DOCTYPE svg PUBLIC "-//W3C//DTD SVG 1.1//EN" "http://www.w3.org/Graphics/SVG/1.1/DTD/svg11.dtd"><svg xmlns="http://www.w3.org/2000/svg" xmlns:xlink="http://www.w3.org/1999/xlink" width="350" height="1000" viewBox="0 0 7 17" >
            
                ['<path class="dot" d="M 2.385,0.31800000000000006 L 2.385,0.31800000000000006 C 2.165,0.09799999999999998 1.8239999999999998,0.09799999999999995 1.6039999999999999,0.31800000000000006 L 1.3179999999999998,0.6040000000000002 C 1.0979999999999999,0.8240000000000002 1.0979999999999996,1.1650000000000003 1.3179999999999998,1.3850000000000002 L 1.6149999999999998,1.682 C 1.8349999999999997,1.902 2.176,1.902 2.396,1.682 L 2.6820000000000004,1.3850000000000002 C 2.902,1.165 2.902,0.8240000000000002 2.6820000000000004,0.6040000000000001 L 2.385,0.31800000000000006" stroke-linejoin="round"/>', '<path class="dot" d="M 2.385,10.318 L 2.385,10.318 C 2.165,10.098 1.8239999999999998,10.098 1.6039999999999999,10.318 L 1.3179999999999998,10.604000000000001 C 1.0979999999999999,10.824 1.0979999999999996,11.165000000000001 1.3179999999999998,11.385000000000002 L 1.6149999999999998,11.682 C 1.8349999999999997,11.902000000000001 2.176,11.902000000000001 2.396,11.682 L 2.6820000000000004,11.385000000000002 C 2.902,11.165000000000001 2.902,10.824 2.6820000000000004,10.604000000000001 L 2.385,10.318000000000001" stroke-linejoin="round"/>']
            
                ['<path class="dot" d="M 2.385,0.31800000000000006 L 2.385,0.31800000000000006 C 2.165,0.09799999999999998 1.8239999999999998,0.09799999999999995 1.6039999999999999,0.31800000000000006 L 1.3179999999999998,0.6040000000000002 C 1.0979999999999999,0.8240000000000002 1.0979999999999996,1.1650000000000003 1.3179999999999998,1.3850000000000002 L 1.6149999999999998,1.682 C 1.8349999999999997,1.902 2.176,1.902 2.396,1.682 L 2.6820000000000004,1.3850000000000002 C 2.902,1.165 2.902,0.8240000000000002 2.6820000000000004,0.6040000000000001 L 2.385,0.31800000000000006" stroke-linejoin="round"/>', '<path class="dot" d="M 6.385,0.31800000000000006 L 6.385,0.31800000000000006 C 6.164999999999999,0.09799999999999998 5.824,0.09799999999999995 5.603999999999999,0.31800000000000006 L 5.318,0.6040000000000002 C 5.098,0.8240000000000002 5.098,1.1650000000000003 5.318,1.3850000000000002 L 5.614999999999999,1.682 C 5.834999999999999,1.902 6.176,1.902 6.395999999999999,1.682 L 6.682,1.3850000000000002 C 6.902,1.165 6.902,0.8240000000000002 6.682,0.6040000000000001 L 6.385,0.31800000000000006" stroke-linejoin="round"/>']
            
                ['<path class="dot" d="M 2.385,5.3180000000000005 L 2.385,5.3180000000000005 C 2.165,5.098000000000001 1.8239999999999998,5.098000000000001 1.6039999999999999,5.3180000000000005 L 1.3179999999999998,5.604000000000001 C 1.0979999999999999,5.824000000000001 1.0979999999999996,6.165000000000001 1.3179999999999998,6.385000000000001 L 1.6149999999999998,6.682 C 1.8349999999999997,6.902 2.176,6.902 2.396,6.682 L 2.6820000000000004,6.385000000000001 C 2.902,6.165000000000001 2.902,5.824000000000001 2.6820000000000004,5.604000000000001 L 2.385,5.3180000000000005" stroke-linejoin="round"/>', '<path class="dot" d="M 6.385,5.3180000000000005 L 6.385,5.3180000000000005 C 6.164999999999999,5.098000000000001 5.824,5.098000000000001 5.603999999999999,5.3180000000000005 L 5.318,5.604000000000001 C 5.098,5.824000000000001 5.098,6.165000000000001 5.318,6.385000000000001 L 5.614999999999999,6.682 C 5.834999999999999,6.902 6.176,6.902 6.395999999999999,6.682 L 6.682,6.385000000000001 C 6.902,6.165000000000001 6.902,5.824000000000001 6.682,5.604000000000001 L 6.385,5.3180000000000005" stroke-linejoin="round"/>']
            
                ['<path class="dot" d="M 2.385,10.318 L 2.385,10.318 C 2.165,10.098 1.8239999999999998,10.098 1.6039999999999999,10.318 L 1.3179999999999998,10.604000000000001 C 1.0979999999999999,10.824 1.0979999999999996,11.165000000000001 1.3179999999999998,11.385000000000002 L 1.6149999999999998,11.682 C 1.8349999999999997,11.902000000000001 2.176,11.902000000000001 2.396,11.682 L 2.6820000000000004,11.385000000000002 C 2.902,11.165000000000001 2.902,10.824 2.6820000000000004,10.604000000000001 L 2.385,10.318000000000001" stroke-linejoin="round"/>', '<path class="dot" d="M 6.385,10.318 L 6.385,10.318 C 6.164999999999999,10.098 5.824,10.098 5.603999999999999,10.318 L 5.318,10.604000000000001 C 5.098,10.824 5.098,11.165000000000001 5.318,11.385000000000002 L 5.614999999999999,11.682 C 5.834999999999999,11.902000000000001 6.176,11.902000000000001 6.395999999999999,11.682 L 6.682,11.385000000000002 C 6.902,11.165000000000001 6.902,10.824 6.682,10.604000000000001 L 6.385,10.318000000000001" stroke-linejoin="round"/>']
            
                ['<path class="dot" d="M 7.385,-2.682 L 7.385,-2.682 C 7.164999999999999,-2.902 6.824,-2.902 6.603999999999999,-2.682 L 6.318,-2.396 C 6.098,-2.1759999999999997 6.098,-1.8349999999999997 6.318,-1.6149999999999998 L 6.614999999999999,-1.318 C 6.834999999999999,-1.098 7.176,-1.098 7.395999999999999,-1.318 L 7.682,-1.6149999999999998 C 7.902,-1.835 7.902,-2.1759999999999997 7.682,-2.396 L 7.385,-2.682" stroke-linejoin="round"/>', '<path class="dot" d="M 6.385,-1.682 L 6.385,-1.682 C 6.164999999999999,-1.9020000000000001 5.824,-1.9020000000000001 5.603999999999999,-1.682 L 5.318,-1.396 C 5.098,-1.1759999999999997 5.098,-0.8349999999999997 5.318,-0.6149999999999998 L 5.614999999999999,-0.31800000000000006 C 5.834999999999999,-0.09800000000000009 6.176,-0.09800000000000009 6.395999999999999,-0.31800000000000006 L 6.682,-0.6149999999999998 C 6.902,-0.835 6.902,-1.1759999999999997 6.682,-1.396 L 6.385,-1.682" stroke-linejoin="round"/>', '<path class="dot" d="M 5.385,-2.682 L 5.385,-2.682 C 5.164999999999999,-2.902 4.824,-2.902 4.603999999999999,-2.682 L 4.318,-2.396 C 4.098,-2.1759999999999997 4.098,-1.8349999999999997 4.318,-1.6149999999999998 L 4.614999999999999,-1.318 C 4.834999999999999,-1.098 5.176,-1.098 5.395999999999999,-1.318 L 5.682,-1.6149999999999998 C 5.902,-1.835 5.902,-2.1759999999999997 5.682,-2.396 L 5.385,-2.682" stroke-linejoin="round"/>', '<path class="dot" d="M 6.385,-3.682 L 6.385,-3.682 C 6.164999999999999,-3.902 5.824,-3.902 5.603999999999999,-3.682 L 5.318,-3.396 C 5.098,-3.1759999999999997 5.098,-2.835 5.318,-2.6149999999999998 L 5.614999999999999,-2.318 C 5.834999999999999,-2.098 6.176,-2.098 6.395999999999999,-2.318 L 6.682,-2.6149999999999998 C 6.902,-2.835 6.902,-3.1759999999999997 6.682,-3.396 L 6.385,-3.682" stroke-linejoin="round"/>', '<path class="dot" d="M 3.385,-2.682 L 3.385,-2.682 C 3.1649999999999996,-2.902 2.824,-2.902 2.6039999999999996,-2.682 L 2.3179999999999996,-2.396 C 2.0979999999999994,-2.1759999999999997 2.0979999999999994,-1.8349999999999997 2.3179999999999996,-1.6149999999999998 L 2.6149999999999993,-1.318 C 2.8349999999999995,-1.098 3.1759999999999997,-1.098 3.3959999999999995,-1.318 L 3.682,-1.6149999999999998 C 3.902,-1.835 3.902,-2.1759999999999997 3.682,-2.396 L 3.385,-2.682" stroke-linejoin="round"/>', '<path class="dot" d="M 2.385,-1.682 L 2.385,-1.682 C 2.165,-1.9020000000000001 1.8239999999999998,-1.9020000000000001 1.6039999999999999,-1.682 L 1.3179999999999998,-1.396 C 1.0979999999999999,-1.1759999999999997 1.0979999999999996,-0.8349999999999997 1.3179999999999998,-0.6149999999999998 L 1.6149999999999998,-0.31800000000000006 C 1.8349999999999997,-0.09800000000000009 2.176,-0.09800000000000009 2.396,-0.31800000000000006 L 2.6820000000000004,-0.6149999999999998 C 2.902,-0.835 2.902,-1.1759999999999997 2.6820000000000004,-1.396 L 2.385,-1.682" stroke-linejoin="round"/>', '<path class="dot" d="M 1.385,-2.6820002 L 1.3849999999999998,-2.6820002 C 1.1649999999999998,-2.9020002000000003 0.8239999999999998,-2.9020002000000003 0.6039999999999999,-2.6820002 L 0.31799999999999984,-2.3960002 C 0.09799999999999975,-2.1760002 0.09799999999999973,-1.8350001999999999 0.31799999999999984,-1.6150001999999999 L 0.6149999999999998,-1.3180002000000002 C 0.8349999999999997,-1.0980002000000002 1.176,-1.0980002000000002 1.3959999999999997,-1.3180002000000002 L 1.6820000000000002,-1.6150001999999999 C 1.9020000000000001,-1.8350002 1.9020000000000001,-2.1760002 1.6820000000000002,-2.3960002 L 1.385,-2.6820002" stroke-linejoin="round"/>', '<path class="dot" d="M 2.385,-3.682 L 2.385,-3.682 C 2.165,-3.902 1.8239999999999998,-3.902 1.6039999999999999,-3.682 L 1.3179999999999998,-3.396 C 1.0979999999999999,-3.1759999999999997 1.0979999999999996,-2.835 1.3179999999999998,-2.6149999999999998 L 1.6149999999999998,-2.318 C 1.8349999999999997,-2.098 2.176,-2.098 2.396,-2.318 L 2.6820000000000004,-2.6149999999999998 C 2.902,-2.835 2.902,-3.1759999999999997 2.6820000000000004,-3.396 L 2.385,-3.682" stroke-linejoin="round"/>', '<path class="dot" d="M 3.385,-2.682 L 3.385,-2.682 C 3.1649999999999996,-2.902 2.824,-2.902 2.6039999999999996,-2.682 L 2.3179999999999996,-2.396 C 2.0979999999999994,-2.1759999999999997 2.0979999999999994,-1.8349999999999997 2.3179999999999996,-1.6149999999999998 L 2.6149999999999993,-1.318 C 2.8349999999999995,-1.098 3.1759999999999997,-1.098 3.3959999999999995,-1.318 L 3.682,-1.6149999999999998 C 3.902,-1.835 3.902,-2.1759999999999997 3.682,-2.396 L 3.385,-2.682" stroke-linejoin="round"/>']
            
            
            <path d="M 2.0,1.0 L 2.0,11.0" fill="none"
            stroke="black"
            stroke-width="1"
            stroke-linecap="round"
            stroke-linejoin="round"
            />
            
            <path d="M 2.0,1.0 L 6.0,1.0" fill="none"
            stroke="black"
            stroke-width="1"
            stroke-linecap="round"
            stroke-linejoin="round"
            />
            
            <path d="M 2.0,6.0 L 6.0,6.0" fill="none"
            stroke="black"
            stroke-width="1"
            stroke-linecap="round"
            stroke-linejoin="round"
            />
            
            <path d="M 2.0,11.0 L 6.0,11.0" fill="none"
            stroke="black"
            stroke-width="1"
            stroke-linecap="round"
            stroke-linejoin="round"
            />
            
            <path d="M 7.0,-2.0 L 6.0,-1.0 L 5.0,-2.0 L 6.0,-3.0 L 7.0,-2.0 M 3.0,-2.0 L 2.0,-1.0 L 1.0,-2.0000002 L 2.0,-3.0 L 3.0,-2.0" fill="none"
            stroke="black"
            stroke-width="1"
            stroke-linecap="round"
            stroke-linejoin="round"
            />
            
            
        </svg>