<?xml version="1.0" encoding="UTF-8" standalone="no"?>
<svg
   xmlns:dc="http://purl.org/dc/elements/1.1/"
   xmlns:cc="http://creativecommons.org/ns#"
   xmlns:rdf="http://www.w3.org/1999/02/22-rdf-syntax-ns#"
   xmlns:svg="http://www.w3.org/2000/svg"
   xmlns="http://www.w3.org/2000/svg"
   xmlns:sodipodi="http://sodipodi.sourceforge.net/DTD/sodipodi-0.dtd"
   xmlns:inkscape="http://www.inkscape.org/namespaces/inkscape"
   data-dec="114"
   width="8"
   height="6"
   version="1.1"
   id="svg8426"
   sodipodi:docname="r-excpt.svg"
   inkscape:version="0.92.2 5c3e80d, 2017-08-06">
  <metadata
     id="metadata8432">
    <rdf:RDF>
      <cc:Work
         rdf:about="">
        <dc:format>image/svg+xml</dc:format>
        <dc:type
           rdf:resource="http://purl.org/dc/dcmitype/StillImage" />
        <dc:title></dc:title>
      </cc:Work>
    </rdf:RDF>
  </metadata>
  <defs
     id="defs8430" />
  <sodipodi:namedview
     pagecolor="#ffffff"
     bordercolor="#666666"
     borderopacity="1"
     objecttolerance="10"
     gridtolerance="10"
     guidetolerance="10"
     inkscape:pageopacity="0"
     inkscape:pageshadow="2"
     inkscape:window-width="1385"
     inkscape:window-height="770"
     id="namedview8428"
     showgrid="true"
     inkscape:zoom="16.68772"
     inkscape:cx="4.458634"
     inkscape:cy="21.799125"
     inkscape:window-x="40"
     inkscape:window-y="84"
     inkscape:window-maximized="0"
     inkscape:current-layer="svg8426">
    <inkscape:grid
       type="xygrid"
       id="grid8977" />
  </sodipodi:namedview>
  <path
     d="M 0,6 1,3 3,1 5,0 h 3"
     style="fill:none;stroke:none;stroke-width:1.95959187;stroke-linecap:round;stroke-linejoin:round"
     id="path8424"
     inkscape:connector-curvature="0"
     sodipodi:nodetypes="ccccc" />
</svg>
