<?xml version="1.0"?><!DOCTYPE svg PUBLIC "-//W3C//DTD SVG 1.1//EN" "http://www.w3.org/Graphics/SVG/1.1/DTD/svg11.dtd"><svg xmlns="http://www.w3.org/2000/svg" xmlns:xlink="http://www.w3.org/1999/xlink" width="350" height="1000" viewBox="0 0 10 26" >
            
                ['<path class="dot" d="M 3.5195832333333334,6.140271133333333 L 3.519583233333333,6.140271133333333 C 3.2295832333333334,5.850271133333333 2.7800832333333334,5.850271133333333 2.4900832333333334,6.140271133333333 L 2.113083233333333,6.517271133333333 C 1.8230832333333333,6.807271133333333 1.8230832333333333,7.2567711333333325 2.113083233333333,7.546771133333333 L 2.5045832333333333,7.938271133333332 C 2.7945832333333334,8.228271133333333 3.2440832333333334,8.228271133333333 3.534083233333333,7.938271133333332 L 3.9110832333333336,7.546771133333333 C 4.201083233333334,7.2567711333333325 4.201083233333334,6.807271133333333 3.9110832333333336,6.517271133333333 L 3.519583233333334,6.140271133333333" stroke-linejoin="round"/>', '<path class="dot" d="M 10.519583033333333,6.140271133333333 L 10.519583033333333,6.140271133333333 C 10.229583033333332,5.850271133333333 9.780083033333332,5.850271133333333 9.490083033333333,6.140271133333333 L 9.113083033333332,6.517271133333333 C 8.823083033333333,6.807271133333333 8.823083033333333,7.2567711333333325 9.113083033333332,7.546771133333333 L 9.504583033333333,7.938271133333332 C 9.794583033333332,8.228271133333333 10.244083033333332,8.228271133333333 10.534083033333333,7.938271133333332 L 10.911083033333334,7.546771133333333 C 11.201083033333333,7.2567711333333325 11.201083033333333,6.807271133333333 10.911083033333334,6.517271133333333 L 10.519583033333333,6.140271133333333" stroke-linejoin="round"/>', '<path class="dot" d="M 10.519583033333333,6.140271133333333 L 10.519583033333333,6.140271133333333 C 10.229583033333332,5.850271133333333 9.780083033333332,5.850271133333333 9.490083033333333,6.140271133333333 L 9.113083033333332,6.517271133333333 C 8.823083033333333,6.807271133333333 8.823083033333333,7.2567711333333325 9.113083033333332,7.546771133333333 L 9.504583033333333,7.938271133333332 C 9.794583033333332,8.228271133333333 10.244083033333332,8.228271133333333 10.534083033333333,7.938271133333332 L 10.911083033333334,7.546771133333333 C 11.201083033333333,7.2567711333333325 11.201083033333333,6.807271133333333 10.911083033333334,6.517271133333333 L 10.519583033333333,6.140271133333333" stroke-linejoin="round"/>', '<path class="dot" d="M 0.5195833333333333,16.140270833333332 L 0.5195833333333331,16.140270833333332 C 0.22958333333333325,15.850270833333333 -0.21991666666666687,15.850270833333333 -0.5099166666666669,16.140270833333332 L -0.8869166666666668,16.517270833333335 C -1.1769166666666668,16.807270833333334 -1.1769166666666668,17.256770833333334 -0.8869166666666668,17.546770833333333 L -0.49541666666666695,17.938270833333334 C -0.20541666666666702,18.228270833333333 0.2440833333333332,18.228270833333333 0.534083333333333,17.938270833333334 L 0.9110833333333335,17.546770833333333 C 1.2010833333333335,17.256770833333334 1.2010833333333335,16.807270833333334 0.9110833333333335,16.517270833333335 L 0.5195833333333335,16.140270833333332" stroke-linejoin="round"/>']
            
            
            <path d="M 2.9999999,7.0000003 L 9.9999997,7.0000003 L 9.9999997,14.000000100000001 M 9.9999997,7.0000003 L 0.0,17.0" fill="none"
            stroke="black"
            stroke-width="1.5"
            stroke-linecap="round"
            stroke-linejoin="round"
            />
            
            
        </svg>