<?xml version="1.0" encoding="UTF-8" standalone="no"?>
<svg
   data-dec="107"
   width="12"
   height="21"
   version="1.1"
   id="svg6983"
   sodipodi:docname="arobase.svg"
   inkscape:version="1.3.2 (091e20ef0f, 2023-11-25, custom)"
   xmlns:inkscape="http://www.inkscape.org/namespaces/inkscape"
   xmlns:sodipodi="http://sodipodi.sourceforge.net/DTD/sodipodi-0.dtd"
   xmlns="http://www.w3.org/2000/svg"
   xmlns:svg="http://www.w3.org/2000/svg"
   xmlns:rdf="http://www.w3.org/1999/02/22-rdf-syntax-ns#"
   xmlns:cc="http://creativecommons.org/ns#"
   xmlns:dc="http://purl.org/dc/elements/1.1/">
  <metadata
     id="metadata6989">
    <rdf:RDF>
      <cc:Work
         rdf:about="">
        <dc:format>image/svg+xml</dc:format>
        <dc:type
           rdf:resource="http://purl.org/dc/dcmitype/StillImage" />
      </cc:Work>
    </rdf:RDF>
  </metadata>
  <defs
     id="defs6987" />
  <sodipodi:namedview
     pagecolor="#ffffff"
     bordercolor="#666666"
     borderopacity="1"
     objecttolerance="10"
     gridtolerance="10"
     guidetolerance="10"
     inkscape:pageopacity="0"
     inkscape:pageshadow="2"
     inkscape:window-width="2560"
     inkscape:window-height="1403"
     id="namedview6985"
     showgrid="true"
     showguides="true"
     inkscape:guide-bbox="true"
     inkscape:zoom="33.213945"
     inkscape:cx="-0.96345073"
     inkscape:cy="12.615183"
     inkscape:window-x="0"
     inkscape:window-y="0"
     inkscape:window-maximized="1"
     inkscape:current-layer="svg6983"
     inkscape:showpageshadow="2"
     inkscape:pagecheckerboard="0"
     inkscape:deskcolor="#d1d1d1">
    <sodipodi:guide
       position="-10.5,10"
       orientation="0,1"
       id="guide7534"
       inkscape:locked="false" />
    <inkscape:grid
       type="xygrid"
       id="grid7536"
       originx="-14"
       originy="8"
       spacingy="1"
       spacingx="1"
       units="px"
       visible="true" />
    <sodipodi:guide
       position="-1,24"
       orientation="0,1"
       id="guide7538"
       inkscape:locked="false" />
    <sodipodi:guide
       position="-7,31"
       orientation="0,1"
       id="guide7540"
       inkscape:locked="false" />
  </sodipodi:namedview>
  <path
     d="M 9,5 H 6 L 4,6 3,9 v 3 l 1,3 1,1 h 1 l 2,-3 m 1,-8 -1,8 2,3 h 1 l 1,-5 V 5 L 10,1 8,0 H 4 L 2,2 1,4 0,7 v 7 l 1,3 1,2 2,2 h 4 l 2,-1"
     style="fill:none;stroke:black;stroke-width:.5;stroke-linecap:round;stroke-linejoin:round"
     id="path1"
     sodipodi:nodetypes="ccccccccccccccccccccccccccc" />
</svg>
