<?xml version="1.0" encoding="UTF-8" standalone="no"?>
<svg
   data-dec="97"
   width="8"
   height="4"
   version="1.1"
   id="svg4"
   sodipodi:docname="tilde.svg"
   inkscape:version="1.3.2 (091e20ef0f, 2023-11-25, custom)"
   xml:space="preserve"
   xmlns:inkscape="http://www.inkscape.org/namespaces/inkscape"
   xmlns:sodipodi="http://sodipodi.sourceforge.net/DTD/sodipodi-0.dtd"
   xmlns="http://www.w3.org/2000/svg"
   xmlns:svg="http://www.w3.org/2000/svg"
   xmlns:rdf="http://www.w3.org/1999/02/22-rdf-syntax-ns#"
   xmlns:cc="http://creativecommons.org/ns#"
   xmlns:dc="http://purl.org/dc/elements/1.1/"><metadata
     id="metadata10"><rdf:RDF><cc:Work
         rdf:about=""><dc:format>image/svg+xml</dc:format><dc:type
           rdf:resource="http://purl.org/dc/dcmitype/StillImage" /></cc:Work></rdf:RDF></metadata><defs
     id="defs8" /><sodipodi:namedview
     pagecolor="#ffffff"
     bordercolor="#666666"
     borderopacity="1"
     objecttolerance="10"
     gridtolerance="10"
     guidetolerance="10"
     inkscape:pageopacity="0"
     inkscape:pageshadow="2"
     inkscape:window-width="2560"
     inkscape:window-height="1403"
     id="namedview6"
     showgrid="true"
     showguides="true"
     inkscape:guide-bbox="true"
     inkscape:zoom="67.758863"
     inkscape:cx="4.4422233"
     inkscape:cy="-0.42798829"
     inkscape:window-x="0"
     inkscape:window-y="0"
     inkscape:window-maximized="1"
     inkscape:current-layer="svg4"
     inkscape:showpageshadow="2"
     inkscape:pagecheckerboard="0"
     inkscape:deskcolor="#d1d1d1"><inkscape:grid
       type="xygrid"
       id="grid817"
       originx="-2"
       originy="-12"
       spacingy="1"
       spacingx="1"
       units="px"
       visible="true" /><sodipodi:guide
       position="12.441757,27"
       orientation="0,1"
       id="guide921"
       inkscape:locked="false" /><sodipodi:guide
       position="11,41"
       orientation="0,1"
       id="guide923"
       inkscape:locked="false" /><sodipodi:guide
       position="12.351871,48"
       orientation="0,1"
       id="guide925"
       inkscape:locked="false" /><sodipodi:guide
       position="-3,20"
       orientation="0,1"
       id="guide927"
       inkscape:locked="false" /></sodipodi:namedview><path
     d="M 0,4 V 3 L 2,1 H 3 L 5,3 H 6 L 8,1 V 0"
     style="fill:none;stroke:black;stroke-width:.5;stroke-linecap:round;stroke-linejoin:round"
     id="path1"
     sodipodi:nodetypes="cccccccc" /></svg>
