<?xml version="1.0" encoding="UTF-8" standalone="no"?>
<svg
   data-dec="102"
   width="3"
   height="3"
   version="1.1"
   id="svg4"
   sodipodi:docname="fut-queue.svg"
   inkscape:version="1.3.1 (9b9bdc1480, 2023-11-25, custom)"
   xmlns:inkscape="http://www.inkscape.org/namespaces/inkscape"
   xmlns:sodipodi="http://sodipodi.sourceforge.net/DTD/sodipodi-0.dtd"
   xmlns="http://www.w3.org/2000/svg"
   xmlns:svg="http://www.w3.org/2000/svg"
   xmlns:rdf="http://www.w3.org/1999/02/22-rdf-syntax-ns#"
   xmlns:cc="http://creativecommons.org/ns#"
   xmlns:dc="http://purl.org/dc/elements/1.1/">
  <metadata
     id="metadata10">
    <rdf:RDF>
      <cc:Work
         rdf:about="">
        <dc:format>image/svg+xml</dc:format>
        <dc:type
           rdf:resource="http://purl.org/dc/dcmitype/StillImage" />
      </cc:Work>
    </rdf:RDF>
  </metadata>
  <defs
     id="defs8" />
  <sodipodi:namedview
     pagecolor="#ffffff"
     bordercolor="#666666"
     borderopacity="1"
     objecttolerance="10"
     gridtolerance="10"
     guidetolerance="10"
     inkscape:pageopacity="0"
     inkscape:pageshadow="2"
     inkscape:window-width="1878"
     inkscape:window-height="1016"
     id="namedview6"
     showgrid="true"
     inkscape:zoom="47.2"
     inkscape:cx="3.0826271"
     inkscape:cy="6.6101695"
     inkscape:window-x="0"
     inkscape:window-y="0"
     inkscape:window-maximized="1"
     inkscape:current-layer="svg4"
     showguides="true"
     inkscape:guide-bbox="true"
     inkscape:showpageshadow="2"
     inkscape:pagecheckerboard="0"
     inkscape:deskcolor="#d1d1d1">
    <inkscape:grid
       type="xygrid"
       id="grid817"
       originx="-3"
       originy="-1"
       spacingy="1"
       spacingx="1"
       units="px"
       visible="true" />
    <sodipodi:guide
       position="-3,1"
       orientation="0,1"
       id="guide3685"
       inkscape:locked="false" />
    <sodipodi:guide
       position="-4,-3"
       orientation="0,1"
       id="guide3687"
       inkscape:locked="false" />
  </sodipodi:namedview>
  <path
     style="fill:none;stroke:black;stroke-width:0.3;stroke-linecap:butt;stroke-linejoin:miter;stroke-opacity:1"
     d="M 3,0 H 2 L 0,2 v 1"
     id="path874"
     inkscape:connector-curvature="0"
     sodipodi:nodetypes="cccc" />
</svg>
