<?xml version="1.0"?><!DOCTYPE svg PUBLIC "-//W3C//DTD SVG 1.1//EN" "http://www.w3.org/Graphics/SVG/1.1/DTD/svg11.dtd"><svg xmlns="http://www.w3.org/2000/svg" xmlns:xlink="http://www.w3.org/1999/xlink" width="350" height="1000" viewBox="0 0 7 17" >
            
                ['<path class="dot" d="M 1.885,3.318 L 1.8849999999999998,3.318 C 1.6649999999999998,3.098 1.3239999999999998,3.098 1.1039999999999999,3.318 L 0.8179999999999998,3.604 C 0.5979999999999998,3.8240000000000003 0.5979999999999998,4.165 0.8179999999999998,4.385 L 1.1149999999999998,4.682 C 1.3349999999999997,4.902 1.676,4.902 1.8959999999999997,4.682 L 2.1820000000000004,4.385 C 2.402,4.165 2.402,3.8240000000000003 2.1820000000000004,3.604 L 1.885,3.318" stroke-linejoin="round"/>', '<path class="dot" d="M 1.885,10.318 L 1.8849999999999998,10.318 C 1.6649999999999998,10.098 1.3239999999999998,10.098 1.1039999999999999,10.318 L 0.8179999999999998,10.604000000000001 C 0.5979999999999998,10.824 0.5979999999999998,11.165000000000001 0.8179999999999998,11.385000000000002 L 1.1149999999999998,11.682 C 1.3349999999999997,11.902000000000001 1.676,11.902000000000001 1.8959999999999997,11.682 L 2.1820000000000004,11.385000000000002 C 2.402,11.165000000000001 2.402,10.824 2.1820000000000004,10.604000000000001 L 1.885,10.318000000000001" stroke-linejoin="round"/>']
            
                ['<path class="dot" d="M 1.885,6.3180000000000005 L 1.8849999999999998,6.3180000000000005 C 1.6649999999999998,6.098000000000001 1.3239999999999998,6.098000000000001 1.1039999999999999,6.3180000000000005 L 0.8179999999999998,6.604000000000001 C 0.5979999999999998,6.824000000000001 0.5979999999999998,7.165000000000001 0.8179999999999998,7.385000000000001 L 1.1149999999999998,7.682 C 1.3349999999999997,7.902 1.676,7.902 1.8959999999999997,7.682 L 2.1820000000000004,7.385000000000001 C 2.402,7.165000000000001 2.402,6.824000000000001 2.1820000000000004,6.604000000000001 L 1.885,6.3180000000000005" stroke-linejoin="round"/>', '<path class="dot" d="M 2.885,4.3180000000000005 L 2.885,4.3180000000000005 C 2.665,4.098000000000001 2.324,4.098000000000001 2.1039999999999996,4.3180000000000005 L 1.8179999999999998,4.604000000000001 C 1.5979999999999999,4.824000000000001 1.5979999999999996,5.165000000000001 1.8179999999999998,5.385000000000001 L 2.1149999999999998,5.682 C 2.335,5.902 2.676,5.902 2.896,5.682 L 3.1820000000000004,5.385000000000001 C 3.402,5.165000000000001 3.402,4.824000000000001 3.1820000000000004,4.604000000000001 L 2.885,4.3180000000000005" stroke-linejoin="round"/>', '<path class="dot" d="M 4.885,3.318 L 4.885,3.318 C 4.664999999999999,3.098 4.324,3.098 4.103999999999999,3.318 L 3.8179999999999996,3.604 C 3.5979999999999994,3.8240000000000003 3.5979999999999994,4.165 3.8179999999999996,4.385 L 4.114999999999999,4.682 C 4.334999999999999,4.902 4.676,4.902 4.895999999999999,4.682 L 5.182,4.385 C 5.402,4.165 5.402,3.8240000000000003 5.182,3.604 L 4.885,3.318" stroke-linejoin="round"/>', '<path class="dot" d="M 5.885,3.318 L 5.885,3.318 C 5.664999999999999,3.098 5.324,3.098 5.103999999999999,3.318 L 4.818,3.604 C 4.598,3.8240000000000003 4.598,4.165 4.818,4.385 L 5.114999999999999,4.682 C 5.334999999999999,4.902 5.676,4.902 5.895999999999999,4.682 L 6.182,4.385 C 6.402,4.165 6.402,3.8240000000000003 6.182,3.604 L 5.885,3.318" stroke-linejoin="round"/>']
            
            
            <path d="M 1.5,4.0 L 1.5,11.0" fill="none"
            stroke="black"
            stroke-width="1"
            stroke-linecap="round"
            stroke-linejoin="round"
            />
            
            <path d="M 1.5,7.0 L 2.5,5.0 L 4.5,4.0 L 5.5,4.0" fill="none"
            stroke="black"
            stroke-width="1"
            stroke-linecap="round"
            stroke-linejoin="round"
            />
            
            
        </svg>