<?xml version="1.0"?><!DOCTYPE svg PUBLIC "-//W3C//DTD SVG 1.1//EN" "http://www.w3.org/Graphics/SVG/1.1/DTD/svg11.dtd"><svg xmlns="http://www.w3.org/2000/svg" xmlns:xlink="http://www.w3.org/1999/xlink" width="350" height="1000" viewBox="0 0 14 40" >
            
                ['<path class="dot" d="M 8.790943977551022,-4.222806122448982 L 8.79094397755102,-4.222806122448982 C 8.34094397755102,-4.672806122448982 7.643443977551021,-4.672806122448982 7.193443977551022,-4.222806122448982 L 6.608443977551022,-3.637806122448982 C 6.158443977551022,-3.1878061224489818 6.158443977551022,-2.490306122448982 6.608443977551022,-2.040306122448982 L 7.215943977551021,-1.4328061224489823 C 7.665943977551021,-0.9828061224489826 8.363443977551022,-0.9828061224489826 8.813443977551021,-1.4328061224489823 L 9.398443977551022,-2.040306122448982 C 9.848443977551021,-2.490306122448982 9.848443977551021,-3.1878061224489818 9.398443977551022,-3.637806122448982 L 8.790943977551022,-4.222806122448982" stroke-linejoin="round"/>', '<path class="dot" d="M 12.790943877551019,-4.222806122448982 L 12.790943877551019,-4.222806122448982 C 12.34094387755102,-4.672806122448982 11.64344387755102,-4.672806122448982 11.193443877551019,-4.222806122448982 L 10.60844387755102,-3.637806122448982 C 10.158443877551019,-3.1878061224489818 10.158443877551019,-2.490306122448982 10.60844387755102,-2.040306122448982 L 11.21594387755102,-1.4328061224489823 C 11.665943877551019,-0.9828061224489826 12.363443877551019,-0.9828061224489826 12.81344387755102,-1.4328061224489823 L 13.39844387755102,-2.040306122448982 C 13.84844387755102,-2.490306122448982 13.84844387755102,-3.1878061224489818 13.39844387755102,-3.637806122448982 L 12.790943877551019,-4.222806122448982" stroke-linejoin="round"/>', '<path class="dot" d="M 4.790943877551021,8.777193877551019 L 4.79094387755102,8.777193877551019 C 4.34094387755102,8.327193877551018 3.64344387755102,8.327193877551018 3.19344387755102,8.777193877551019 L 2.60844387755102,9.362193877551018 C 2.1584438775510204,9.81219387755102 2.15844387755102,10.509693877551019 2.60844387755102,10.959693877551018 L 3.21594387755102,11.567193877551018 C 3.66594387755102,12.01719387755102 4.3634438775510205,12.01719387755102 4.81344387755102,11.567193877551018 L 5.398443877551021,10.959693877551018 C 5.84844387755102,10.509693877551019 5.84844387755102,9.81219387755102 5.398443877551021,9.362193877551018 L 4.790943877551021,8.777193877551019" stroke-linejoin="round"/>', '<path class="dot" d="M 3.7909438775510207,14.777193877551019 L 3.79094387755102,14.777193877551019 C 3.3409438775510196,14.327193877551018 2.64344387755102,14.327193877551018 2.19344387755102,14.777193877551019 L 1.60844387755102,15.362193877551018 C 1.15844387755102,15.81219387755102 1.15844387755102,16.50969387755102 1.60844387755102,16.959693877551018 L 2.2159438775510196,17.56719387755102 C 2.66594387755102,18.01719387755102 3.3634438775510196,18.01719387755102 3.8134438775510198,17.56719387755102 L 4.398443877551021,16.959693877551018 C 4.84844387755102,16.50969387755102 4.84844387755102,15.81219387755102 4.398443877551021,15.362193877551018 L 3.7909438775510207,14.777193877551019" stroke-linejoin="round"/>', '<path class="dot" d="M 12.790943877551019,14.777193877551019 L 12.790943877551019,14.777193877551019 C 12.34094387755102,14.327193877551018 11.64344387755102,14.327193877551018 11.193443877551019,14.777193877551019 L 10.60844387755102,15.362193877551018 C 10.158443877551019,15.81219387755102 10.158443877551019,16.50969387755102 10.60844387755102,16.959693877551018 L 11.21594387755102,17.56719387755102 C 11.665943877551019,18.01719387755102 12.363443877551019,18.01719387755102 12.81344387755102,17.56719387755102 L 13.39844387755102,16.959693877551018 C 13.84844387755102,16.50969387755102 13.84844387755102,15.81219387755102 13.39844387755102,15.362193877551018 L 12.790943877551019,14.777193877551019" stroke-linejoin="round"/>']
            
            
            <path d="M 8.000000100000001,-3.0 L 4.0000002,29.0 M 12.0,-3.0 L 8.0,29.0 M 4.0,10.0 L 13.0,10.0 M 3.0,16.0 L 12.0,16.0" fill="none"
            stroke="black"
            stroke-width="2.5"
            stroke-linecap="round"
            stroke-linejoin="round"
            />
            
            
        </svg>