<?xml version="1.0" encoding="UTF-8" standalone="no"?>
<svg
   width="6"
   height="13.999999"
   viewBox="0 0 6 13.999999"
   version="1.1"
   id="svg25"
   sodipodi:docname="c-cap.svg"
   inkscape:version="1.3.1 (9b9bdc1480, 2023-11-25, custom)"
   xmlns:inkscape="http://www.inkscape.org/namespaces/inkscape"
   xmlns:sodipodi="http://sodipodi.sourceforge.net/DTD/sodipodi-0.dtd"
   xmlns="http://www.w3.org/2000/svg"
   xmlns:svg="http://www.w3.org/2000/svg"><sodipodi:namedview
   id="namedview1"
   pagecolor="#ffffff"
   bordercolor="#999999"
   borderopacity="1"
   inkscape:showpageshadow="2"
   inkscape:pageopacity="0"
   inkscape:pagecheckerboard="0"
   inkscape:deskcolor="#d1d1d1"
   showgrid="true"
   inkscape:zoom="41.214226"
   inkscape:cx="1.3951493"
   inkscape:cy="8.1525247"
   inkscape:window-width="1878"
   inkscape:window-height="1016"
   inkscape:window-x="0"
   inkscape:window-y="0"
   inkscape:window-maximized="1"
   inkscape:current-layer="svg25">
  <inkscape:grid
     id="grid1"
     units="px"
     originx="0"
     originy="0"
     spacingx="1"
     spacingy="1"
     empcolor="#0099e5"
     empopacity="0.30196078"
     color="#0099e5"
     opacity="0.14901961"
     empspacing="5"
     dotted="false"
     gridanglex="30"
     gridanglez="30"
     visible="true" />
</sodipodi:namedview>
<defs
   id="defs25" />



            
                ['', '']
            
                ['', '', '', '', '', '', '', '', '', '']
            
                ['', '', '', '', '', '', '', '', '', '']
            
            
            <path
   style="fill:none;stroke-width:.5;stroke:black"
   d="M 6,4 5,1 4,0 H 2 L 1,1 0,5 v 4 l 1,4 1,1 1.9737113,-10e-7 L 5,13 6,10"
   id="path1"
   sodipodi:nodetypes="cccccccccccc" />
</svg>
