<?xml version="1.0"?><!DOCTYPE svg PUBLIC "-//W3C//DTD SVG 1.1//EN" "http://www.w3.org/Graphics/SVG/1.1/DTD/svg11.dtd"><svg xmlns="http://www.w3.org/2000/svg" xmlns:xlink="http://www.w3.org/1999/xlink" width="350" height="1000" viewBox="0 0 10 26" >
            
                ['<path class="dot" d="M 2.5195833333333333,14.140270833333332 L 2.5195833333333333,14.140270833333332 C 2.2295833333333333,13.850270833333333 1.7800833333333332,13.850270833333333 1.4900833333333332,14.140270833333332 L 1.1130833333333332,14.517270833333333 C 0.8230833333333332,14.807270833333334 0.8230833333333331,15.256770833333333 1.1130833333333332,15.546770833333333 L 1.5045833333333332,15.938270833333332 C 1.794583333333333,16.228270833333333 2.244083333333333,16.228270833333333 2.5340833333333332,15.938270833333332 L 2.9110833333333335,15.546770833333333 C 3.2010833333333335,15.256770833333333 3.2010833333333335,14.807270833333334 2.9110833333333335,14.517270833333333 L 2.5195833333333333,14.140270833333332" stroke-linejoin="round"/>', '<path class="dot" d="M 2.5195833333333333,0.1402708333333331 L 2.5195833333333333,0.1402708333333331 C 2.2295833333333333,-0.14972916666666694 1.7800833333333332,-0.149729166666667 1.4900833333333332,0.1402708333333331 L 1.1130833333333332,0.5172708333333332 C 0.8230833333333332,0.8072708333333332 0.8230833333333331,1.2567708333333332 1.1130833333333332,1.5467708333333332 L 1.5045833333333332,1.938270833333333 C 1.794583333333333,2.228270833333333 2.244083333333333,2.228270833333333 2.5340833333333332,1.938270833333333 L 2.9110833333333335,1.5467708333333332 C 3.2010833333333335,1.2567708333333332 3.2010833333333335,0.8072708333333333 2.9110833333333335,0.5172708333333331 L 2.5195833333333333,0.14027083333333312" stroke-linejoin="round"/>']
            
                ['<path class="dot" d="M 2.5195838333332934,0.140260033333333 L 2.519583833333293,0.140260033333333 C 2.2295838333332934,-0.14973996666666703 1.7800838333332933,-0.14973996666666708 1.4900838333332933,0.140260033333333 L 1.1130838333332933,0.5172600333333331 C 0.8230838333332933,0.8072600333333331 0.8230838333332932,1.256760033333333 1.1130838333332933,1.5467600333333331 L 1.5045838333332933,1.9382600333333329 C 1.794583833333293,2.228260033333333 2.2440838333332933,2.228260033333333 2.534083833333293,1.9382600333333329 L 2.9110838333332936,1.5467600333333331 C 3.2010838333332936,1.256760033333333 3.2010838333332936,0.8072600333333332 2.9110838333332936,0.517260033333333 L 2.519583833333294,0.14026003333333303" stroke-linejoin="round"/>', '<path class="dot" d="M 5.519583633333333,0.14027128333233294 L 5.519583633333333,0.14027128333233294 C 5.229583633333333,-0.1497287166676671 4.780083633333333,-0.14972871666766716 4.490083633333333,0.14027128333233294 L 4.113083633333333,0.5172712833323331 C 3.823083633333333,0.807271283332333 3.823083633333333,1.256771283332333 4.113083633333333,1.546771283332333 L 4.504583633333333,1.9382712833323328 C 4.794583633333333,2.228271283332333 5.244083633333333,2.228271283332333 5.534083633333333,1.9382712833323328 L 5.911083633333334,1.546771283332333 C 6.201083633333333,1.256771283332333 6.201083633333333,0.8072712833323331 5.911083633333334,0.517271283332333 L 5.519583633333333,0.14027128333233296" stroke-linejoin="round"/>', '<path class="dot" d="M 7.5195834333333345,1.1402712333333334 L 7.519583433333334,1.1402712333333334 C 7.2295834333333335,0.8502712333333333 6.780083433333334,0.8502712333333332 6.490083433333334,1.1402712333333334 L 6.113083433333334,1.5172712333333336 C 5.823083433333334,1.8072712333333334 5.823083433333334,2.2567712333333336 6.113083433333334,2.5467712333333337 L 6.504583433333334,2.9382712333333334 C 6.794583433333334,3.2282712333333334 7.2440834333333335,3.2282712333333334 7.5340834333333335,2.9382712333333334 L 7.911083433333334,2.5467712333333337 C 8.201083433333334,2.2567712333333336 8.201083433333334,1.8072712333333336 7.911083433333334,1.5172712333333334 L 7.5195834333333345,1.1402712333333334" stroke-linejoin="round"/>', '<path class="dot" d="M 8.519583333333333,2.140271133333333 L 8.519583333333333,2.140271133333333 C 8.229583333333332,1.850271133333333 7.780083333333333,1.850271133333333 7.490083333333333,2.140271133333333 L 7.113083333333333,2.5172711333333333 C 6.823083333333333,2.807271133333333 6.823083333333333,3.2567711333333333 7.113083333333333,3.5467711333333334 L 7.504583333333333,3.938271133333333 C 7.794583333333333,4.228271133333333 8.244083333333332,4.228271133333333 8.534083333333333,3.938271133333333 L 8.911083333333334,3.5467711333333334 C 9.201083333333333,3.2567711333333333 9.201083333333333,2.8072711333333333 8.911083333333334,2.517271133333333 L 8.519583333333333,2.140271133333333" stroke-linejoin="round"/>', '<path class="dot" d="M 8.519583333333333,4.140270933333333 L 8.519583333333333,4.140270933333333 C 8.229583333333332,3.850270933333333 7.780083333333333,3.850270933333333 7.490083333333333,4.140270933333333 L 7.113083333333333,4.517270933333333 C 6.823083333333333,4.807270933333333 6.823083333333333,5.256770933333334 7.113083333333333,5.546770933333333 L 7.504583333333333,5.9382709333333334 C 7.794583333333333,6.228270933333333 8.244083333333332,6.228270933333333 8.534083333333333,5.9382709333333334 L 8.911083333333334,5.546770933333333 C 9.201083333333333,5.256770933333334 9.201083333333333,4.807270933333333 8.911083333333334,4.517270933333333 L 8.519583333333333,4.140270933333333" stroke-linejoin="round"/>', '<path class="dot" d="M 7.5195834333333345,5.140270833333333 L 7.519583433333334,5.140270833333333 C 7.2295834333333335,4.850270833333333 6.780083433333334,4.850270833333333 6.490083433333334,5.140270833333333 L 6.113083433333334,5.517270833333333 C 5.823083433333334,5.807270833333333 5.823083433333334,6.2567708333333325 6.113083433333334,6.546770833333333 L 6.504583433333334,6.938270833333332 C 6.794583433333334,7.228270833333333 7.2440834333333335,7.228270833333333 7.5340834333333335,6.938270833333332 L 7.911083433333334,6.546770833333333 C 8.201083433333334,6.2567708333333325 8.201083433333334,5.807270833333333 7.911083433333334,5.517270833333333 L 7.5195834333333345,5.140270833333333" stroke-linejoin="round"/>', '<path class="dot" d="M 5.519583633333333,6.140270833333333 L 5.519583633333333,6.140270833333333 C 5.229583633333333,5.850270833333333 4.780083633333333,5.850270833333333 4.490083633333333,6.140270833333333 L 4.113083633333333,6.517270833333333 C 3.823083633333333,6.807270833333333 3.823083633333333,7.2567708333333325 4.113083633333333,7.546770833333333 L 4.504583633333333,7.938270833333332 C 4.794583633333333,8.228270833333333 5.244083633333333,8.228270833333333 5.534083633333333,7.938270833333332 L 5.911083633333334,7.546770833333333 C 6.201083633333333,7.2567708333333325 6.201083633333333,6.807270833333333 5.911083633333334,6.517270833333333 L 5.519583633333333,6.140270833333333" stroke-linejoin="round"/>', '<path class="dot" d="M 2.5195833333333333,6.140270533333333 L 2.5195833333333333,6.140270533333333 C 2.2295833333333333,5.850270533333333 1.7800833333333332,5.850270533333333 1.4900833333333332,6.140270533333333 L 1.1130833333333332,6.517270533333333 C 0.8230833333333332,6.807270533333333 0.8230833333333331,7.2567705333333326 1.1130833333333332,7.5467705333333335 L 1.5045833333333332,7.938270533333332 C 1.794583333333333,8.228270533333333 2.244083333333333,8.228270533333333 2.5340833333333332,7.938270533333332 L 2.9110833333333335,7.5467705333333335 C 3.2010833333333335,7.2567705333333326 3.2010833333333335,6.807270533333333 2.9110833333333335,6.517270533333333 L 2.5195833333333333,6.140270533333333" stroke-linejoin="round"/>']
            
                ['<path class="dot" d="M 5.519583333333333,6.140270833333333 L 5.519583333333333,6.140270833333333 C 5.229583333333333,5.850270833333333 4.780083333333333,5.850270833333333 4.490083333333333,6.140270833333333 L 4.113083333333333,6.517270833333333 C 3.823083333333333,6.807270833333333 3.823083333333333,7.2567708333333325 4.113083333333333,7.546770833333333 L 4.504583333333333,7.938270833333332 C 4.794583333333333,8.228270833333333 5.244083333333333,8.228270833333333 5.534083333333333,7.938270833333332 L 5.911083333333334,7.546770833333333 C 6.201083333333333,7.2567708333333325 6.201083333333333,6.807270833333333 5.911083333333334,6.517270833333333 L 5.519583333333333,6.140270833333333" stroke-linejoin="round"/>', '<path class="dot" d="M 8.519583333333333,14.140270833333332 L 8.519583333333333,14.140270833333332 C 8.229583333333332,13.850270833333333 7.780083333333333,13.850270833333333 7.490083333333333,14.140270833333332 L 7.113083333333333,14.517270833333333 C 6.823083333333333,14.807270833333334 6.823083333333333,15.256770833333333 7.113083333333333,15.546770833333333 L 7.504583333333333,15.938270833333332 C 7.794583333333333,16.228270833333333 8.244083333333332,16.228270833333333 8.534083333333333,15.938270833333332 L 8.911083333333334,15.546770833333333 C 9.201083333333333,15.256770833333333 9.201083333333333,14.807270833333334 8.911083333333334,14.517270833333333 L 8.519583333333333,14.140270833333332" stroke-linejoin="round"/>']
            
            
            <path d="M 2.0,15.0 L 2.0,1.0" fill="none"
            stroke="black"
            stroke-width="1.5"
            stroke-linecap="round"
            stroke-linejoin="round"
            />
            
            <path d="M 2.00000049999996,0.9999891999999999 L 5.0000003,1.0000004499989998 L 7.0000001,2.0000004000000002 L 8.0,3.0000003 L 8.0,5.0000001 L 7.0000001,6.0 L 5.0000003,7.0 L 2.0,6.9999997" fill="none"
            stroke="black"
            stroke-width="1.5"
            stroke-linecap="round"
            stroke-linejoin="round"
            />
            
            <path d="M 5.0,7.0 L 8.0,15.0" fill="none"
            stroke="black"
            stroke-width="1.5"
            stroke-linecap="round"
            stroke-linejoin="round"
            />
            
            
        </svg>