<?xml version="1.0"?><!DOCTYPE svg PUBLIC "-//W3C//DTD SVG 1.1//EN" "http://www.w3.org/Graphics/SVG/1.1/DTD/svg11.dtd"><svg xmlns="http://www.w3.org/2000/svg" xmlns:xlink="http://www.w3.org/1999/xlink" width="350" height="1000" viewBox="0 0 7 17" >
            
                ['<path class="dot" d="M 0.885,4.3180000000000005 L 0.8849999999999998,4.3180000000000005 C 0.6649999999999998,4.098000000000001 0.32399999999999984,4.098000000000001 0.10399999999999981,4.3180000000000005 L -0.1820000000000002,4.604000000000001 C -0.40200000000000025,4.824000000000001 -0.40200000000000025,5.165000000000001 -0.1820000000000002,5.385000000000001 L 0.11499999999999977,5.682 C 0.33499999999999974,5.902 0.6759999999999999,5.902 0.8959999999999997,5.682 L 1.1820000000000002,5.385000000000001 C 1.4020000000000001,5.165000000000001 1.4020000000000001,4.824000000000001 1.1820000000000002,4.604000000000001 L 0.885,4.3180000000000005" stroke-linejoin="round"/>', '<path class="dot" d="M 0.885,9.318 L 0.8849999999999998,9.318 C 0.6649999999999998,9.098 0.32399999999999984,9.098 0.10399999999999981,9.318 L -0.1820000000000002,9.604000000000001 C -0.40200000000000025,9.824 -0.40200000000000025,10.165000000000001 -0.1820000000000002,10.385000000000002 L 0.11499999999999977,10.682 C 0.33499999999999974,10.902000000000001 0.6759999999999999,10.902000000000001 0.8959999999999997,10.682 L 1.1820000000000002,10.385000000000002 C 1.4020000000000001,10.165000000000001 1.4020000000000001,9.824 1.1820000000000002,9.604000000000001 L 0.885,9.318000000000001" stroke-linejoin="round"/>', '<path class="dot" d="M 1.885,10.318 L 1.8849999999999998,10.318 C 1.6649999999999998,10.098 1.3239999999999998,10.098 1.1039999999999999,10.318 L 0.8179999999999998,10.604000000000001 C 0.5979999999999998,10.824 0.5979999999999998,11.165000000000001 0.8179999999999998,11.385000000000002 L 1.1149999999999998,11.682 C 1.3349999999999997,11.902000000000001 1.676,11.902000000000001 1.8959999999999997,11.682 L 2.1820000000000004,11.385000000000002 C 2.402,11.165000000000001 2.402,10.824 2.1820000000000004,10.604000000000001 L 1.885,10.318000000000001" stroke-linejoin="round"/>', '<path class="dot" d="M 5.885,10.318 L 5.885,10.318 C 5.664999999999999,10.098 5.324,10.098 5.103999999999999,10.318 L 4.818,10.604000000000001 C 4.598,10.824 4.598,11.165000000000001 4.818,11.385000000000002 L 5.114999999999999,11.682 C 5.334999999999999,11.902000000000001 5.676,11.902000000000001 5.895999999999999,11.682 L 6.182,11.385000000000002 C 6.402,11.165000000000001 6.402,10.824 6.182,10.604000000000001 L 5.885,10.318000000000001" stroke-linejoin="round"/>', '<path class="dot" d="M 6.885,9.318 L 6.885,9.318 C 6.664999999999999,9.098 6.324,9.098 6.103999999999999,9.318 L 5.818,9.604000000000001 C 5.598,9.824 5.598,10.165000000000001 5.818,10.385000000000002 L 6.114999999999999,10.682 C 6.334999999999999,10.902000000000001 6.676,10.902000000000001 6.895999999999999,10.682 L 7.182,10.385000000000002 C 7.402,10.165000000000001 7.402,9.824 7.182,9.604000000000001 L 6.885,9.318000000000001" stroke-linejoin="round"/>', '<path class="dot" d="M 6.885,4.3180000000000005 L 6.885,4.3180000000000005 C 6.664999999999999,4.098000000000001 6.324,4.098000000000001 6.103999999999999,4.3180000000000005 L 5.818,4.604000000000001 C 5.598,4.824000000000001 5.598,5.165000000000001 5.818,5.385000000000001 L 6.114999999999999,5.682 C 6.334999999999999,5.902 6.676,5.902 6.895999999999999,5.682 L 7.182,5.385000000000001 C 7.402,5.165000000000001 7.402,4.824000000000001 7.182,4.604000000000001 L 6.885,4.3180000000000005" stroke-linejoin="round"/>', '<path class="dot" d="M 5.885,3.318 L 5.885,3.318 C 5.664999999999999,3.098 5.324,3.098 5.103999999999999,3.318 L 4.818,3.604 C 4.598,3.8240000000000003 4.598,4.165 4.818,4.385 L 5.114999999999999,4.682 C 5.334999999999999,4.902 5.676,4.902 5.895999999999999,4.682 L 6.182,4.385 C 6.402,4.165 6.402,3.8240000000000003 6.182,3.604 L 5.885,3.318" stroke-linejoin="round"/>', '<path class="dot" d="M 1.885,3.318 L 1.8849999999999998,3.318 C 1.6649999999999998,3.098 1.3239999999999998,3.098 1.1039999999999999,3.318 L 0.8179999999999998,3.604 C 0.5979999999999998,3.8240000000000003 0.5979999999999998,4.165 0.8179999999999998,4.385 L 1.1149999999999998,4.682 C 1.3349999999999997,4.902 1.676,4.902 1.8959999999999997,4.682 L 2.1820000000000004,4.385 C 2.402,4.165 2.402,3.8240000000000003 2.1820000000000004,3.604 L 1.885,3.318" stroke-linejoin="round"/>', '<path class="dot" d="M 4.885,5.3180000000000005 L 4.885,5.3180000000000005 C 4.664999999999999,5.098000000000001 4.324,5.098000000000001 4.103999999999999,5.3180000000000005 L 3.8179999999999996,5.604000000000001 C 3.5979999999999994,5.824000000000001 3.5979999999999994,6.165000000000001 3.8179999999999996,6.385000000000001 L 4.114999999999999,6.682 C 4.334999999999999,6.902 4.676,6.902 4.895999999999999,6.682 L 5.182,6.385000000000001 C 5.402,6.165000000000001 5.402,5.824000000000001 5.182,5.604000000000001 L 4.885,5.3180000000000005" stroke-linejoin="round"/>', '<path class="dot" d="M 3.885,5.3180000000000005 L 3.885,5.3180000000000005 C 3.6649999999999996,5.098000000000001 3.324,5.098000000000001 3.1039999999999996,5.3180000000000005 L 2.8179999999999996,5.604000000000001 C 2.5979999999999994,5.824000000000001 2.5979999999999994,6.165000000000001 2.8179999999999996,6.385000000000001 L 3.1149999999999993,6.682 C 3.3349999999999995,6.902 3.6759999999999997,6.902 3.8959999999999995,6.682 L 4.182,6.385000000000001 C 4.402,6.165000000000001 4.402,5.824000000000001 4.182,5.604000000000001 L 3.885,5.3180000000000005" stroke-linejoin="round"/>', '<path class="dot" d="M 2.885,6.3180000000000005 L 2.885,6.3180000000000005 C 2.665,6.098000000000001 2.324,6.098000000000001 2.1039999999999996,6.3180000000000005 L 1.8179999999999998,6.604000000000001 C 1.5979999999999999,6.824000000000001 1.5979999999999996,7.165000000000001 1.8179999999999998,7.385000000000001 L 2.1149999999999998,7.682 C 2.335,7.902 2.676,7.902 2.896,7.682 L 3.1820000000000004,7.385000000000001 C 3.402,7.165000000000001 3.402,6.824000000000001 3.1820000000000004,6.604000000000001 L 2.885,6.3180000000000005" stroke-linejoin="round"/>', '<path class="dot" d="M 2.885,7.3180000000000005 L 2.885,7.3180000000000005 C 2.665,7.098000000000001 2.324,7.098000000000001 2.1039999999999996,7.3180000000000005 L 1.8179999999999998,7.604000000000001 C 1.5979999999999999,7.824000000000001 1.5979999999999996,8.165000000000001 1.8179999999999998,8.385000000000002 L 2.1149999999999998,8.682 C 2.335,8.902000000000001 2.676,8.902000000000001 2.896,8.682 L 3.1820000000000004,8.385000000000002 C 3.402,8.165000000000001 3.402,7.824000000000001 3.1820000000000004,7.604000000000001 L 2.885,7.3180000000000005" stroke-linejoin="round"/>', '<path class="dot" d="M 3.885,8.318 L 3.885,8.318 C 3.6649999999999996,8.098 3.324,8.098 3.1039999999999996,8.318 L 2.8179999999999996,8.604000000000001 C 2.5979999999999994,8.824 2.5979999999999994,9.165000000000001 2.8179999999999996,9.385000000000002 L 3.1149999999999993,9.682 C 3.3349999999999995,9.902000000000001 3.6759999999999997,9.902000000000001 3.8959999999999995,9.682 L 4.182,9.385000000000002 C 4.402,9.165000000000001 4.402,8.824 4.182,8.604000000000001 L 3.885,8.318000000000001" stroke-linejoin="round"/>', '<path class="dot" d="M 4.885,8.318 L 4.885,8.318 C 4.664999999999999,8.098 4.324,8.098 4.103999999999999,8.318 L 3.8179999999999996,8.604000000000001 C 3.5979999999999994,8.824 3.5979999999999994,9.165000000000001 3.8179999999999996,9.385000000000002 L 4.114999999999999,9.682 C 4.334999999999999,9.902000000000001 4.676,9.902000000000001 4.895999999999999,9.682 L 5.182,9.385000000000002 C 5.402,9.165000000000001 5.402,8.824 5.182,8.604000000000001 L 4.885,8.318000000000001" stroke-linejoin="round"/>']
            
            
            <path d="M 0.5,5.0 L 0.5,10.0 L 1.5,11.0 L 5.5,11.0 L 6.5,10.0 L 6.5,5.0 L 5.5,4.0 L 1.5,4.0 L 0.5,5.0 M 4.5,6.0 L 3.5,6.0 L 2.5,7.0 L 2.5,8.0 L 3.5,9.0 L 4.5,9.0" fill="none"
            stroke="black"
            stroke-width="1"
            stroke-linecap="round"
            stroke-linejoin="round"
            />
            
            
        </svg>