<?xml version="1.0"?><!DOCTYPE svg PUBLIC "-//W3C//DTD SVG 1.1//EN" "http://www.w3.org/Graphics/SVG/1.1/DTD/svg11.dtd"><svg xmlns="http://www.w3.org/2000/svg" xmlns:xlink="http://www.w3.org/1999/xlink" width="350" height="1000" viewBox="0 0 7 17" >
            
                ['<path class="dot" d="M 1.885,0.31800000000000006 L 1.8849999999999998,0.31800000000000006 C 1.6649999999999998,0.09799999999999998 1.3239999999999998,0.09799999999999995 1.1039999999999999,0.31800000000000006 L 0.8179999999999998,0.6040000000000002 C 0.5979999999999998,0.8240000000000002 0.5979999999999998,1.1650000000000003 0.8179999999999998,1.3850000000000002 L 1.1149999999999998,1.682 C 1.3349999999999997,1.902 1.676,1.902 1.8959999999999997,1.682 L 2.1820000000000004,1.3850000000000002 C 2.402,1.165 2.402,0.8240000000000002 2.1820000000000004,0.6040000000000001 L 1.885,0.31800000000000006" stroke-linejoin="round"/>', '<path class="dot" d="M 1.885,10.318 L 1.8849999999999998,10.318 C 1.6649999999999998,10.098 1.3239999999999998,10.098 1.1039999999999999,10.318 L 0.8179999999999998,10.604000000000001 C 0.5979999999999998,10.824 0.5979999999999998,11.165000000000001 0.8179999999999998,11.385000000000002 L 1.1149999999999998,11.682 C 1.3349999999999997,11.902000000000001 1.676,11.902000000000001 1.8959999999999997,11.682 L 2.1820000000000004,11.385000000000002 C 2.402,11.165000000000001 2.402,10.824 2.1820000000000004,10.604000000000001 L 1.885,10.318000000000001" stroke-linejoin="round"/>']
            
                ['<path class="dot" d="M 1.885,0.31800000000000006 L 1.8849999999999998,0.31800000000000006 C 1.6649999999999998,0.09799999999999998 1.3239999999999998,0.09799999999999995 1.1039999999999999,0.31800000000000006 L 0.8179999999999998,0.6040000000000002 C 0.5979999999999998,0.8240000000000002 0.5979999999999998,1.1650000000000003 0.8179999999999998,1.3850000000000002 L 1.1149999999999998,1.682 C 1.3349999999999997,1.902 1.676,1.902 1.8959999999999997,1.682 L 2.1820000000000004,1.3850000000000002 C 2.402,1.165 2.402,0.8240000000000002 2.1820000000000004,0.6040000000000001 L 1.885,0.31800000000000006" stroke-linejoin="round"/>', '<path class="dot" d="M 5.885,0.31800000000000006 L 5.885,0.31800000000000006 C 5.664999999999999,0.09799999999999998 5.324,0.09799999999999995 5.103999999999999,0.31800000000000006 L 4.818,0.6040000000000002 C 4.598,0.8240000000000002 4.598,1.1650000000000003 4.818,1.3850000000000002 L 5.114999999999999,1.682 C 5.334999999999999,1.902 5.676,1.902 5.895999999999999,1.682 L 6.182,1.3850000000000002 C 6.402,1.165 6.402,0.8240000000000002 6.182,0.6040000000000001 L 5.885,0.31800000000000006" stroke-linejoin="round"/>']
            
                ['<path class="dot" d="M 1.885,5.3180000000000005 L 1.8849999999999998,5.3180000000000005 C 1.6649999999999998,5.098000000000001 1.3239999999999998,5.098000000000001 1.1039999999999999,5.3180000000000005 L 0.8179999999999998,5.604000000000001 C 0.5979999999999998,5.824000000000001 0.5979999999999998,6.165000000000001 0.8179999999999998,6.385000000000001 L 1.1149999999999998,6.682 C 1.3349999999999997,6.902 1.676,6.902 1.8959999999999997,6.682 L 2.1820000000000004,6.385000000000001 C 2.402,6.165000000000001 2.402,5.824000000000001 2.1820000000000004,5.604000000000001 L 1.885,5.3180000000000005" stroke-linejoin="round"/>', '<path class="dot" d="M 5.885,5.3180000000000005 L 5.885,5.3180000000000005 C 5.664999999999999,5.098000000000001 5.324,5.098000000000001 5.103999999999999,5.3180000000000005 L 4.818,5.604000000000001 C 4.598,5.824000000000001 4.598,6.165000000000001 4.818,6.385000000000001 L 5.114999999999999,6.682 C 5.334999999999999,6.902 5.676,6.902 5.895999999999999,6.682 L 6.182,6.385000000000001 C 6.402,6.165000000000001 6.402,5.824000000000001 6.182,5.604000000000001 L 5.885,5.3180000000000005" stroke-linejoin="round"/>']
            
                ['<path class="dot" d="M 1.885,10.318 L 1.8849999999999998,10.318 C 1.6649999999999998,10.098 1.3239999999999998,10.098 1.1039999999999999,10.318 L 0.8179999999999998,10.604000000000001 C 0.5979999999999998,10.824 0.5979999999999998,11.165000000000001 0.8179999999999998,11.385000000000002 L 1.1149999999999998,11.682 C 1.3349999999999997,11.902000000000001 1.676,11.902000000000001 1.8959999999999997,11.682 L 2.1820000000000004,11.385000000000002 C 2.402,11.165000000000001 2.402,10.824 2.1820000000000004,10.604000000000001 L 1.885,10.318000000000001" stroke-linejoin="round"/>', '<path class="dot" d="M 5.885,10.318 L 5.885,10.318 C 5.664999999999999,10.098 5.324,10.098 5.103999999999999,10.318 L 4.818,10.604000000000001 C 4.598,10.824 4.598,11.165000000000001 4.818,11.385000000000002 L 5.114999999999999,11.682 C 5.334999999999999,11.902000000000001 5.676,11.902000000000001 5.895999999999999,11.682 L 6.182,11.385000000000002 C 6.402,11.165000000000001 6.402,10.824 6.182,10.604000000000001 L 5.885,10.318000000000001" stroke-linejoin="round"/>']
            
                ['<path class="dot" d="M 4.784493761833731,-1.5179887256814055 L 4.784493761833731,-1.5179887256814055 C 4.564493761833731,-1.7379887256814057 4.223493761833731,-1.7379887256814057 4.00349376183373,-1.5179887256814055 L 3.7174937618337305,-1.2319887256814055 C 3.4974937618337303,-1.0119887256814053 3.4974937618337303,-0.6709887256814053 3.7174937618337305,-0.45098872568140536 L 4.01449376183373,-0.15398872568140565 C 4.234493761833731,0.06601127431859433 4.57549376183373,0.06601127431859433 4.795493761833731,-0.15398872568140565 L 5.08149376183373,-0.45098872568140536 C 5.301493761833731,-0.6709887256814056 5.301493761833731,-1.0119887256814053 5.08149376183373,-1.2319887256814055 L 4.784493761833731,-1.5179887256814055" stroke-linejoin="round"/>', '<path class="dot" d="M 2.985506238166269,-2.8460112743185944 L 2.985506238166269,-2.8460112743185944 C 2.765506238166269,-3.0660112743185945 2.424506238166269,-3.0660112743185945 2.204506238166269,-2.8460112743185944 L 1.918506238166269,-2.5600112743185943 C 1.698506238166269,-2.340011274318594 1.6985062381662688,-1.9990112743185942 1.918506238166269,-1.7790112743185942 L 2.215506238166269,-1.4820112743185945 C 2.435506238166269,-1.2620112743185945 2.7765062381662693,-1.2620112743185945 2.996506238166269,-1.4820112743185945 L 3.2825062381662695,-1.7790112743185942 C 3.5025062381662693,-1.9990112743185944 3.5025062381662693,-2.340011274318594 3.2825062381662695,-2.5600112743185943 L 2.985506238166269,-2.8460112743185944" stroke-linejoin="round"/>']
            
            
            <path d="M 1.5,1.0 L 1.5,11.0" fill="none"
            stroke="black"
            stroke-width="1"
            stroke-linecap="round"
            stroke-linejoin="round"
            />
            
            <path d="M 1.5,1.0 L 5.5,1.0" fill="none"
            stroke="black"
            stroke-width="1"
            stroke-linecap="round"
            stroke-linejoin="round"
            />
            
            <path d="M 1.5,6.0 L 5.5,6.0" fill="none"
            stroke="black"
            stroke-width="1"
            stroke-linecap="round"
            stroke-linejoin="round"
            />
            
            <path d="M 1.5,11.0 L 5.5,11.0" fill="none"
            stroke="black"
            stroke-width="1"
            stroke-linecap="round"
            stroke-linejoin="round"
            />
            
            <path d="M 4.399493761833731,-0.8359887256814056 L 2.600506238166269,-2.1640112743185944" fill="none"
            stroke="black"
            stroke-width="1"
            stroke-linecap="round"
            stroke-linejoin="round"
            />
            
            
        </svg>