<?xml version="1.0"?><!DOCTYPE svg PUBLIC "-//W3C//DTD SVG 1.1//EN" "http://www.w3.org/Graphics/SVG/1.1/DTD/svg11.dtd"><svg xmlns="http://www.w3.org/2000/svg" xmlns:xlink="http://www.w3.org/1999/xlink" width="350" height="1000" viewBox="0 0 14 40" >
            
                ['<path class="dot" d="M 1.7909438775510205,-0.22280612244898207 L 1.7909438775510196,-0.22280612244898207 C 1.3409438775510198,-0.6728061224489821 0.6434438775510198,-0.6728061224489822 0.19344387755102,-0.22280612244898207 L -0.39155612244898,0.3621938775510183 C -0.84155612244898,0.8121938775510182 -0.8415561224489801,1.5096938775510182 -0.39155612244898,1.9596938775510184 L 0.21594387755101985,2.567193877551018 C 0.6659438775510198,3.0171938775510174 1.3634438775510198,3.0171938775510174 1.8134438775510195,2.567193877551018 L 2.3984438775510206,1.9596938775510184 C 2.84844387755102,1.5096938775510182 2.84844387755102,0.8121938775510182 2.3984438775510206,0.36219387755101806 L 1.7909438775510205,-0.2228061224489819" stroke-linejoin="round"/>', '<path class="dot" d="M 13.790943877551019,-0.22280612244898207 L 13.790943877551019,-0.22280612244898207 C 13.34094387755102,-0.6728061224489821 12.64344387755102,-0.6728061224489822 12.193443877551019,-0.22280612244898207 L 11.60844387755102,0.3621938775510183 C 11.158443877551019,0.8121938775510182 11.158443877551019,1.5096938775510182 11.60844387755102,1.9596938775510184 L 12.21594387755102,2.567193877551018 C 12.665943877551019,3.0171938775510174 13.363443877551019,3.0171938775510174 13.81344387755102,2.567193877551018 L 14.39844387755102,1.9596938775510184 C 14.84844387755102,1.5096938775510182 14.84844387755102,0.8121938775510182 14.39844387755102,0.36219387755101806 L 13.790943877551019,-0.2228061224489819" stroke-linejoin="round"/>', '<path class="dot" d="M 7.790943977551021,20.777193877551017 L 7.79094397755102,20.777193877551017 C 7.340943977551021,20.327193877551018 6.64344397755102,20.327193877551018 6.193443977551021,20.777193877551017 L 5.608443977551021,21.362193877551018 C 5.158443977551021,21.812193877551017 5.158443977551021,22.50969387755102 5.608443977551021,22.959693877551018 L 6.215943977551021,23.56719387755102 C 6.66594397755102,24.01719387755102 7.36344397755102,24.01719387755102 7.81344397755102,23.56719387755102 L 8.398443977551022,22.959693877551018 C 8.848443977551021,22.50969387755102 8.848443977551021,21.812193877551017 8.398443977551022,21.362193877551018 L 7.790943977551021,20.777193877551017" stroke-linejoin="round"/>']
            
            
            <path d="M 1.0,1.0 L 7.0000001,22.0 M 13.0,1.0 L 7.0000001,22.0" fill="none"
            stroke="black"
            stroke-width="2.5"
            stroke-linecap="round"
            stroke-linejoin="round"
            />
            
            
        </svg>