<?xml version="1.0"?><!DOCTYPE svg PUBLIC "-//W3C//DTD SVG 1.1//EN" "http://www.w3.org/Graphics/SVG/1.1/DTD/svg11.dtd"><svg xmlns="http://www.w3.org/2000/svg" xmlns:xlink="http://www.w3.org/1999/xlink" width="350" height="1000" viewBox="0 0 10 26" >
            
                ['<path class="dot" d="M 6.519583333333333,14.140270315873073 L 6.519583333333332,14.140270315873073 C 6.229583333333332,13.850270315873074 5.780083333333333,13.850270315873074 5.490083333333333,14.140270315873073 L 5.113083333333333,14.517270315873073 C 4.823083333333333,14.807270315873073 4.823083333333333,15.256770315873073 5.113083333333333,15.546770315873074 L 5.504583333333333,15.938270315873073 C 5.794583333333333,16.228270315873072 6.244083333333332,16.228270315873072 6.534083333333332,15.938270315873073 L 6.911083333333333,15.546770315873074 C 7.201083333333333,15.256770315873073 7.201083333333333,14.807270315873074 6.911083333333333,14.517270315873073 L 6.519583333333333,14.140270315873073" stroke-linejoin="round"/>', '<path class="dot" d="M 6.519583333333333,0.14027079841281284 L 6.519583333333332,0.14027079841281284 C 6.229583333333332,-0.1497292015871872 5.780083333333333,-0.14972920158718725 5.490083333333333,0.14027079841281284 L 5.113083333333333,0.517270798412813 C 4.823083333333333,0.8072707984128129 4.823083333333333,1.256770798412813 5.113083333333333,1.546770798412813 L 5.504583333333333,1.9382707984128127 C 5.794583333333333,2.2282707984128125 6.244083333333332,2.2282707984128125 6.534083333333332,1.9382707984128127 L 6.911083333333333,1.546770798412813 C 7.201083333333333,1.256770798412813 7.201083333333333,0.807270798412813 6.911083333333333,0.5172707984128129 L 6.519583333333333,0.14027079841281287" stroke-linejoin="round"/>', '<path class="dot" d="M 2.5195833333333333,9.140270815873071 L 2.5195833333333333,9.140270815873071 C 2.2295833333333333,8.850270815873072 1.7800833333333332,8.850270815873072 1.4900833333333332,9.140270815873071 L 1.1130833333333332,9.517270815873072 C 0.8230833333333332,9.807270815873071 0.8230833333333331,10.256770815873072 1.1130833333333332,10.546770815873073 L 1.5045833333333332,10.938270815873071 C 1.794583333333333,11.228270815873072 2.244083333333333,11.228270815873072 2.5340833333333332,10.938270815873071 L 2.9110833333333335,10.546770815873073 C 3.2010833333333335,10.256770815873072 3.2010833333333335,9.807270815873073 2.9110833333333335,9.517270815873072 L 2.5195833333333333,9.140270815873071" stroke-linejoin="round"/>', '<path class="dot" d="M 8.519583333333333,9.140270815873071 L 8.519583333333333,9.140270815873071 C 8.229583333333332,8.850270815873072 7.780083333333333,8.850270815873072 7.490083333333333,9.140270815873071 L 7.113083333333333,9.517270815873072 C 6.823083333333333,9.807270815873071 6.823083333333333,10.256770815873072 7.113083333333333,10.546770815873073 L 7.504583333333333,10.938270815873071 C 7.794583333333333,11.228270815873072 8.244083333333332,11.228270815873072 8.534083333333333,10.938270815873071 L 8.911083333333334,10.546770815873073 C 9.201083333333333,10.256770815873072 9.201083333333333,9.807270815873073 8.911083333333334,9.517270815873072 L 8.519583333333333,9.140270815873071" stroke-linejoin="round"/>']
            
            
            <path d="M 6.0,14.99999948253974 L 6.0,0.9999999650794797 L 2.0,9.99999998253974 L 8.0,9.99999998253974" fill="none"
            stroke="black"
            stroke-width="1.5"
            stroke-linecap="round"
            stroke-linejoin="round"
            />
            
            
        </svg>