<?xml version="1.0"?><!DOCTYPE svg PUBLIC "-//W3C//DTD SVG 1.1//EN" "http://www.w3.org/Graphics/SVG/1.1/DTD/svg11.dtd"><svg xmlns="http://www.w3.org/2000/svg" xmlns:xlink="http://www.w3.org/1999/xlink" width="350" height="1000" viewBox="0 0 7 17" >
            
                ['<path class="dot" d="M 0.38499995000000076,3.31800028 L 0.38499995000000053,3.31800028 C 0.16499995000000056,3.09800028 -0.1760000499999994,3.09800028 -0.39600004999999944,3.31800028 L -0.6820000499999994,3.60400028 C -0.9020000499999995,3.8240002800000004 -0.9020000499999995,4.16500028 -0.6820000499999994,4.38500028 L -0.3850000499999995,4.6820002800000005 C -0.1650000499999995,4.90200028 0.17599995000000068,4.90200028 0.39599995000000043,4.6820002800000005 L 0.6819999500000009,4.38500028 C 0.9019999500000009,4.16500028 0.9019999500000009,3.8240002800000004 0.6819999500000009,3.60400028 L 0.38499995000000076,3.31800028" stroke-linejoin="round"/>', '<path class="dot" d="M 1.3849999500000008,10.318000009999999 L 1.3849999500000005,10.318000009999999 C 1.1649999500000006,10.09800001 0.8239999500000006,10.09800001 0.6039999500000006,10.318000009999999 L 0.3179999500000006,10.60400001 C 0.0979999500000005,10.824000009999999 0.09799995000000047,11.16500001 0.3179999500000006,11.385000009999999 L 0.6149999500000005,11.68200001 C 0.8349999500000005,11.90200001 1.1759999500000007,11.90200001 1.3959999500000004,11.68200001 L 1.681999950000001,11.385000009999999 C 1.9019999500000009,11.16500001 1.9019999500000009,10.824000009999999 1.681999950000001,10.60400001 L 1.3849999500000008,10.318000009999999" stroke-linejoin="round"/>', '<path class="dot" d="M 7.38499972,10.318000009999999 L 7.38499972,10.318000009999999 C 7.164999719999999,10.09800001 6.82399972,10.09800001 6.603999719999999,10.318000009999999 L 6.3179997199999995,10.60400001 C 6.09799972,10.824000009999999 6.09799972,11.16500001 6.3179997199999995,11.385000009999999 L 6.614999719999999,11.68200001 C 6.834999719999999,11.90200001 7.17599972,11.90200001 7.395999719999999,11.68200001 L 7.68199972,11.385000009999999 C 7.90199972,11.16500001 7.90199972,10.824000009999999 7.68199972,10.60400001 L 7.38499972,10.318000009999999" stroke-linejoin="round"/>', '<path class="dot" d="M 7.38499972,4.31800021 L 7.38499972,4.31800021 C 7.164999719999999,4.09800021 6.82399972,4.09800021 6.603999719999999,4.31800021 L 6.3179997199999995,4.604000210000001 C 6.09799972,4.82400021 6.09799972,5.1650002100000005 6.3179997199999995,5.38500021 L 6.614999719999999,5.68200021 C 6.834999719999999,5.90200021 7.17599972,5.90200021 7.395999719999999,5.68200021 L 7.68199972,5.38500021 C 7.90199972,5.1650002100000005 7.90199972,4.82400021 7.68199972,4.604000210000001 L 7.38499972,4.31800021" stroke-linejoin="round"/>']
            
            
            <path d="M -4.999999925203724e-08,4.00000028 L 6.99999972,11.000000009999999 M 0.9999999500000007,11.000000009999999 L 6.99999972,11.000000009999999 L 6.99999972,5.00000021" fill="none"
            stroke="black"
            stroke-width="1"
            stroke-linecap="round"
            stroke-linejoin="round"
            />
            
            
        </svg>