<?xml version="1.0"?><!DOCTYPE svg PUBLIC "-//W3C//DTD SVG 1.1//EN" "http://www.w3.org/Graphics/SVG/1.1/DTD/svg11.dtd"><svg xmlns="http://www.w3.org/2000/svg" xmlns:xlink="http://www.w3.org/1999/xlink" width="350" height="1000" viewBox="0 0 14 40" >
            
                ['<path class="dot" d="M 2.8661882101381524,-0.24945153809576154 L 2.8661882101381515,-0.24945153809576154 C 2.4161882101381513,-0.6994515380957615 1.7186882101381515,-0.6994515380957617 1.2686882101381518,-0.24945153809576154 L 0.6836882101381516,0.3355484619042388 C 0.23368821013815166,0.7855484619042388 0.23368821013815155,1.4830484619042388 0.6836882101381516,1.933048461904239 L 1.2911882101381515,2.5405484619042387 C 1.7411882101381515,2.990548461904238 2.4386882101381513,2.990548461904238 2.8886882101381515,2.5405484619042387 L 3.4736882101381523,1.933048461904239 C 3.9236882101381516,1.4830484619042388 3.9236882101381516,0.7855484619042388 3.4736882101381523,0.3355484619042386 L 2.8661882101381524,-0.24945153809576137" stroke-linejoin="round"/>', '<path class="dot" d="M 12.715699544963886,27.803839293197797 L 12.715699544963886,27.803839293197797 C 12.265699544963887,27.353839293197797 11.568199544963887,27.353839293197797 11.118199544963886,27.803839293197797 L 10.533199544963887,28.388839293197798 C 10.083199544963886,28.838839293197797 10.083199544963886,29.5363392931978 10.533199544963887,29.986339293197798 L 11.140699544963887,30.5938392931978 C 11.590699544963886,31.0438392931978 12.288199544963886,31.0438392931978 12.738199544963887,30.5938392931978 L 13.323199544963888,29.986339293197798 C 13.773199544963887,29.5363392931978 13.773199544963887,28.838839293197797 13.323199544963888,28.388839293197798 L 12.715699544963886,27.803839293197797" stroke-linejoin="round"/>']
            
            
            <path d="M 2.0752443325871317,0.9733545843532205 L 11.924755667412867,29.02664541564678" fill="none"
            stroke="black"
            stroke-width="2.5"
            stroke-linecap="round"
            stroke-linejoin="round"
            />
            
            
        </svg>