<?xml version="1.0"?><!DOCTYPE svg PUBLIC "-//W3C//DTD SVG 1.1//EN" "http://www.w3.org/Graphics/SVG/1.1/DTD/svg11.dtd"><svg xmlns="http://www.w3.org/2000/svg" xmlns:xlink="http://www.w3.org/1999/xlink" width="350" height="1000" viewBox="0 0 10 26" >
            
                ['<path class="dot" d="M 5.519583333333333,14.140270833333332 L 5.519583333333333,14.140270833333332 C 5.229583333333333,13.850270833333333 4.780083333333333,13.850270833333333 4.490083333333333,14.140270833333332 L 4.113083333333333,14.517270833333333 C 3.823083333333333,14.807270833333334 3.823083333333333,15.256770833333333 4.113083333333333,15.546770833333333 L 4.504583333333333,15.938270833333332 C 4.794583333333333,16.228270833333333 5.244083333333333,16.228270833333333 5.534083333333333,15.938270833333332 L 5.911083333333334,15.546770833333333 C 6.201083333333333,15.256770833333333 6.201083333333333,14.807270833333334 5.911083333333334,14.517270833333333 L 5.519583333333333,14.140270833333332" stroke-linejoin="round"/>', '<path class="dot" d="M 5.519583333333333,0.1402708333333331 L 5.519583333333333,0.1402708333333331 C 5.229583333333333,-0.14972916666666694 4.780083333333333,-0.149729166666667 4.490083333333333,0.1402708333333331 L 4.113083333333333,0.5172708333333332 C 3.823083333333333,0.8072708333333332 3.823083333333333,1.2567708333333332 4.113083333333333,1.5467708333333332 L 4.504583333333333,1.938270833333333 C 4.794583333333333,2.228270833333333 5.244083333333333,2.228270833333333 5.534083333333333,1.938270833333333 L 5.911083333333334,1.5467708333333332 C 6.201083333333333,1.2567708333333332 6.201083333333333,0.8072708333333333 5.911083333333334,0.5172708333333331 L 5.519583333333333,0.14027083333333312" stroke-linejoin="round"/>']
            
                ['<path class="dot" d="M 3.5195833333333333,14.140270833333332 L 3.5195833333333333,14.140270833333332 C 3.2295833333333333,13.850270833333333 2.7800833333333332,13.850270833333333 2.490083333333333,14.140270833333332 L 2.113083333333333,14.517270833333333 C 1.8230833333333332,14.807270833333334 1.8230833333333332,15.256770833333333 2.113083333333333,15.546770833333333 L 2.504583333333333,15.938270833333332 C 2.7945833333333328,16.228270833333333 3.244083333333333,16.228270833333333 3.5340833333333332,15.938270833333332 L 3.9110833333333335,15.546770833333333 C 4.201083333333333,15.256770833333333 4.201083333333333,14.807270833333334 3.9110833333333335,14.517270833333333 L 3.5195833333333333,14.140270833333332" stroke-linejoin="round"/>', '<path class="dot" d="M 7.519583333333333,14.140270833333332 L 7.519583333333332,14.140270833333332 C 7.229583333333332,13.850270833333333 6.780083333333333,13.850270833333333 6.490083333333333,14.140270833333332 L 6.113083333333333,14.517270833333333 C 5.823083333333333,14.807270833333334 5.823083333333333,15.256770833333333 6.113083333333333,15.546770833333333 L 6.504583333333333,15.938270833333332 C 6.794583333333333,16.228270833333333 7.244083333333332,16.228270833333333 7.534083333333332,15.938270833333332 L 7.911083333333333,15.546770833333333 C 8.201083333333333,15.256770833333333 8.201083333333333,14.807270833333334 7.911083333333333,14.517270833333333 L 7.519583333333333,14.140270833333332" stroke-linejoin="round"/>']
            
                ['<path class="dot" d="M 3.5195833333333333,0.1402708333333331 L 3.5195833333333333,0.1402708333333331 C 3.2295833333333333,-0.14972916666666694 2.7800833333333332,-0.149729166666667 2.490083333333333,0.1402708333333331 L 2.113083333333333,0.5172708333333332 C 1.8230833333333332,0.8072708333333332 1.8230833333333332,1.2567708333333332 2.113083333333333,1.5467708333333332 L 2.504583333333333,1.938270833333333 C 2.7945833333333328,2.228270833333333 3.244083333333333,2.228270833333333 3.5340833333333332,1.938270833333333 L 3.9110833333333335,1.5467708333333332 C 4.201083333333333,1.2567708333333332 4.201083333333333,0.8072708333333333 3.9110833333333335,0.5172708333333331 L 3.5195833333333333,0.14027083333333312" stroke-linejoin="round"/>', '<path class="dot" d="M 7.519583333333333,0.1402708333333331 L 7.519583333333332,0.1402708333333331 C 7.229583333333332,-0.14972916666666694 6.780083333333333,-0.149729166666667 6.490083333333333,0.1402708333333331 L 6.113083333333333,0.5172708333333332 C 5.823083333333333,0.8072708333333332 5.823083333333333,1.2567708333333332 6.113083333333333,1.5467708333333332 L 6.504583333333333,1.938270833333333 C 6.794583333333333,2.228270833333333 7.244083333333332,2.228270833333333 7.534083333333332,1.938270833333333 L 7.911083333333333,1.5467708333333332 C 8.201083333333333,1.2567708333333332 8.201083333333333,0.8072708333333333 7.911083333333333,0.5172708333333331 L 7.519583333333333,0.14027083333333312" stroke-linejoin="round"/>']
            
                ['<path class="dot" d="M 7.519583333333333,-3.859728766666668 L 7.519583333333332,-3.859728766666668 C 7.229583333333332,-4.149728766666668 6.780083333333333,-4.149728766666668 6.490083333333333,-3.859728766666668 L 6.113083333333333,-3.4827287666666678 C 5.823083333333333,-3.1927287666666677 5.823083333333333,-2.7432287666666677 6.113083333333333,-2.4532287666666677 L 6.504583333333333,-2.061728766666668 C 6.794583333333333,-1.771728766666668 7.244083333333332,-1.771728766666668 7.534083333333332,-2.061728766666668 L 7.911083333333333,-2.4532287666666677 C 8.201083333333333,-2.7432287666666677 8.201083333333333,-3.1927287666666677 7.911083333333333,-3.4827287666666678 L 7.519583333333333,-3.8597287666666675" stroke-linejoin="round"/>', '<path class="dot" d="M 3.5195833333333333,-1.8597291666666675 L 3.5195833333333333,-1.8597291666666675 C 3.2295833333333333,-2.149729166666668 2.7800833333333332,-2.149729166666668 2.490083333333333,-1.8597291666666675 L 2.113083333333333,-1.4827291666666675 C 1.8230833333333332,-1.1927291666666675 1.8230833333333332,-0.7432291666666675 2.113083333333333,-0.45322916666666746 L 2.504583333333333,-0.06172916666666772 C 2.7945833333333328,0.2282708333333323 3.244083333333333,0.2282708333333323 3.5340833333333332,-0.06172916666666772 L 3.9110833333333335,-0.45322916666666746 C 4.201083333333333,-0.7432291666666675 4.201083333333333,-1.1927291666666675 3.9110833333333335,-1.4827291666666675 L 3.5195833333333333,-1.8597291666666675" stroke-linejoin="round"/>']
            
            
            <path d="M 5.0,15.0 L 5.0,1.0" fill="none"
            stroke="black"
            stroke-width="1.5"
            stroke-linecap="round"
            stroke-linejoin="round"
            />
            
            <path d="M 3.0,15.0 L 7.0,15.0" fill="none"
            stroke="black"
            stroke-width="1.5"
            stroke-linecap="round"
            stroke-linejoin="round"
            />
            
            <path d="M 3.0,1.0 L 7.0,1.0" fill="none"
            stroke="black"
            stroke-width="1.5"
            stroke-linecap="round"
            stroke-linejoin="round"
            />
            
            <path d="M 7.0,-2.9999996000000007 L 3.0,-1.0000000000000007" fill="none"
            stroke="black"
            stroke-width="1.5"
            stroke-linecap="round"
            stroke-linejoin="round"
            />
            
            
        </svg>