<?xml version="1.0"?><!DOCTYPE svg PUBLIC "-//W3C//DTD SVG 1.1//EN" "http://www.w3.org/Graphics/SVG/1.1/DTD/svg11.dtd"><svg xmlns="http://www.w3.org/2000/svg" xmlns:xlink="http://www.w3.org/1999/xlink" width="350" height="1000" viewBox="0 0 7 17" >
            
                ['<path class="dot" d="M 6.385,3.318 L 6.385,3.318 C 6.164999999999999,3.098 5.824,3.098 5.603999999999999,3.318 L 5.318,3.604 C 5.098,3.8240000000000003 5.098,4.165 5.318,4.385 L 5.614999999999999,4.682 C 5.834999999999999,4.902 6.176,4.902 6.395999999999999,4.682 L 6.682,4.385 C 6.902,4.165 6.902,3.8240000000000003 6.682,3.604 L 6.385,3.318" stroke-linejoin="round"/>', '<path class="dot" d="M 5.385,10.318 L 5.385,10.318 C 5.164999999999999,10.098 4.824,10.098 4.603999999999999,10.318 L 4.318,10.604000000000001 C 4.098,10.824 4.098,11.165000000000001 4.318,11.385000000000002 L 4.614999999999999,11.682 C 4.834999999999999,11.902000000000001 5.176,11.902000000000001 5.395999999999999,11.682 L 5.682,11.385000000000002 C 5.902,11.165000000000001 5.902,10.824 5.682,10.604000000000001 L 5.385,10.318000000000001" stroke-linejoin="round"/>', '<path class="dot" d="M 4.385,3.318 L 4.385,3.318 C 4.164999999999999,3.098 3.824,3.098 3.6039999999999996,3.318 L 3.3179999999999996,3.604 C 3.0979999999999994,3.8240000000000003 3.0979999999999994,4.165 3.3179999999999996,4.385 L 3.6149999999999993,4.682 C 3.8349999999999995,4.902 4.176,4.902 4.395999999999999,4.682 L 4.682,4.385 C 4.902,4.165 4.902,3.8240000000000003 4.682,3.604 L 4.385,3.318" stroke-linejoin="round"/>', '<path class="dot" d="M 3.29423713,10.318 L 3.29423713,10.318 C 3.0742371299999998,10.098 2.73323713,10.098 2.51323713,10.318 L 2.22723713,10.604000000000001 C 2.0072371299999996,10.824 2.0072371299999996,11.165000000000001 2.22723713,11.385000000000002 L 2.5242371299999995,11.682 C 2.7442371299999997,11.902000000000001 3.08523713,11.902000000000001 3.3052371299999996,11.682 L 3.59123713,11.385000000000002 C 3.8112371300000003,11.165000000000001 3.8112371300000003,10.824 3.59123713,10.604000000000001 L 3.29423713,10.318000000000001" stroke-linejoin="round"/>', '<path class="dot" d="M 2.385,3.318 L 2.385,3.318 C 2.165,3.098 1.8239999999999998,3.098 1.6039999999999999,3.318 L 1.3179999999999998,3.604 C 1.0979999999999999,3.8240000000000003 1.0979999999999996,4.165 1.3179999999999998,4.385 L 1.6149999999999998,4.682 C 1.8349999999999997,4.902 2.176,4.902 2.396,4.682 L 2.6820000000000004,4.385 C 2.902,4.165 2.902,3.8240000000000003 2.6820000000000004,3.604 L 2.385,3.318" stroke-linejoin="round"/>']
            
            
            <path d="M 6.0,4.0 L 5.0,11.0 L 4.0,4.0 L 2.90923713,11.0 L 2.0,4.0" fill="none"
            stroke="black"
            stroke-width="1"
            stroke-linecap="round"
            stroke-linejoin="round"
            />
            
            
        </svg>