<?xml version="1.0"?><!DOCTYPE svg PUBLIC "-//W3C//DTD SVG 1.1//EN" "http://www.w3.org/Graphics/SVG/1.1/DTD/svg11.dtd"><svg xmlns="http://www.w3.org/2000/svg" xmlns:xlink="http://www.w3.org/1999/xlink" width="350" height="1000" viewBox="0 0 14 40" >
            
                ['<path class="dot" d="M 7.790943877551021,6.777193877551018 L 7.79094387755102,6.777193877551018 C 7.34094387755102,6.327193877551018 6.64344387755102,6.327193877551018 6.1934438775510205,6.777193877551018 L 5.608443877551021,7.362193877551018 C 5.15844387755102,7.812193877551018 5.15844387755102,8.509693877551019 5.608443877551021,8.959693877551018 L 6.21594387755102,9.567193877551018 C 6.66594387755102,10.017193877551017 7.3634438775510205,10.017193877551017 7.81344387755102,9.567193877551018 L 8.39844387755102,8.959693877551018 C 8.84844387755102,8.509693877551019 8.84844387755102,7.812193877551018 8.39844387755102,7.362193877551018 L 7.790943877551021,6.777193877551018" stroke-linejoin="round"/>', '<path class="dot" d="M 7.790943877551021,20.777193877551017 L 7.79094387755102,20.777193877551017 C 7.34094387755102,20.327193877551018 6.64344387755102,20.327193877551018 6.1934438775510205,20.777193877551017 L 5.608443877551021,21.362193877551018 C 5.15844387755102,21.812193877551017 5.15844387755102,22.50969387755102 5.608443877551021,22.959693877551018 L 6.21594387755102,23.56719387755102 C 6.66594387755102,24.01719387755102 7.3634438775510205,24.01719387755102 7.81344387755102,23.56719387755102 L 8.39844387755102,22.959693877551018 C 8.84844387755102,22.50969387755102 8.84844387755102,21.812193877551017 8.39844387755102,21.362193877551018 L 7.790943877551021,20.777193877551017" stroke-linejoin="round"/>']
            
                ['<path class="dot" d="M 3.7909438775510207,6.777203877551018 L 3.79094387755102,6.777203877551018 C 3.3409438775510196,6.3272038775510175 2.64344387755102,6.3272038775510175 2.19344387755102,6.777203877551018 L 1.60844387755102,7.362203877551018 C 1.15844387755102,7.812203877551018 1.15844387755102,8.509703877551019 1.60844387755102,8.959703877551018 L 2.2159438775510196,9.567203877551018 C 2.66594387755102,10.017203877551017 3.3634438775510196,10.017203877551017 3.8134438775510198,9.567203877551018 L 4.398443877551021,8.959703877551018 C 4.84844387755102,8.509703877551019 4.84844387755102,7.812203877551018 4.398443877551021,7.362203877551018 L 3.7909438775510207,6.777203877551018" stroke-linejoin="round"/>', '<path class="dot" d="M 7.790943877551021,6.777203877551018 L 7.79094387755102,6.777203877551018 C 7.34094387755102,6.3272038775510175 6.64344387755102,6.3272038775510175 6.1934438775510205,6.777203877551018 L 5.608443877551021,7.362203877551018 C 5.15844387755102,7.812203877551018 5.15844387755102,8.509703877551019 5.608443877551021,8.959703877551018 L 6.21594387755102,9.567203877551018 C 6.66594387755102,10.017203877551017 7.3634438775510205,10.017203877551017 7.81344387755102,9.567203877551018 L 8.39844387755102,8.959703877551018 C 8.84844387755102,8.509703877551019 8.84844387755102,7.812203877551018 8.39844387755102,7.362203877551018 L 7.790943877551021,6.777203877551018" stroke-linejoin="round"/>']
            
                ['<path class="dot" d="M 3.7909438775510207,20.777193877551017 L 3.79094387755102,20.777193877551017 C 3.3409438775510196,20.327193877551018 2.64344387755102,20.327193877551018 2.19344387755102,20.777193877551017 L 1.60844387755102,21.362193877551018 C 1.15844387755102,21.812193877551017 1.15844387755102,22.50969387755102 1.60844387755102,22.959693877551018 L 2.2159438775510196,23.56719387755102 C 2.66594387755102,24.01719387755102 3.3634438775510196,24.01719387755102 3.8134438775510198,23.56719387755102 L 4.398443877551021,22.959693877551018 C 4.84844387755102,22.50969387755102 4.84844387755102,21.812193877551017 4.398443877551021,21.362193877551018 L 3.7909438775510207,20.777193877551017" stroke-linejoin="round"/>', '<path class="dot" d="M 11.790943577551019,20.777193877551017 L 11.790943577551019,20.777193877551017 C 11.34094357755102,20.327193877551018 10.64344357755102,20.327193877551018 10.193443577551019,20.777193877551017 L 9.60844357755102,21.362193877551018 C 9.158443577551019,21.812193877551017 9.158443577551019,22.50969387755102 9.60844357755102,22.959693877551018 L 10.21594357755102,23.56719387755102 C 10.665943577551019,24.01719387755102 11.363443577551019,24.01719387755102 11.81344357755102,23.56719387755102 L 12.39844357755102,22.959693877551018 C 12.84844357755102,22.50969387755102 12.84844357755102,21.812193877551017 12.39844357755102,21.362193877551018 L 11.790943577551019,20.777193877551017" stroke-linejoin="round"/>']
            
                ['<path class="dot" d="M 7.790943877551021,0.7771938775510179 L 7.79094387755102,0.7771938775510179 C 7.34094387755102,0.3271938775510179 6.64344387755102,0.3271938775510178 6.1934438775510205,0.7771938775510179 L 5.608443877551021,1.3621938775510183 C 5.15844387755102,1.8121938775510182 5.15844387755102,2.509693877551018 5.608443877551021,2.959693877551018 L 6.21594387755102,3.567193877551018 C 6.66594387755102,4.017193877551017 7.3634438775510205,4.017193877551017 7.81344387755102,3.567193877551018 L 8.39844387755102,2.959693877551018 C 8.84844387755102,2.509693877551018 8.84844387755102,1.8121938775510182 8.39844387755102,1.362193877551018 L 7.790943877551021,0.7771938775510181" stroke-linejoin="round"/>', '<path class="dot" d="M 9.79094387755102,-0.22280612244898207 L 9.790943877551019,-0.22280612244898207 C 9.34094387755102,-0.6728061224489821 8.64344387755102,-0.6728061224489822 8.19344387755102,-0.22280612244898207 L 7.608443877551021,0.3621938775510183 C 7.15844387755102,0.8121938775510182 7.15844387755102,1.5096938775510182 7.608443877551021,1.9596938775510184 L 8.21594387755102,2.567193877551018 C 8.66594387755102,3.0171938775510174 9.36344387755102,3.0171938775510174 9.81344387755102,2.567193877551018 L 10.39844387755102,1.9596938775510184 C 10.84844387755102,1.5096938775510182 10.84844387755102,0.8121938775510182 10.39844387755102,0.36219387755101806 L 9.79094387755102,-0.2228061224489819" stroke-linejoin="round"/>', '<path class="dot" d="M 7.790943877551021,-1.2228061224489821 L 7.79094387755102,-1.2228061224489821 C 7.34094387755102,-1.672806122448982 6.64344387755102,-1.672806122448982 6.1934438775510205,-1.2228061224489821 L 5.608443877551021,-0.6378061224489817 C 5.15844387755102,-0.18780612244898176 5.15844387755102,0.5096938775510182 5.608443877551021,0.9596938775510184 L 6.21594387755102,1.567193877551018 C 6.66594387755102,2.0171938775510174 7.3634438775510205,2.0171938775510174 7.81344387755102,1.567193877551018 L 8.39844387755102,0.9596938775510184 C 8.84844387755102,0.5096938775510182 8.84844387755102,-0.18780612244898176 8.39844387755102,-0.6378061224489819 L 7.790943877551021,-1.222806122448982" stroke-linejoin="round"/>', '<path class="dot" d="M 5.790943877551021,-0.22280612244898207 L 5.79094387755102,-0.22280612244898207 C 5.34094387755102,-0.6728061224489821 4.64344387755102,-0.6728061224489822 4.1934438775510205,-0.22280612244898207 L 3.60844387755102,0.3621938775510183 C 3.1584438775510204,0.8121938775510182 3.15844387755102,1.5096938775510182 3.60844387755102,1.9596938775510184 L 4.21594387755102,2.567193877551018 C 4.66594387755102,3.0171938775510174 5.3634438775510205,3.0171938775510174 5.81344387755102,2.567193877551018 L 6.398443877551021,1.9596938775510184 C 6.84844387755102,1.5096938775510182 6.84844387755102,0.8121938775510182 6.398443877551021,0.36219387755101806 L 5.790943877551021,-0.2228061224489819" stroke-linejoin="round"/>', '<path class="dot" d="M 7.790943877551021,0.7771938775510179 L 7.79094387755102,0.7771938775510179 C 7.34094387755102,0.3271938775510179 6.64344387755102,0.3271938775510178 6.1934438775510205,0.7771938775510179 L 5.608443877551021,1.3621938775510183 C 5.15844387755102,1.8121938775510182 5.15844387755102,2.509693877551018 5.608443877551021,2.959693877551018 L 6.21594387755102,3.567193877551018 C 6.66594387755102,4.017193877551017 7.3634438775510205,4.017193877551017 7.81344387755102,3.567193877551018 L 8.39844387755102,2.959693877551018 C 8.84844387755102,2.509693877551018 8.84844387755102,1.8121938775510182 8.39844387755102,1.362193877551018 L 7.790943877551021,0.7771938775510181" stroke-linejoin="round"/>']
            
            
            <path d="M 7.0,8.0 L 7.0,22.0" fill="none"
            stroke="black"
            stroke-width="2.5"
            stroke-linecap="round"
            stroke-linejoin="round"
            />
            
            <path d="M 3.0,8.00001 L 7.0,8.00001" fill="none"
            stroke="black"
            stroke-width="2.5"
            stroke-linecap="round"
            stroke-linejoin="round"
            />
            
            <path d="M 3.0,22.0 L 10.9999997,22.0" fill="none"
            stroke="black"
            stroke-width="2.5"
            stroke-linecap="round"
            stroke-linejoin="round"
            />
            
            <path d="M 7.0,2.0 L 9.0,1.0 L 7.0,0.0 L 5.0,1.0 L 7.0,2.0" fill="none"
            stroke="black"
            stroke-width="2.5"
            stroke-linecap="round"
            stroke-linejoin="round"
            />
            
            
        </svg>