<?xml version="1.0"?><!DOCTYPE svg PUBLIC "-//W3C//DTD SVG 1.1//EN" "http://www.w3.org/Graphics/SVG/1.1/DTD/svg11.dtd"><svg xmlns="http://www.w3.org/2000/svg" xmlns:xlink="http://www.w3.org/1999/xlink" width="350" height="1000" viewBox="0 0 7 17" >
            
                ['<path class="dot" d="M 0.885,9.318 L 0.8849999999999998,9.318 C 0.6649999999999998,9.098 0.32399999999999984,9.098 0.10399999999999981,9.318 L -0.1820000000000002,9.604000000000001 C -0.40200000000000025,9.824 -0.40200000000000025,10.165000000000001 -0.1820000000000002,10.385000000000002 L 0.11499999999999977,10.682 C 0.33499999999999974,10.902000000000001 0.6759999999999999,10.902000000000001 0.8959999999999997,10.682 L 1.1820000000000002,10.385000000000002 C 1.4020000000000001,10.165000000000001 1.4020000000000001,9.824 1.1820000000000002,9.604000000000001 L 0.885,9.318000000000001" stroke-linejoin="round"/>', '<path class="dot" d="M -0.11499999999999999,10.318 L -0.11500000000000021,10.318 C -0.3350000000000002,10.098 -0.6760000000000002,10.098 -0.8960000000000001,10.318 L -1.1820000000000002,10.604000000000001 C -1.4020000000000001,10.824 -1.4020000000000004,11.165000000000001 -1.1820000000000002,11.385000000000002 L -0.8850000000000002,11.682 C -0.6650000000000003,11.902000000000001 -0.32400000000000007,11.902000000000001 -0.10400000000000031,11.682 L 0.18200000000000016,11.385000000000002 C 0.40200000000000014,11.165000000000001 0.40200000000000014,10.824 0.18200000000000016,10.604000000000001 L -0.11499999999999999,10.318000000000001" stroke-linejoin="round"/>', '<path class="dot" d="M 0.885,11.318 L 0.8849999999999998,11.318 C 0.6649999999999998,11.098 0.32399999999999984,11.098 0.10399999999999981,11.318 L -0.1820000000000002,11.604000000000001 C -0.40200000000000025,11.824 -0.40200000000000025,12.165000000000001 -0.1820000000000002,12.385000000000002 L 0.11499999999999977,12.682 C 0.33499999999999974,12.902000000000001 0.6759999999999999,12.902000000000001 0.8959999999999997,12.682 L 1.1820000000000002,12.385000000000002 C 1.4020000000000001,12.165000000000001 1.4020000000000001,11.824 1.1820000000000002,11.604000000000001 L 0.885,11.318000000000001" stroke-linejoin="round"/>', '<path class="dot" d="M 1.885,10.318 L 1.8849999999999998,10.318 C 1.6649999999999998,10.098 1.3239999999999998,10.098 1.1039999999999999,10.318 L 0.8179999999999998,10.604000000000001 C 0.5979999999999998,10.824 0.5979999999999998,11.165000000000001 0.8179999999999998,11.385000000000002 L 1.1149999999999998,11.682 C 1.3349999999999997,11.902000000000001 1.676,11.902000000000001 1.8959999999999997,11.682 L 2.1820000000000004,11.385000000000002 C 2.402,11.165000000000001 2.402,10.824 2.1820000000000004,10.604000000000001 L 1.885,10.318000000000001" stroke-linejoin="round"/>', '<path class="dot" d="M 0.885,9.318 L 0.8849999999999998,9.318 C 0.6649999999999998,9.098 0.32399999999999984,9.098 0.10399999999999981,9.318 L -0.1820000000000002,9.604000000000001 C -0.40200000000000025,9.824 -0.40200000000000025,10.165000000000001 -0.1820000000000002,10.385000000000002 L 0.11499999999999977,10.682 C 0.33499999999999974,10.902000000000001 0.6759999999999999,10.902000000000001 0.8959999999999997,10.682 L 1.1820000000000002,10.385000000000002 C 1.4020000000000001,10.165000000000001 1.4020000000000001,9.824 1.1820000000000002,9.604000000000001 L 0.885,9.318000000000001" stroke-linejoin="round"/>']
            
                ['<path class="dot" d="M 3.885,9.318 L 3.885,9.318 C 3.6649999999999996,9.098 3.324,9.098 3.1039999999999996,9.318 L 2.8179999999999996,9.604000000000001 C 2.5979999999999994,9.824 2.5979999999999994,10.165000000000001 2.8179999999999996,10.385000000000002 L 3.1149999999999993,10.682 C 3.3349999999999995,10.902000000000001 3.6759999999999997,10.902000000000001 3.8959999999999995,10.682 L 4.182,10.385000000000002 C 4.402,10.165000000000001 4.402,9.824 4.182,9.604000000000001 L 3.885,9.318000000000001" stroke-linejoin="round"/>', '<path class="dot" d="M 2.885,10.318 L 2.885,10.318 C 2.665,10.098 2.324,10.098 2.1039999999999996,10.318 L 1.8179999999999998,10.604000000000001 C 1.5979999999999999,10.824 1.5979999999999996,11.165000000000001 1.8179999999999998,11.385000000000002 L 2.1149999999999998,11.682 C 2.335,11.902000000000001 2.676,11.902000000000001 2.896,11.682 L 3.1820000000000004,11.385000000000002 C 3.402,11.165000000000001 3.402,10.824 3.1820000000000004,10.604000000000001 L 2.885,10.318000000000001" stroke-linejoin="round"/>', '<path class="dot" d="M 3.885,11.318 L 3.885,11.318 C 3.6649999999999996,11.098 3.324,11.098 3.1039999999999996,11.318 L 2.8179999999999996,11.604000000000001 C 2.5979999999999994,11.824 2.5979999999999994,12.165000000000001 2.8179999999999996,12.385000000000002 L 3.1149999999999993,12.682 C 3.3349999999999995,12.902000000000001 3.6759999999999997,12.902000000000001 3.8959999999999995,12.682 L 4.182,12.385000000000002 C 4.402,12.165000000000001 4.402,11.824 4.182,11.604000000000001 L 3.885,11.318000000000001" stroke-linejoin="round"/>', '<path class="dot" d="M 4.885,10.318 L 4.885,10.318 C 4.664999999999999,10.098 4.324,10.098 4.103999999999999,10.318 L 3.8179999999999996,10.604000000000001 C 3.5979999999999994,10.824 3.5979999999999994,11.165000000000001 3.8179999999999996,11.385000000000002 L 4.114999999999999,11.682 C 4.334999999999999,11.902000000000001 4.676,11.902000000000001 4.895999999999999,11.682 L 5.182,11.385000000000002 C 5.402,11.165000000000001 5.402,10.824 5.182,10.604000000000001 L 4.885,10.318000000000001" stroke-linejoin="round"/>', '<path class="dot" d="M 3.885,9.318 L 3.885,9.318 C 3.6649999999999996,9.098 3.324,9.098 3.1039999999999996,9.318 L 2.8179999999999996,9.604000000000001 C 2.5979999999999994,9.824 2.5979999999999994,10.165000000000001 2.8179999999999996,10.385000000000002 L 3.1149999999999993,10.682 C 3.3349999999999995,10.902000000000001 3.6759999999999997,10.902000000000001 3.8959999999999995,10.682 L 4.182,10.385000000000002 C 4.402,10.165000000000001 4.402,9.824 4.182,9.604000000000001 L 3.885,9.318000000000001" stroke-linejoin="round"/>']
            
                ['<path class="dot" d="M 6.885,9.318 L 6.885,9.318 C 6.664999999999999,9.098 6.324,9.098 6.103999999999999,9.318 L 5.818,9.604000000000001 C 5.598,9.824 5.598,10.165000000000001 5.818,10.385000000000002 L 6.114999999999999,10.682 C 6.334999999999999,10.902000000000001 6.676,10.902000000000001 6.895999999999999,10.682 L 7.182,10.385000000000002 C 7.402,10.165000000000001 7.402,9.824 7.182,9.604000000000001 L 6.885,9.318000000000001" stroke-linejoin="round"/>', '<path class="dot" d="M 5.885,10.318 L 5.885,10.318 C 5.664999999999999,10.098 5.324,10.098 5.103999999999999,10.318 L 4.818,10.604000000000001 C 4.598,10.824 4.598,11.165000000000001 4.818,11.385000000000002 L 5.114999999999999,11.682 C 5.334999999999999,11.902000000000001 5.676,11.902000000000001 5.895999999999999,11.682 L 6.182,11.385000000000002 C 6.402,11.165000000000001 6.402,10.824 6.182,10.604000000000001 L 5.885,10.318000000000001" stroke-linejoin="round"/>', '<path class="dot" d="M 6.885,11.318 L 6.885,11.318 C 6.664999999999999,11.098 6.324,11.098 6.103999999999999,11.318 L 5.818,11.604000000000001 C 5.598,11.824 5.598,12.165000000000001 5.818,12.385000000000002 L 6.114999999999999,12.682 C 6.334999999999999,12.902000000000001 6.676,12.902000000000001 6.895999999999999,12.682 L 7.182,12.385000000000002 C 7.402,12.165000000000001 7.402,11.824 7.182,11.604000000000001 L 6.885,11.318000000000001" stroke-linejoin="round"/>', '<path class="dot" d="M 7.885,10.318 L 7.885,10.318 C 7.664999999999999,10.098 7.324,10.098 7.103999999999999,10.318 L 6.818,10.604000000000001 C 6.598,10.824 6.598,11.165000000000001 6.818,11.385000000000002 L 7.114999999999999,11.682 C 7.334999999999999,11.902000000000001 7.676,11.902000000000001 7.895999999999999,11.682 L 8.182,11.385000000000002 C 8.402,11.165000000000001 8.402,10.824 8.182,10.604000000000001 L 7.885,10.318000000000001" stroke-linejoin="round"/>', '<path class="dot" d="M 6.885,9.318 L 6.885,9.318 C 6.664999999999999,9.098 6.324,9.098 6.103999999999999,9.318 L 5.818,9.604000000000001 C 5.598,9.824 5.598,10.165000000000001 5.818,10.385000000000002 L 6.114999999999999,10.682 C 6.334999999999999,10.902000000000001 6.676,10.902000000000001 6.895999999999999,10.682 L 7.182,10.385000000000002 C 7.402,10.165000000000001 7.402,9.824 7.182,9.604000000000001 L 6.885,9.318000000000001" stroke-linejoin="round"/>']
            
            
            <path d="M 0.5,10.0 L -0.5,11.0 L 0.5,12.0 L 1.5,11.0 L 0.5,10.0" fill="none"
            stroke="black"
            stroke-width="1"
            stroke-linecap="round"
            stroke-linejoin="round"
            />
            
            <path d="M 3.5,10.0 L 2.5,11.0 L 3.5,12.0 L 4.5,11.0 L 3.5,10.0" fill="none"
            stroke="black"
            stroke-width="1"
            stroke-linecap="round"
            stroke-linejoin="round"
            />
            
            <path d="M 6.5,10.0 L 5.5,11.0 L 6.5,12.0 L 7.5,11.0 L 6.5,10.0" fill="none"
            stroke="black"
            stroke-width="1"
            stroke-linecap="round"
            stroke-linejoin="round"
            />
            
            
        </svg>