<?xml version="1.0"?><!DOCTYPE svg PUBLIC "-//W3C//DTD SVG 1.1//EN" "http://www.w3.org/Graphics/SVG/1.1/DTD/svg11.dtd"><svg xmlns="http://www.w3.org/2000/svg" xmlns:xlink="http://www.w3.org/1999/xlink" width="350" height="1000" viewBox="0 0 7 17" >
            
                ['<path class="dot" d="M 4.885,0.31800000000000006 L 4.885,0.31800000000000006 C 4.664999999999999,0.09799999999999998 4.324,0.09799999999999995 4.103999999999999,0.31800000000000006 L 3.8179999999999996,0.6040000000000002 C 3.5979999999999994,0.8240000000000002 3.5979999999999994,1.1650000000000003 3.8179999999999996,1.3850000000000002 L 4.114999999999999,1.682 C 4.334999999999999,1.902 4.676,1.902 4.895999999999999,1.682 L 5.182,1.3850000000000002 C 5.402,1.165 5.402,0.8240000000000002 5.182,0.6040000000000001 L 4.885,0.31800000000000006" stroke-linejoin="round"/>', '<path class="dot" d="M 3.885,1.318 L 3.885,1.318 C 3.6649999999999996,1.0979999999999999 3.324,1.0979999999999999 3.1039999999999996,1.318 L 2.8179999999999996,1.604 C 2.5979999999999994,1.8240000000000003 2.5979999999999994,2.165 2.8179999999999996,2.3850000000000002 L 3.1149999999999993,2.682 C 3.3349999999999995,2.902 3.6759999999999997,2.902 3.8959999999999995,2.682 L 4.182,2.3850000000000002 C 4.402,2.165 4.402,1.8240000000000003 4.182,1.604 L 3.885,1.318" stroke-linejoin="round"/>', '<path class="dot" d="M 2.885,0.31800000000000006 L 2.885,0.31800000000000006 C 2.665,0.09799999999999998 2.324,0.09799999999999995 2.1039999999999996,0.31800000000000006 L 1.8179999999999998,0.6040000000000002 C 1.5979999999999999,0.8240000000000002 1.5979999999999996,1.1650000000000003 1.8179999999999998,1.3850000000000002 L 2.1149999999999998,1.682 C 2.335,1.902 2.676,1.902 2.896,1.682 L 3.1820000000000004,1.3850000000000002 C 3.402,1.165 3.402,0.8240000000000002 3.1820000000000004,0.6040000000000001 L 2.885,0.31800000000000006" stroke-linejoin="round"/>', '<path class="dot" d="M 3.885,-0.6819999999999999 L 3.885,-0.6819999999999999 C 3.6649999999999996,-0.902 3.324,-0.902 3.1039999999999996,-0.6819999999999999 L 2.8179999999999996,-0.3959999999999998 C 2.5979999999999994,-0.17599999999999982 2.5979999999999994,0.16500000000000026 2.8179999999999996,0.38500000000000023 L 3.1149999999999993,0.6819999999999999 C 3.3349999999999995,0.9019999999999999 3.6759999999999997,0.9019999999999999 3.8959999999999995,0.6819999999999999 L 4.182,0.38500000000000023 C 4.402,0.16500000000000004 4.402,-0.17599999999999982 4.182,-0.3959999999999999 L 3.885,-0.6819999999999999" stroke-linejoin="round"/>', '<path class="dot" d="M 4.885,0.31800000000000006 L 4.885,0.31800000000000006 C 4.664999999999999,0.09799999999999998 4.324,0.09799999999999995 4.103999999999999,0.31800000000000006 L 3.8179999999999996,0.6040000000000002 C 3.5979999999999994,0.8240000000000002 3.5979999999999994,1.1650000000000003 3.8179999999999996,1.3850000000000002 L 4.114999999999999,1.682 C 4.334999999999999,1.902 4.676,1.902 4.895999999999999,1.682 L 5.182,1.3850000000000002 C 5.402,1.165 5.402,0.8240000000000002 5.182,0.6040000000000001 L 4.885,0.31800000000000006" stroke-linejoin="round"/>', '<path class="dot" d="M 4.885,2.318 L 4.885,2.318 C 4.664999999999999,2.098 4.324,2.098 4.103999999999999,2.318 L 3.8179999999999996,2.604 C 3.5979999999999994,2.8240000000000003 3.5979999999999994,3.165 3.8179999999999996,3.3850000000000002 L 4.114999999999999,3.682 C 4.334999999999999,3.902 4.676,3.902 4.895999999999999,3.682 L 5.182,3.3850000000000002 C 5.402,3.165 5.402,2.8240000000000003 5.182,2.604 L 4.885,2.318" stroke-linejoin="round"/>', '<path class="dot" d="M 2.885,4.3180000000000005 L 2.885,4.3180000000000005 C 2.665,4.098000000000001 2.324,4.098000000000001 2.1039999999999996,4.3180000000000005 L 1.8179999999999998,4.604000000000001 C 1.5979999999999999,4.824000000000001 1.5979999999999996,5.165000000000001 1.8179999999999998,5.385000000000001 L 2.1149999999999998,5.682 C 2.335,5.902 2.676,5.902 2.896,5.682 L 3.1820000000000004,5.385000000000001 C 3.402,5.165000000000001 3.402,4.824000000000001 3.1820000000000004,4.604000000000001 L 2.885,4.3180000000000005" stroke-linejoin="round"/>']
            
            
            <path d="M 4.5,1.0 L 3.5,2.0 L 2.5,1.0 L 3.5,0.0 L 4.5,1.0 L 4.5,3.0 L 2.5,5.0" fill="none"
            stroke="black"
            stroke-width="1"
            stroke-linecap="round"
            stroke-linejoin="round"
            />
            
            
        </svg>