<?xml version="1.0" encoding="UTF-8" standalone="no"?>
<svg
   xmlns:dc="http://purl.org/dc/elements/1.1/"
   xmlns:cc="http://creativecommons.org/ns#"
   xmlns:rdf="http://www.w3.org/1999/02/22-rdf-syntax-ns#"
   xmlns:svg="http://www.w3.org/2000/svg"
   xmlns="http://www.w3.org/2000/svg"
   xmlns:sodipodi="http://sodipodi.sourceforge.net/DTD/sodipodi-0.dtd"
   xmlns:inkscape="http://www.inkscape.org/namespaces/inkscape"
   data-dec="102"
   width="10"
   height="26"
   version="1.1"
   id="svg4"
   sodipodi:docname="102.svg"
   inkscape:version="0.92.2 5c3e80d, 2017-08-06">
  <metadata
     id="metadata10">
    <rdf:RDF>
      <cc:Work
         rdf:about="">
        <dc:format>image/svg+xml</dc:format>
        <dc:type
           rdf:resource="http://purl.org/dc/dcmitype/StillImage" />
        <dc:title></dc:title>
      </cc:Work>
    </rdf:RDF>
  </metadata>
  <defs
     id="defs8" />
  <sodipodi:namedview
     pagecolor="#ffffff"
     bordercolor="#666666"
     borderopacity="1"
     objecttolerance="10"
     gridtolerance="10"
     guidetolerance="10"
     inkscape:pageopacity="0"
     inkscape:pageshadow="2"
     inkscape:window-width="1389"
     inkscape:window-height="843"
     id="namedview6"
     showgrid="true"
     inkscape:zoom="33.37544"
     inkscape:cx="6.0353954"
     inkscape:cy="18.708831"
     inkscape:window-x="64"
     inkscape:window-y="172"
     inkscape:window-maximized="0"
     inkscape:current-layer="svg4"
     showguides="true"
     inkscape:guide-bbox="true">
    <inkscape:grid
       type="xygrid"
       id="grid817" />
    <sodipodi:guide
       position="0,7"
       orientation="0,1"
       id="guide3685"
       inkscape:locked="false" />
    <sodipodi:guide
       position="0,11"
       orientation="0,1"
       id="guide3687"
       inkscape:locked="false" />
    <sodipodi:guide
       position="1,25"
       orientation="0,1"
       id="guide3689"
       inkscape:locked="false" />
    <sodipodi:guide
       position="-1,21"
       orientation="0,1"
       id="guide3691"
       inkscape:locked="false" />
  </sodipodi:namedview>
  <path
     style="fill:none;stroke:#000000;stroke-width:0.71428573px;stroke-linecap:butt;stroke-linejoin:miter;stroke-opacity:1"
     d="M 8,0 H 6 L 5,1 4,3 v 2"
     id="path874"
     inkscape:connector-curvature="0"
     sodipodi:nodetypes="ccccc" />
  <path
     style="fill:none;stroke:#000000;stroke-width:0.71428573px;stroke-linecap:butt;stroke-linejoin:miter;stroke-opacity:1"
     d="M 2,5 H 7"
     id="path876"
     inkscape:connector-curvature="0"
     sodipodi:nodetypes="cc" />
  <path
     sodipodi:nodetypes="cc"
     inkscape:connector-curvature="0"
     id="path1133"
     style="fill:none;stroke:none;stroke-width:1.44547808;stroke-linecap:round;stroke-linejoin:round;stroke-opacity:1"
     d="M 4,5 V 15" />
</svg>
