<?xml version="1.0"?><!DOCTYPE svg PUBLIC "-//W3C//DTD SVG 1.1//EN" "http://www.w3.org/Graphics/SVG/1.1/DTD/svg11.dtd"><svg xmlns="http://www.w3.org/2000/svg" xmlns:xlink="http://www.w3.org/1999/xlink" width="350" height="1000" viewBox="0 0 7 17" >
            
                ['<path class="dot" d="M 3.885,9.318 L 3.885,9.318 C 3.6649999999999996,9.098 3.324,9.098 3.1039999999999996,9.318 L 2.8179999999999996,9.604000000000001 C 2.5979999999999994,9.824 2.5979999999999994,10.165000000000001 2.8179999999999996,10.385000000000002 L 3.1149999999999993,10.682 C 3.3349999999999995,10.902000000000001 3.6759999999999997,10.902000000000001 3.8959999999999995,10.682 L 4.182,10.385000000000002 C 4.402,10.165000000000001 4.402,9.824 4.182,9.604000000000001 L 3.885,9.318000000000001" stroke-linejoin="round"/>', '<path class="dot" d="M 2.885,10.318 L 2.885,10.318 C 2.665,10.098 2.324,10.098 2.1039999999999996,10.318 L 1.8179999999999998,10.604000000000001 C 1.5979999999999999,10.824 1.5979999999999996,11.165000000000001 1.8179999999999998,11.385000000000002 L 2.1149999999999998,11.682 C 2.335,11.902000000000001 2.676,11.902000000000001 2.896,11.682 L 3.1820000000000004,11.385000000000002 C 3.402,11.165000000000001 3.402,10.824 3.1820000000000004,10.604000000000001 L 2.885,10.318000000000001" stroke-linejoin="round"/>', '<path class="dot" d="M 3.885,11.318 L 3.885,11.318 C 3.6649999999999996,11.098 3.324,11.098 3.1039999999999996,11.318 L 2.8179999999999996,11.604000000000001 C 2.5979999999999994,11.824 2.5979999999999994,12.165000000000001 2.8179999999999996,12.385000000000002 L 3.1149999999999993,12.682 C 3.3349999999999995,12.902000000000001 3.6759999999999997,12.902000000000001 3.8959999999999995,12.682 L 4.182,12.385000000000002 C 4.402,12.165000000000001 4.402,11.824 4.182,11.604000000000001 L 3.885,11.318000000000001" stroke-linejoin="round"/>', '<path class="dot" d="M 4.885,10.318 L 4.885,10.318 C 4.664999999999999,10.098 4.324,10.098 4.103999999999999,10.318 L 3.8179999999999996,10.604000000000001 C 3.5979999999999994,10.824 3.5979999999999994,11.165000000000001 3.8179999999999996,11.385000000000002 L 4.114999999999999,11.682 C 4.334999999999999,11.902000000000001 4.676,11.902000000000001 4.895999999999999,11.682 L 5.182,11.385000000000002 C 5.402,11.165000000000001 5.402,10.824 5.182,10.604000000000001 L 4.885,10.318000000000001" stroke-linejoin="round"/>', '<path class="dot" d="M 3.885,9.318 L 3.885,9.318 C 3.6649999999999996,9.098 3.324,9.098 3.1039999999999996,9.318 L 2.8179999999999996,9.604000000000001 C 2.5979999999999994,9.824 2.5979999999999994,10.165000000000001 2.8179999999999996,10.385000000000002 L 3.1149999999999993,10.682 C 3.3349999999999995,10.902000000000001 3.6759999999999997,10.902000000000001 3.8959999999999995,10.682 L 4.182,10.385000000000002 C 4.402,10.165000000000001 4.402,9.824 4.182,9.604000000000001 L 3.885,9.318000000000001" stroke-linejoin="round"/>']
            
                ['<path class="dot" d="M 3.885,-0.6819999999999999 L 3.885,-0.6819999999999999 C 3.6649999999999996,-0.902 3.324,-0.902 3.1039999999999996,-0.6819999999999999 L 2.8179999999999996,-0.3959999999999998 C 2.5979999999999994,-0.17599999999999982 2.5979999999999994,0.16500000000000026 2.8179999999999996,0.38500000000000023 L 3.1149999999999993,0.6819999999999999 C 3.3349999999999995,0.9019999999999999 3.6759999999999997,0.9019999999999999 3.8959999999999995,0.6819999999999999 L 4.182,0.38500000000000023 C 4.402,0.16500000000000004 4.402,-0.17599999999999982 4.182,-0.3959999999999999 L 3.885,-0.6819999999999999" stroke-linejoin="round"/>', '<path class="dot" d="M 3.885,6.3180000000000005 L 3.885,6.3180000000000005 C 3.6649999999999996,6.098000000000001 3.324,6.098000000000001 3.1039999999999996,6.3180000000000005 L 2.8179999999999996,6.604000000000001 C 2.5979999999999994,6.824000000000001 2.5979999999999994,7.165000000000001 2.8179999999999996,7.385000000000001 L 3.1149999999999993,7.682 C 3.3349999999999995,7.902 3.6759999999999997,7.902 3.8959999999999995,7.682 L 4.182,7.385000000000001 C 4.402,7.165000000000001 4.402,6.824000000000001 4.182,6.604000000000001 L 3.885,6.3180000000000005" stroke-linejoin="round"/>']
            
            
            <path d="M 3.5,10.0 L 2.5,11.0 L 3.5,12.0 L 4.5,11.0 L 3.5,10.0" fill="none"
            stroke="black"
            stroke-width="1"
            stroke-linecap="round"
            stroke-linejoin="round"
            />
            
            <path d="M 3.5,0.0 L 3.5,7.0" fill="none"
            stroke="black"
            stroke-width="1"
            stroke-linecap="round"
            stroke-linejoin="round"
            />
            
            
        </svg>