<?xml version="1.0"?><!DOCTYPE svg PUBLIC "-//W3C//DTD SVG 1.1//EN" "http://www.w3.org/Graphics/SVG/1.1/DTD/svg11.dtd"><svg xmlns="http://www.w3.org/2000/svg" xmlns:xlink="http://www.w3.org/1999/xlink" width="350" height="1000" viewBox="0 0 14 40" >
            
                ['<path class="dot" d="M 11.790943877551019,6.777193877551018 L 11.790943877551019,6.777193877551018 C 11.34094387755102,6.327193877551018 10.64344387755102,6.327193877551018 10.193443877551019,6.777193877551018 L 9.60844387755102,7.362193877551018 C 9.158443877551019,7.812193877551018 9.158443877551019,8.509693877551019 9.60844387755102,8.959693877551018 L 10.21594387755102,9.567193877551018 C 10.665943877551019,10.017193877551017 11.363443877551019,10.017193877551017 11.81344387755102,9.567193877551018 L 12.39844387755102,8.959693877551018 C 12.84844387755102,8.509693877551019 12.84844387755102,7.812193877551018 12.39844387755102,7.362193877551018 L 11.790943877551019,6.777193877551018" stroke-linejoin="round"/>', '<path class="dot" d="M 11.790943877551019,20.777193877551017 L 11.790943877551019,20.777193877551017 C 11.34094387755102,20.327193877551018 10.64344387755102,20.327193877551018 10.193443877551019,20.777193877551017 L 9.60844387755102,21.362193877551018 C 9.158443877551019,21.812193877551017 9.158443877551019,22.50969387755102 9.60844387755102,22.959693877551018 L 10.21594387755102,23.56719387755102 C 10.665943877551019,24.01719387755102 11.363443877551019,24.01719387755102 11.81344387755102,23.56719387755102 L 12.39844387755102,22.959693877551018 C 12.84844387755102,22.50969387755102 12.84844387755102,21.812193877551017 12.39844387755102,21.362193877551018 L 11.790943877551019,20.777193877551017" stroke-linejoin="round"/>']
            
                ['<path class="dot" d="M 3.79094387755102,6.777193877551018 L 3.790943877551019,6.777193877551018 C 3.3409438775510187,6.327193877551018 2.643443877551019,6.327193877551018 2.193443877551019,6.777193877551018 L 1.608443877551019,7.362193877551018 C 1.158443877551019,7.812193877551018 1.158443877551019,8.509693877551019 1.608443877551019,8.959693877551018 L 2.2159438775510187,9.567193877551018 C 2.665943877551019,10.017193877551017 3.3634438775510187,10.017193877551017 3.813443877551019,9.567193877551018 L 4.39844387755102,8.959693877551018 C 4.848443877551019,8.509693877551019 4.848443877551019,7.812193877551018 4.39844387755102,7.362193877551018 L 3.79094387755102,6.777193877551018" stroke-linejoin="round"/>', '<path class="dot" d="M 3.7909438775510207,16.777193877551017 L 3.79094387755102,16.777193877551017 C 3.3409438775510205,16.327193877551018 2.6434438775510203,16.327193877551018 2.1934438775510205,16.777193877551017 L 1.6084438775510204,17.362193877551018 C 1.1584438775510204,17.812193877551017 1.1584438775510204,18.50969387755102 1.6084438775510204,18.959693877551018 L 2.2159438775510205,19.56719387755102 C 2.6659438775510202,20.01719387755102 3.3634438775510205,20.01719387755102 3.8134438775510198,19.56719387755102 L 4.398443877551021,18.959693877551018 C 4.848443877551021,18.50969387755102 4.848443877551021,17.812193877551017 4.398443877551021,17.362193877551018 L 3.7909438775510207,16.777193877551017" stroke-linejoin="round"/>', '<path class="dot" d="M 4.790943877551022,19.777193877551017 L 4.790943877551021,19.777193877551017 C 4.340943877551021,19.327193877551018 3.6434438775510207,19.327193877551018 3.193443877551021,19.777193877551017 L 2.608443877551021,20.362193877551018 C 2.1584438775510213,20.812193877551017 2.158443877551021,21.50969387755102 2.608443877551021,21.959693877551018 L 3.215943877551021,22.56719387755102 C 3.6659438775510207,23.01719387755102 4.3634438775510205,23.01719387755102 4.813443877551021,22.56719387755102 L 5.3984438775510215,21.959693877551018 C 5.848443877551022,21.50969387755102 5.848443877551022,20.812193877551017 5.3984438775510215,20.362193877551018 L 4.790943877551022,19.777193877551017" stroke-linejoin="round"/>', '<path class="dot" d="M 5.790943877551022,20.777193877551017 L 5.790943877551021,20.777193877551017 C 5.340943877551021,20.327193877551018 4.643443877551021,20.327193877551018 4.193443877551021,20.777193877551017 L 3.608443877551021,21.362193877551018 C 3.1584438775510213,21.812193877551017 3.158443877551021,22.50969387755102 3.608443877551021,22.959693877551018 L 4.215943877551021,23.56719387755102 C 4.665943877551021,24.01719387755102 5.3634438775510205,24.01719387755102 5.813443877551021,23.56719387755102 L 6.3984438775510215,22.959693877551018 C 6.848443877551022,22.50969387755102 6.848443877551022,21.812193877551017 6.3984438775510215,21.362193877551018 L 5.790943877551022,20.777193877551017" stroke-linejoin="round"/>', '<path class="dot" d="M 7.790943877551022,20.777193877551017 L 7.790943877551021,20.777193877551017 C 7.340943877551021,20.327193877551018 6.643443877551021,20.327193877551018 6.193443877551021,20.777193877551017 L 5.6084438775510215,21.362193877551018 C 5.158443877551021,21.812193877551017 5.158443877551021,22.50969387755102 5.6084438775510215,22.959693877551018 L 6.215943877551021,23.56719387755102 C 6.665943877551021,24.01719387755102 7.3634438775510205,24.01719387755102 7.813443877551021,23.56719387755102 L 8.39844387755102,22.959693877551018 C 8.848443877551022,22.50969387755102 8.848443877551022,21.812193877551017 8.39844387755102,21.362193877551018 L 7.790943877551022,20.777193877551017" stroke-linejoin="round"/>', '<path class="dot" d="M 9.79094387755102,19.777193877551017 L 9.790943877551019,19.777193877551017 C 9.34094387755102,19.327193877551018 8.64344387755102,19.327193877551018 8.19344387755102,19.777193877551017 L 7.608443877551021,20.362193877551018 C 7.15844387755102,20.812193877551017 7.15844387755102,21.50969387755102 7.608443877551021,21.959693877551018 L 8.21594387755102,22.56719387755102 C 8.66594387755102,23.01719387755102 9.36344387755102,23.01719387755102 9.81344387755102,22.56719387755102 L 10.39844387755102,21.959693877551018 C 10.84844387755102,21.50969387755102 10.84844387755102,20.812193877551017 10.39844387755102,20.362193877551018 L 9.79094387755102,19.777193877551017" stroke-linejoin="round"/>', '<path class="dot" d="M 11.790943877551019,16.777193877551017 L 11.790943877551019,16.777193877551017 C 11.34094387755102,16.327193877551018 10.64344387755102,16.327193877551018 10.193443877551019,16.777193877551017 L 9.60844387755102,17.362193877551018 C 9.158443877551019,17.812193877551017 9.158443877551019,18.50969387755102 9.60844387755102,18.959693877551018 L 10.21594387755102,19.56719387755102 C 10.665943877551019,20.01719387755102 11.363443877551019,20.01719387755102 11.81344387755102,19.56719387755102 L 12.39844387755102,18.959693877551018 C 12.84844387755102,18.50969387755102 12.84844387755102,17.812193877551017 12.39844387755102,17.362193877551018 L 11.790943877551019,16.777193877551017" stroke-linejoin="round"/>']
            
                ['<path class="dot" d="M 3.7474655408214383,-1.1518559253032594 L 3.7474655408214375,-1.1518559253032594 C 3.2974655408214373,-1.6018559253032594 2.5999655408214375,-1.6018559253032594 2.1499655408214378,-1.1518559253032594 L 1.5649655408214376,-0.566855925303259 C 1.1149655408214376,-0.11685592530325906 1.1149655408214376,0.580644074696741 1.5649655408214376,1.0306440746967411 L 2.1724655408214373,1.6381440746967406 C 2.6224655408214375,2.08814407469674 3.3199655408214372,2.08814407469674 3.7699655408214374,1.6381440746967406 L 4.354965540821438,1.0306440746967411 C 4.804965540821438,0.580644074696741 4.804965540821438,-0.11685592530325906 4.354965540821438,-0.5668559253032592 L 3.7474655408214383,-1.1518559253032592" stroke-linejoin="round"/>', '<path class="dot" d="M 11.8344221142806,3.706243680405295 L 11.8344221142806,3.706243680405295 C 11.3844221142806,3.256243680405295 10.6869221142806,3.2562436804052948 10.236922114280599,3.706243680405295 L 9.6519221142806,4.291243680405295 C 9.201922114280599,4.7412436804052955 9.201922114280599,5.438743680405295 9.6519221142806,5.8887436804052955 L 10.2594221142806,6.4962436804052945 C 10.7094221142806,6.946243680405295 11.406922114280599,6.946243680405295 11.8569221142806,6.4962436804052945 L 12.441922114280601,5.8887436804052955 C 12.8919221142806,5.438743680405295 12.8919221142806,4.7412436804052955 12.441922114280601,4.291243680405295 L 11.8344221142806,3.7062436804052954" stroke-linejoin="round"/>']
            
            
            <path d="M 11.0,8.0 L 11.0,22.0" fill="none"
            stroke="black"
            stroke-width="2.5"
            stroke-linecap="round"
            stroke-linejoin="round"
            />
            
            <path d="M 2.999999999999999,8.0 L 3.0000000000000004,18.0 L 4.000000000000001,21.0 L 5.000000000000001,22.0 L 7.000000000000001,22.0 L 9.0,21.0 L 11.0,18.0" fill="none"
            stroke="black"
            stroke-width="2.5"
            stroke-linecap="round"
            stroke-linejoin="round"
            />
            
            <path d="M 2.9565216632704177,0.0709501971457227 L 11.04347823672958,4.929049802854277" fill="none"
            stroke="black"
            stroke-width="2.5"
            stroke-linecap="round"
            stroke-linejoin="round"
            />
            
            
        </svg>