<?xml version="1.0" encoding="UTF-8" standalone="no"?>
<svg
   width="4.0000005"
   height="14.000002"
   viewBox="0 0 4.0000005 14.000002"
   version="1.1"
   id="svg25"
   sodipodi:docname="t-excpt.svg"
   inkscape:version="1.3.2 (091e20ef0f, 2023-11-25, custom)"
   xml:space="preserve"
   xmlns:inkscape="http://www.inkscape.org/namespaces/inkscape"
   xmlns:sodipodi="http://sodipodi.sourceforge.net/DTD/sodipodi-0.dtd"
   xmlns="http://www.w3.org/2000/svg"
   xmlns:svg="http://www.w3.org/2000/svg"><defs
   id="defs25" /><sodipodi:namedview
   id="namedview25"
   pagecolor="#ffffff"
   bordercolor="#666666"
   borderopacity="1.0"
   inkscape:showpageshadow="2"
   inkscape:pageopacity="0.0"
   inkscape:pagecheckerboard="0"
   inkscape:deskcolor="#d1d1d1"
   showgrid="true"
   inkscape:zoom="45.254834"
   inkscape:cx="-1.5467961"
   inkscape:cy="6.872194"
   inkscape:window-width="2560"
   inkscape:window-height="1403"
   inkscape:window-x="0"
   inkscape:window-y="0"
   inkscape:window-maximized="1"
   inkscape:current-layer="svg25"
   showguides="true"><inkscape:grid
     id="grid25"
     units="px"
     originx="-0.16"
     originy="-0.039999913"
     spacingx="0.04"
     spacingy="0.04"
     empcolor="#0099e5"
     empopacity="0.30196078"
     color="#0099e5"
     opacity="0.14901961"
     empspacing="5"
     dotted="false"
     gridanglex="30"
     gridanglez="30"
     visible="true" /><sodipodi:guide
     position="-0.1452874,0.47999992"
     orientation="0,-1"
     id="guide29"
     inkscape:locked="false" /><sodipodi:guide
     position="-0.30187149,0.87999991"
     orientation="0,-1"
     id="guide30"
     inkscape:locked="false" /><sodipodi:guide
     position="0.024958394,1.0399999"
     orientation="0,-1"
     id="guide31"
     inkscape:locked="false" /><sodipodi:guide
     position="0.017602094,0.31999993"
     orientation="0,-1"
     id="guide32"
     inkscape:locked="false" /></sodipodi:namedview>
            
                ['', '']
            
                ['', '', '', '', '', '', '', '', '', '']
            
                ['', '', '', '', '', '', '', '', '', '']
            
            
            <path
   d="m 0,0 v 11.000002 l 1,2 1,1 h 2"
   fill="none"
   stroke="#000000"
   stroke-width="1.86716e+08"
   stroke-linecap="round"
   stroke-linejoin="round"
   id="path8"
   style="stroke:none;stroke-width:1.00001"
   sodipodi:nodetypes="ccccc"
   inkscape:label="path8" /></svg>
