<?xml version="1.0"?><!DOCTYPE svg PUBLIC "-//W3C//DTD SVG 1.1//EN" "http://www.w3.org/Graphics/SVG/1.1/DTD/svg11.dtd"><svg xmlns="http://www.w3.org/2000/svg" xmlns:xlink="http://www.w3.org/1999/xlink" width="350" height="1000" viewBox="0 0 14 40" >
            
                ['<path class="dot" d="M 7.790943877551021,20.777193877551017 L 7.79094387755102,20.777193877551017 C 7.34094387755102,20.327193877551018 6.64344387755102,20.327193877551018 6.1934438775510205,20.777193877551017 L 5.608443877551021,21.362193877551018 C 5.15844387755102,21.812193877551017 5.15844387755102,22.50969387755102 5.608443877551021,22.959693877551018 L 6.21594387755102,23.56719387755102 C 6.66594387755102,24.01719387755102 7.3634438775510205,24.01719387755102 7.81344387755102,23.56719387755102 L 8.39844387755102,22.959693877551018 C 8.84844387755102,22.50969387755102 8.84844387755102,21.812193877551017 8.39844387755102,21.362193877551018 L 7.790943877551021,20.777193877551017" stroke-linejoin="round"/>', '<path class="dot" d="M 9.79094387755102,19.777193877551017 L 9.790943877551019,19.777193877551017 C 9.34094387755102,19.327193877551018 8.64344387755102,19.327193877551018 8.19344387755102,19.777193877551017 L 7.608443877551021,20.362193877551018 C 7.15844387755102,20.812193877551017 7.15844387755102,21.50969387755102 7.608443877551021,21.959693877551018 L 8.21594387755102,22.56719387755102 C 8.66594387755102,23.01719387755102 9.36344387755102,23.01719387755102 9.81344387755102,22.56719387755102 L 10.39844387755102,21.959693877551018 C 10.84844387755102,21.50969387755102 10.84844387755102,20.812193877551017 10.39844387755102,20.362193877551018 L 9.79094387755102,19.777193877551017" stroke-linejoin="round"/>', '<path class="dot" d="M 7.790943877551021,18.777193877551017 L 7.79094387755102,18.777193877551017 C 7.34094387755102,18.327193877551018 6.64344387755102,18.327193877551018 6.1934438775510205,18.777193877551017 L 5.608443877551021,19.362193877551018 C 5.15844387755102,19.812193877551017 5.15844387755102,20.50969387755102 5.608443877551021,20.959693877551018 L 6.21594387755102,21.56719387755102 C 6.66594387755102,22.01719387755102 7.3634438775510205,22.01719387755102 7.81344387755102,21.56719387755102 L 8.39844387755102,20.959693877551018 C 8.84844387755102,20.50969387755102 8.84844387755102,19.812193877551017 8.39844387755102,19.362193877551018 L 7.790943877551021,18.777193877551017" stroke-linejoin="round"/>', '<path class="dot" d="M 5.790943877551021,19.777193877551017 L 5.79094387755102,19.777193877551017 C 5.34094387755102,19.327193877551018 4.64344387755102,19.327193877551018 4.1934438775510205,19.777193877551017 L 3.60844387755102,20.362193877551018 C 3.1584438775510204,20.812193877551017 3.15844387755102,21.50969387755102 3.60844387755102,21.959693877551018 L 4.21594387755102,22.56719387755102 C 4.66594387755102,23.01719387755102 5.3634438775510205,23.01719387755102 5.81344387755102,22.56719387755102 L 6.398443877551021,21.959693877551018 C 6.84844387755102,21.50969387755102 6.84844387755102,20.812193877551017 6.398443877551021,20.362193877551018 L 5.790943877551021,19.777193877551017" stroke-linejoin="round"/>', '<path class="dot" d="M 7.790943877551021,20.777193877551017 L 7.79094387755102,20.777193877551017 C 7.34094387755102,20.327193877551018 6.64344387755102,20.327193877551018 6.1934438775510205,20.777193877551017 L 5.608443877551021,21.362193877551018 C 5.15844387755102,21.812193877551017 5.15844387755102,22.50969387755102 5.608443877551021,22.959693877551018 L 6.21594387755102,23.56719387755102 C 6.66594387755102,24.01719387755102 7.3634438775510205,24.01719387755102 7.81344387755102,23.56719387755102 L 8.39844387755102,22.959693877551018 C 8.84844387755102,22.50969387755102 8.84844387755102,21.812193877551017 8.39844387755102,21.362193877551018 L 7.790943877551021,20.777193877551017" stroke-linejoin="round"/>']
            
                ['<path class="dot" d="M 7.790943877551021,-0.22280612244898207 L 7.79094387755102,-0.22280612244898207 C 7.34094387755102,-0.6728061224489821 6.64344387755102,-0.6728061224489822 6.1934438775510205,-0.22280612244898207 L 5.608443877551021,0.3621938775510183 C 5.15844387755102,0.8121938775510182 5.15844387755102,1.5096938775510182 5.608443877551021,1.9596938775510184 L 6.21594387755102,2.567193877551018 C 6.66594387755102,3.0171938775510174 7.3634438775510205,3.0171938775510174 7.81344387755102,2.567193877551018 L 8.39844387755102,1.9596938775510184 C 8.84844387755102,1.5096938775510182 8.84844387755102,0.8121938775510182 8.39844387755102,0.36219387755101806 L 7.790943877551021,-0.2228061224489819" stroke-linejoin="round"/>', '<path class="dot" d="M 7.790943877551021,13.777193877551019 L 7.79094387755102,13.777193877551019 C 7.34094387755102,13.327193877551018 6.64344387755102,13.327193877551018 6.1934438775510205,13.777193877551019 L 5.608443877551021,14.362193877551018 C 5.15844387755102,14.81219387755102 5.15844387755102,15.509693877551019 5.608443877551021,15.959693877551018 L 6.21594387755102,16.56719387755102 C 6.66594387755102,17.01719387755102 7.3634438775510205,17.01719387755102 7.81344387755102,16.56719387755102 L 8.39844387755102,15.959693877551018 C 8.84844387755102,15.509693877551019 8.84844387755102,14.81219387755102 8.39844387755102,14.362193877551018 L 7.790943877551021,13.777193877551019" stroke-linejoin="round"/>']
            
            
            <path d="M 7.0,22.0 L 9.0,21.0 L 7.0,20.0 L 5.0,21.0 L 7.0,22.0" fill="none"
            stroke="black"
            stroke-width="2.5"
            stroke-linecap="round"
            stroke-linejoin="round"
            />
            
            <path d="M 7.0,1.0 L 7.0,15.0" fill="none"
            stroke="black"
            stroke-width="2.5"
            stroke-linecap="round"
            stroke-linejoin="round"
            />
            
            
        </svg>