<?xml version="1.0"?><!DOCTYPE svg PUBLIC "-//W3C//DTD SVG 1.1//EN" "http://www.w3.org/Graphics/SVG/1.1/DTD/svg11.dtd"><svg xmlns="http://www.w3.org/2000/svg" xmlns:xlink="http://www.w3.org/1999/xlink" width="350" height="1000" viewBox="0 0 14 40" >
            
                ['<path class="dot" d="M 8.79094387755102,-0.22280612244898207 L 8.790943877551019,-0.22280612244898207 C 8.34094387755102,-0.6728061224489821 7.64344387755102,-0.6728061224489822 7.1934438775510205,-0.22280612244898207 L 6.608443877551021,0.3621938775510183 C 6.15844387755102,0.8121938775510182 6.15844387755102,1.5096938775510182 6.608443877551021,1.9596938775510184 L 7.21594387755102,2.567193877551018 C 7.66594387755102,3.0171938775510174 8.36344387755102,3.0171938775510174 8.81344387755102,2.567193877551018 L 9.39844387755102,1.9596938775510184 C 9.84844387755102,1.5096938775510182 9.84844387755102,0.8121938775510182 9.39844387755102,0.36219387755101806 L 8.79094387755102,-0.2228061224489819" stroke-linejoin="round"/>', '<path class="dot" d="M 12.790943877551019,-0.22280612244898207 L 12.790943877551019,-0.22280612244898207 C 12.34094387755102,-0.6728061224489821 11.64344387755102,-0.6728061224489822 11.193443877551019,-0.22280612244898207 L 10.60844387755102,0.3621938775510183 C 10.158443877551019,0.8121938775510182 10.158443877551019,1.5096938775510182 10.60844387755102,1.9596938775510184 L 11.21594387755102,2.567193877551018 C 11.665943877551019,3.0171938775510174 12.363443877551019,3.0171938775510174 12.81344387755102,2.567193877551018 L 13.39844387755102,1.9596938775510184 C 13.84844387755102,1.5096938775510182 13.84844387755102,0.8121938775510182 13.39844387755102,0.36219387755101806 L 12.790943877551019,-0.2228061224489819" stroke-linejoin="round"/>', '<path class="dot" d="M 4.79094377755102,7.777193877551018 L 4.7909437775510195,7.777193877551018 C 4.34094377755102,7.327193877551018 3.6434437775510196,7.327193877551018 3.19344377755102,7.777193877551018 L 2.60844377755102,8.362193877551018 C 2.15844377755102,8.812193877551017 2.1584437775510197,9.509693877551019 2.60844377755102,9.959693877551018 L 3.21594377755102,10.567193877551018 C 3.6659437775510195,11.017193877551017 4.363443777551019,11.017193877551017 4.8134437775510195,10.567193877551018 L 5.39844377755102,9.959693877551018 C 5.8484437775510205,9.509693877551019 5.8484437775510205,8.812193877551017 5.39844377755102,8.362193877551018 L 4.79094377755102,7.777193877551018" stroke-linejoin="round"/>', '<path class="dot" d="M 3.7909438775510207,12.777193877551019 L 3.79094387755102,12.777193877551019 C 3.3409438775510196,12.327193877551018 2.64344387755102,12.327193877551018 2.19344387755102,12.777193877551019 L 1.60844387755102,13.362193877551018 C 1.15844387755102,13.81219387755102 1.15844387755102,14.509693877551019 1.60844387755102,14.959693877551018 L 2.2159438775510196,15.567193877551018 C 2.66594387755102,16.01719387755102 3.3634438775510196,16.01719387755102 3.8134438775510198,15.567193877551018 L 4.398443877551021,14.959693877551018 C 4.84844387755102,14.509693877551019 4.84844387755102,13.81219387755102 4.398443877551021,13.362193877551018 L 3.7909438775510207,12.777193877551019" stroke-linejoin="round"/>', '<path class="dot" d="M 12.790943877551019,12.777193877551019 L 12.790943877551019,12.777193877551019 C 12.34094387755102,12.327193877551018 11.64344387755102,12.327193877551018 11.193443877551019,12.777193877551019 L 10.60844387755102,13.362193877551018 C 10.158443877551019,13.81219387755102 10.158443877551019,14.509693877551019 10.60844387755102,14.959693877551018 L 11.21594387755102,15.567193877551018 C 11.665943877551019,16.01719387755102 12.363443877551019,16.01719387755102 12.81344387755102,15.567193877551018 L 13.39844387755102,14.959693877551018 C 13.84844387755102,14.509693877551019 13.84844387755102,13.81219387755102 13.39844387755102,13.362193877551018 L 12.790943877551019,12.777193877551019" stroke-linejoin="round"/>']
            
            
            <path d="M 8.0,1.0 L 4.0000001,22.0 M 12.0,1.0 L 7.9999999,22.0 M 3.9999998999999997,9.0 L 13.0,9.0 M 3.0,14.0 L 12.0,14.0" fill="none"
            stroke="black"
            stroke-width="2.5"
            stroke-linecap="round"
            stroke-linejoin="round"
            />
            
            
        </svg>