<?xml version="1.0"?><!DOCTYPE svg PUBLIC "-//W3C//DTD SVG 1.1//EN" "http://www.w3.org/Graphics/SVG/1.1/DTD/svg11.dtd"><svg xmlns="http://www.w3.org/2000/svg" xmlns:xlink="http://www.w3.org/1999/xlink" width="350" height="1000" viewBox="0 0 10 26" >
            
                ['<path class="dot" d="M 5.519583333333333,14.140270833333332 L 5.519583333333333,14.140270833333332 C 5.229583333333333,13.850270833333333 4.780083333333333,13.850270833333333 4.490083333333333,14.140270833333332 L 4.113083333333333,14.517270833333333 C 3.823083333333333,14.807270833333334 3.823083333333333,15.256770833333333 4.113083333333333,15.546770833333333 L 4.504583333333333,15.938270833333332 C 4.794583333333333,16.228270833333333 5.244083333333333,16.228270833333333 5.534083333333333,15.938270833333332 L 5.911083333333334,15.546770833333333 C 6.201083333333333,15.256770833333333 6.201083333333333,14.807270833333334 5.911083333333334,14.517270833333333 L 5.519583333333333,14.140270833333332" stroke-linejoin="round"/>', '<path class="dot" d="M 5.519583333333333,0.1402708333333331 L 5.519583333333333,0.1402708333333331 C 5.229583333333333,-0.14972916666666694 4.780083333333333,-0.149729166666667 4.490083333333333,0.1402708333333331 L 4.113083333333333,0.5172708333333332 C 3.823083333333333,0.8072708333333332 3.823083333333333,1.2567708333333332 4.113083333333333,1.5467708333333332 L 4.504583333333333,1.938270833333333 C 4.794583333333333,2.228270833333333 5.244083333333333,2.228270833333333 5.534083333333333,1.938270833333333 L 5.911083333333334,1.5467708333333332 C 6.201083333333333,1.2567708333333332 6.201083333333333,0.8072708333333333 5.911083333333334,0.5172708333333331 L 5.519583333333333,0.14027083333333312" stroke-linejoin="round"/>']
            
                ['<path class="dot" d="M 3.5195833333333333,14.140270833333332 L 3.5195833333333333,14.140270833333332 C 3.2295833333333333,13.850270833333333 2.7800833333333332,13.850270833333333 2.490083333333333,14.140270833333332 L 2.113083333333333,14.517270833333333 C 1.8230833333333332,14.807270833333334 1.8230833333333332,15.256770833333333 2.113083333333333,15.546770833333333 L 2.504583333333333,15.938270833333332 C 2.7945833333333328,16.228270833333333 3.244083333333333,16.228270833333333 3.5340833333333332,15.938270833333332 L 3.9110833333333335,15.546770833333333 C 4.201083333333333,15.256770833333333 4.201083333333333,14.807270833333334 3.9110833333333335,14.517270833333333 L 3.5195833333333333,14.140270833333332" stroke-linejoin="round"/>', '<path class="dot" d="M 7.519583333333333,14.140270833333332 L 7.519583333333332,14.140270833333332 C 7.229583333333332,13.850270833333333 6.780083333333333,13.850270833333333 6.490083333333333,14.140270833333332 L 6.113083333333333,14.517270833333333 C 5.823083333333333,14.807270833333334 5.823083333333333,15.256770833333333 6.113083333333333,15.546770833333333 L 6.504583333333333,15.938270833333332 C 6.794583333333333,16.228270833333333 7.244083333333332,16.228270833333333 7.534083333333332,15.938270833333332 L 7.911083333333333,15.546770833333333 C 8.201083333333333,15.256770833333333 8.201083333333333,14.807270833333334 7.911083333333333,14.517270833333333 L 7.519583333333333,14.140270833333332" stroke-linejoin="round"/>']
            
                ['<path class="dot" d="M 3.5195833333333333,0.1402708333333331 L 3.5195833333333333,0.1402708333333331 C 3.2295833333333333,-0.14972916666666694 2.7800833333333332,-0.149729166666667 2.490083333333333,0.1402708333333331 L 2.113083333333333,0.5172708333333332 C 1.8230833333333332,0.8072708333333332 1.8230833333333332,1.2567708333333332 2.113083333333333,1.5467708333333332 L 2.504583333333333,1.938270833333333 C 2.7945833333333328,2.228270833333333 3.244083333333333,2.228270833333333 3.5340833333333332,1.938270833333333 L 3.9110833333333335,1.5467708333333332 C 4.201083333333333,1.2567708333333332 4.201083333333333,0.8072708333333333 3.9110833333333335,0.5172708333333331 L 3.5195833333333333,0.14027083333333312" stroke-linejoin="round"/>', '<path class="dot" d="M 7.519583333333333,0.1402708333333331 L 7.519583333333332,0.1402708333333331 C 7.229583333333332,-0.14972916666666694 6.780083333333333,-0.149729166666667 6.490083333333333,0.1402708333333331 L 6.113083333333333,0.5172708333333332 C 5.823083333333333,0.8072708333333332 5.823083333333333,1.2567708333333332 6.113083333333333,1.5467708333333332 L 6.504583333333333,1.938270833333333 C 6.794583333333333,2.228270833333333 7.244083333333332,2.228270833333333 7.534083333333332,1.938270833333333 L 7.911083333333333,1.5467708333333332 C 8.201083333333333,1.2567708333333332 8.201083333333333,0.8072708333333333 7.911083333333333,0.5172708333333331 L 7.519583333333333,0.14027083333333312" stroke-linejoin="round"/>']
            
                ['<path class="dot" d="M 3.5349959961768382,-3.8899778206811404 L 3.5349959961768382,-3.8899778206811404 C 3.244995996176838,-4.17997782068114 2.795495996176838,-4.17997782068114 2.505495996176838,-3.8899778206811404 L 2.128495996176838,-3.51297782068114 C 1.8384959961768381,-3.22297782068114 1.8384959961768381,-2.77347782068114 2.128495996176838,-2.48347782068114 L 2.519995996176838,-2.0919778206811404 C 2.8099959961768377,-1.8019778206811403 3.259495996176838,-1.8019778206811403 3.549495996176838,-2.0919778206811404 L 3.9264959961768384,-2.48347782068114 C 4.216495996176839,-2.77347782068114 4.216495996176839,-3.22297782068114 3.9264959961768384,-3.51297782068114 L 3.5349959961768382,-3.88997782068114" stroke-linejoin="round"/>', '<path class="dot" d="M 7.504170670489827,-1.8294801126521956 L 7.5041706704898266,-1.8294801126521956 C 7.2141706704898265,-2.119480112652196 6.764670670489827,-2.119480112652196 6.474670670489827,-1.8294801126521956 L 6.097670670489827,-1.4524801126521956 C 5.807670670489827,-1.1624801126521955 5.807670670489827,-0.7129801126521955 6.097670670489827,-0.4229801126521955 L 6.489170670489827,-0.031480112652195746 C 6.779170670489827,0.2585198873478043 7.2286706704898265,0.2585198873478043 7.5186706704898265,-0.031480112652195746 L 7.895670670489827,-0.4229801126521955 C 8.185670670489827,-0.7129801126521955 8.185670670489827,-1.1624801126521955 7.895670670489827,-1.4524801126521956 L 7.504170670489827,-1.8294801126521956" stroke-linejoin="round"/>']
            
            
            <path d="M 5.0,15.0 L 5.0,1.0" fill="none"
            stroke="black"
            stroke-width="1.5"
            stroke-linecap="round"
            stroke-linejoin="round"
            />
            
            <path d="M 3.0,15.0 L 7.0,15.0" fill="none"
            stroke="black"
            stroke-width="1.5"
            stroke-linecap="round"
            stroke-linejoin="round"
            />
            
            <path d="M 3.0,1.0 L 7.0,1.0" fill="none"
            stroke="black"
            stroke-width="1.5"
            stroke-linecap="round"
            stroke-linejoin="round"
            />
            
            <path d="M 3.015412662843505,-3.030248654014473 L 6.984587337156494,-0.9697509459855285" fill="none"
            stroke="black"
            stroke-width="1.5"
            stroke-linecap="round"
            stroke-linejoin="round"
            />
            
            
        </svg>