<?xml version="1.0"?><!DOCTYPE svg PUBLIC "-//W3C//DTD SVG 1.1//EN" "http://www.w3.org/Graphics/SVG/1.1/DTD/svg11.dtd"><svg xmlns="http://www.w3.org/2000/svg" xmlns:xlink="http://www.w3.org/1999/xlink" width="350" height="1000" viewBox="0 0 10 26" >
            
                ['<path class="dot" d="M 3.5195833333333333,5.140270833333333 L 3.5195833333333333,5.140270833333333 C 3.2295833333333333,4.850270833333333 2.7800833333333332,4.850270833333333 2.490083333333333,5.140270833333333 L 2.113083333333333,5.517270833333333 C 1.8230833333333332,5.807270833333333 1.8230833333333332,6.2567708333333325 2.113083333333333,6.546770833333333 L 2.504583333333333,6.938270833333332 C 2.7945833333333328,7.228270833333333 3.244083333333333,7.228270833333333 3.5340833333333332,6.938270833333332 L 3.9110833333333335,6.546770833333333 C 4.201083333333333,6.2567708333333325 4.201083333333333,5.807270833333333 3.9110833333333335,5.517270833333333 L 3.5195833333333333,5.140270833333333" stroke-linejoin="round"/>', '<path class="dot" d="M 2.5195833333333333,8.140270833333332 L 2.5195833333333333,8.140270833333332 C 2.2295833333333333,7.850270833333333 1.7800833333333332,7.850270833333333 1.4900833333333332,8.140270833333332 L 1.1130833333333332,8.517270833333333 C 0.8230833333333332,8.807270833333334 0.8230833333333331,9.256770833333333 1.1130833333333332,9.546770833333333 L 1.5045833333333332,9.938270833333332 C 1.794583333333333,10.228270833333333 2.244083333333333,10.228270833333333 2.5340833333333332,9.938270833333332 L 2.9110833333333335,9.546770833333333 C 3.2010833333333335,9.256770833333333 3.2010833333333335,8.807270833333334 2.9110833333333335,8.517270833333333 L 2.5195833333333333,8.140270833333332" stroke-linejoin="round"/>', '<path class="dot" d="M 2.5195833333333333,10.140270833333332 L 2.5195833333333333,10.140270833333332 C 2.2295833333333333,9.850270833333333 1.7800833333333332,9.850270833333333 1.4900833333333332,10.140270833333332 L 1.1130833333333332,10.517270833333333 C 0.8230833333333332,10.807270833333334 0.8230833333333331,11.256770833333333 1.1130833333333332,11.546770833333333 L 1.5045833333333332,11.938270833333332 C 1.794583333333333,12.228270833333333 2.244083333333333,12.228270833333333 2.5340833333333332,11.938270833333332 L 2.9110833333333335,11.546770833333333 C 3.2010833333333335,11.256770833333333 3.2010833333333335,10.807270833333334 2.9110833333333335,10.517270833333333 L 2.5195833333333333,10.140270833333332" stroke-linejoin="round"/>', '<path class="dot" d="M 3.5195833333333333,13.140270833333332 L 3.5195833333333333,13.140270833333332 C 3.2295833333333333,12.850270833333333 2.7800833333333332,12.850270833333333 2.490083333333333,13.140270833333332 L 2.113083333333333,13.517270833333333 C 1.8230833333333332,13.807270833333334 1.8230833333333332,14.256770833333333 2.113083333333333,14.546770833333333 L 2.504583333333333,14.938270833333332 C 2.7945833333333328,15.228270833333333 3.244083333333333,15.228270833333333 3.5340833333333332,14.938270833333332 L 3.9110833333333335,14.546770833333333 C 4.201083333333333,14.256770833333333 4.201083333333333,13.807270833333334 3.9110833333333335,13.517270833333333 L 3.5195833333333333,13.140270833333332" stroke-linejoin="round"/>', '<path class="dot" d="M 4.519583333333333,14.140270833333332 L 4.519583333333333,14.140270833333332 C 4.229583333333333,13.850270833333333 3.7800833333333332,13.850270833333333 3.490083333333333,14.140270833333332 L 3.113083333333333,14.517270833333333 C 2.823083333333333,14.807270833333334 2.823083333333333,15.256770833333333 3.113083333333333,15.546770833333333 L 3.504583333333333,15.938270833333332 C 3.7945833333333328,16.228270833333333 4.244083333333333,16.228270833333333 4.534083333333333,15.938270833333332 L 4.911083333333334,15.546770833333333 C 5.201083333333333,15.256770833333333 5.201083333333333,14.807270833333334 4.911083333333334,14.517270833333333 L 4.519583333333333,14.140270833333332" stroke-linejoin="round"/>', '<path class="dot" d="M 6.519583333333333,14.140270833333332 L 6.519583333333332,14.140270833333332 C 6.229583333333332,13.850270833333333 5.780083333333333,13.850270833333333 5.490083333333333,14.140270833333332 L 5.113083333333333,14.517270833333333 C 4.823083333333333,14.807270833333334 4.823083333333333,15.256770833333333 5.113083333333333,15.546770833333333 L 5.504583333333333,15.938270833333332 C 5.794583333333333,16.228270833333333 6.244083333333332,16.228270833333333 6.534083333333332,15.938270833333332 L 6.911083333333333,15.546770833333333 C 7.201083333333333,15.256770833333333 7.201083333333333,14.807270833333334 6.911083333333333,14.517270833333333 L 6.519583333333333,14.140270833333332" stroke-linejoin="round"/>', '<path class="dot" d="M 7.519583333333333,13.140270833333332 L 7.519583333333332,13.140270833333332 C 7.229583333333332,12.850270833333333 6.780083333333333,12.850270833333333 6.490083333333333,13.140270833333332 L 6.113083333333333,13.517270833333333 C 5.823083333333333,13.807270833333334 5.823083333333333,14.256770833333333 6.113083333333333,14.546770833333333 L 6.504583333333333,14.938270833333332 C 6.794583333333333,15.228270833333333 7.244083333333332,15.228270833333333 7.534083333333332,14.938270833333332 L 7.911083333333333,14.546770833333333 C 8.201083333333333,14.256770833333333 8.201083333333333,13.807270833333334 7.911083333333333,13.517270833333333 L 7.519583333333333,13.140270833333332" stroke-linejoin="round"/>', '<path class="dot" d="M 8.519583333333333,10.140270833333332 L 8.519583333333333,10.140270833333332 C 8.229583333333332,9.850270833333333 7.780083333333333,9.850270833333333 7.490083333333333,10.140270833333332 L 7.113083333333333,10.517270833333333 C 6.823083333333333,10.807270833333334 6.823083333333333,11.256770833333333 7.113083333333333,11.546770833333333 L 7.504583333333333,11.938270833333332 C 7.794583333333333,12.228270833333333 8.244083333333332,12.228270833333333 8.534083333333333,11.938270833333332 L 8.911083333333334,11.546770833333333 C 9.201083333333333,11.256770833333333 9.201083333333333,10.807270833333334 8.911083333333334,10.517270833333333 L 8.519583333333333,10.140270833333332" stroke-linejoin="round"/>', '<path class="dot" d="M 8.519583333333333,8.140270833333332 L 8.519583333333333,8.140270833333332 C 8.229583333333332,7.850270833333333 7.780083333333333,7.850270833333333 7.490083333333333,8.140270833333332 L 7.113083333333333,8.517270833333333 C 6.823083333333333,8.807270833333334 6.823083333333333,9.256770833333333 7.113083333333333,9.546770833333333 L 7.504583333333333,9.938270833333332 C 7.794583333333333,10.228270833333333 8.244083333333332,10.228270833333333 8.534083333333333,9.938270833333332 L 8.911083333333334,9.546770833333333 C 9.201083333333333,9.256770833333333 9.201083333333333,8.807270833333334 8.911083333333334,8.517270833333333 L 8.519583333333333,8.140270833333332" stroke-linejoin="round"/>', '<path class="dot" d="M 7.519583333333333,5.140270833333333 L 7.519583333333332,5.140270833333333 C 7.229583333333332,4.850270833333333 6.780083333333333,4.850270833333333 6.490083333333333,5.140270833333333 L 6.113083333333333,5.517270833333333 C 5.823083333333333,5.807270833333333 5.823083333333333,6.2567708333333325 6.113083333333333,6.546770833333333 L 6.504583333333333,6.938270833333332 C 6.794583333333333,7.228270833333333 7.244083333333332,7.228270833333333 7.534083333333332,6.938270833333332 L 7.911083333333333,6.546770833333333 C 8.201083333333333,6.2567708333333325 8.201083333333333,5.807270833333333 7.911083333333333,5.517270833333333 L 7.519583333333333,5.140270833333333" stroke-linejoin="round"/>', '<path class="dot" d="M 6.519583333333333,4.140270833333333 L 6.519583333333332,4.140270833333333 C 6.229583333333332,3.8502708333333326 5.780083333333333,3.8502708333333326 5.490083333333333,4.140270833333333 L 5.113083333333333,4.517270833333333 C 4.823083333333333,4.807270833333333 4.823083333333333,5.2567708333333325 5.113083333333333,5.546770833333333 L 5.504583333333333,5.938270833333332 C 5.794583333333333,6.228270833333333 6.244083333333332,6.228270833333333 6.534083333333332,5.938270833333332 L 6.911083333333333,5.546770833333333 C 7.201083333333333,5.2567708333333325 7.201083333333333,4.807270833333333 6.911083333333333,4.517270833333333 L 6.519583333333333,4.140270833333333" stroke-linejoin="round"/>', '<path class="dot" d="M 4.519583333333333,4.140270833333333 L 4.519583333333333,4.140270833333333 C 4.229583333333333,3.8502708333333326 3.7800833333333332,3.8502708333333326 3.490083333333333,4.140270833333333 L 3.113083333333333,4.517270833333333 C 2.823083333333333,4.807270833333333 2.823083333333333,5.2567708333333325 3.113083333333333,5.546770833333333 L 3.504583333333333,5.938270833333332 C 3.7945833333333328,6.228270833333333 4.244083333333333,6.228270833333333 4.534083333333333,5.938270833333332 L 4.911083333333334,5.546770833333333 C 5.201083333333333,5.2567708333333325 5.201083333333333,4.807270833333333 4.911083333333334,4.517270833333333 L 4.519583333333333,4.140270833333333" stroke-linejoin="round"/>', '<path class="dot" d="M 6.519583333333333,7.140270833333333 L 6.519583333333332,7.140270833333333 C 6.229583333333332,6.850270833333333 5.780083333333333,6.850270833333333 5.490083333333333,7.140270833333333 L 5.113083333333333,7.517270833333333 C 4.823083333333333,7.807270833333333 4.823083333333333,8.256770833333333 5.113083333333333,8.546770833333333 L 5.504583333333333,8.938270833333332 C 5.794583333333333,9.228270833333333 6.244083333333332,9.228270833333333 6.534083333333332,8.938270833333332 L 6.911083333333333,8.546770833333333 C 7.201083333333333,8.256770833333333 7.201083333333333,7.807270833333333 6.911083333333333,7.517270833333333 L 6.519583333333333,7.140270833333333" stroke-linejoin="round"/>', '<path class="dot" d="M 5.519583333333333,7.140270833333333 L 5.519583333333333,7.140270833333333 C 5.229583333333333,6.850270833333333 4.780083333333333,6.850270833333333 4.490083333333333,7.140270833333333 L 4.113083333333333,7.517270833333333 C 3.823083333333333,7.807270833333333 3.823083333333333,8.256770833333333 4.113083333333333,8.546770833333333 L 4.504583333333333,8.938270833333332 C 4.794583333333333,9.228270833333333 5.244083333333333,9.228270833333333 5.534083333333333,8.938270833333332 L 5.911083333333334,8.546770833333333 C 6.201083333333333,8.256770833333333 6.201083333333333,7.807270833333333 5.911083333333334,7.517270833333333 L 5.519583333333333,7.140270833333333" stroke-linejoin="round"/>', '<path class="dot" d="M 4.519583333333333,8.140270833333332 L 4.519583333333333,8.140270833333332 C 4.229583333333333,7.850270833333333 3.7800833333333332,7.850270833333333 3.490083333333333,8.140270833333332 L 3.113083333333333,8.517270833333333 C 2.823083333333333,8.807270833333334 2.823083333333333,9.256770833333333 3.113083333333333,9.546770833333333 L 3.504583333333333,9.938270833333332 C 3.7945833333333328,10.228270833333333 4.244083333333333,10.228270833333333 4.534083333333333,9.938270833333332 L 4.911083333333334,9.546770833333333 C 5.201083333333333,9.256770833333333 5.201083333333333,8.807270833333334 4.911083333333334,8.517270833333333 L 4.519583333333333,8.140270833333332" stroke-linejoin="round"/>', '<path class="dot" d="M 4.519583333333333,10.140270833333332 L 4.519583333333333,10.140270833333332 C 4.229583333333333,9.850270833333333 3.7800833333333332,9.850270833333333 3.490083333333333,10.140270833333332 L 3.113083333333333,10.517270833333333 C 2.823083333333333,10.807270833333334 2.823083333333333,11.256770833333333 3.113083333333333,11.546770833333333 L 3.504583333333333,11.938270833333332 C 3.7945833333333328,12.228270833333333 4.244083333333333,12.228270833333333 4.534083333333333,11.938270833333332 L 4.911083333333334,11.546770833333333 C 5.201083333333333,11.256770833333333 5.201083333333333,10.807270833333334 4.911083333333334,10.517270833333333 L 4.519583333333333,10.140270833333332" stroke-linejoin="round"/>', '<path class="dot" d="M 5.519583333333333,11.140270833333332 L 5.519583333333333,11.140270833333332 C 5.229583333333333,10.850270833333333 4.780083333333333,10.850270833333333 4.490083333333333,11.140270833333332 L 4.113083333333333,11.517270833333333 C 3.823083333333333,11.807270833333334 3.823083333333333,12.256770833333333 4.113083333333333,12.546770833333333 L 4.504583333333333,12.938270833333332 C 4.794583333333333,13.228270833333333 5.244083333333333,13.228270833333333 5.534083333333333,12.938270833333332 L 5.911083333333334,12.546770833333333 C 6.201083333333333,12.256770833333333 6.201083333333333,11.807270833333334 5.911083333333334,11.517270833333333 L 5.519583333333333,11.140270833333332" stroke-linejoin="round"/>', '<path class="dot" d="M 6.519583333333333,11.140270833333332 L 6.519583333333332,11.140270833333332 C 6.229583333333332,10.850270833333333 5.780083333333333,10.850270833333333 5.490083333333333,11.140270833333332 L 5.113083333333333,11.517270833333333 C 4.823083333333333,11.807270833333334 4.823083333333333,12.256770833333333 5.113083333333333,12.546770833333333 L 5.504583333333333,12.938270833333332 C 5.794583333333333,13.228270833333333 6.244083333333332,13.228270833333333 6.534083333333332,12.938270833333332 L 6.911083333333333,12.546770833333333 C 7.201083333333333,12.256770833333333 7.201083333333333,11.807270833333334 6.911083333333333,11.517270833333333 L 6.519583333333333,11.140270833333332" stroke-linejoin="round"/>']
            
            
            <path d="M 3.0,6.0 L 2.0,9.0 L 2.0,11.0 L 3.0,14.0 L 4.0,15.0 L 6.0,15.0 L 7.0,14.0 L 8.0,11.0 L 8.0,9.0 L 7.0,6.0 L 6.0,5.0 L 4.0,5.0 L 3.0,6.0 M 6.0,8.0 L 5.0,8.0 L 4.0,9.0 L 4.0,11.0 L 5.0,12.0 L 6.0,12.0" fill="none"
            stroke="black"
            stroke-width="1.5"
            stroke-linecap="round"
            stroke-linejoin="round"
            />
            
            
        </svg>