<?xml version="1.0"?><!DOCTYPE svg PUBLIC "-//W3C//DTD SVG 1.1//EN" "http://www.w3.org/Graphics/SVG/1.1/DTD/svg11.dtd"><svg xmlns="http://www.w3.org/2000/svg" xmlns:xlink="http://www.w3.org/1999/xlink" width="350" height="1000" viewBox="0 0 10 26" >
            
                ['<path class="dot" d="M 5.519583333333333,14.140270833333332 L 5.519583333333333,14.140270833333332 C 5.229583333333333,13.850270833333333 4.780083333333333,13.850270833333333 4.490083333333333,14.140270833333332 L 4.113083333333333,14.517270833333333 C 3.823083333333333,14.807270833333334 3.823083333333333,15.256770833333333 4.113083333333333,15.546770833333333 L 4.504583333333333,15.938270833333332 C 4.794583333333333,16.228270833333333 5.244083333333333,16.228270833333333 5.534083333333333,15.938270833333332 L 5.911083333333334,15.546770833333333 C 6.201083333333333,15.256770833333333 6.201083333333333,14.807270833333334 5.911083333333334,14.517270833333333 L 5.519583333333333,14.140270833333332" stroke-linejoin="round"/>', '<path class="dot" d="M 9.519583333333333,9.140270833333332 L 9.519583333333333,9.140270833333332 C 9.229583333333332,8.850270833333333 8.780083333333332,8.850270833333333 8.490083333333333,9.140270833333332 L 8.113083333333332,9.517270833333333 C 7.823083333333333,9.807270833333334 7.823083333333333,10.256770833333333 8.113083333333332,10.546770833333333 L 8.504583333333333,10.938270833333332 C 8.794583333333332,11.228270833333333 9.244083333333332,11.228270833333333 9.534083333333333,10.938270833333332 L 9.911083333333334,10.546770833333333 C 10.201083333333333,10.256770833333333 10.201083333333333,9.807270833333334 9.911083333333334,9.517270833333333 L 9.519583333333333,9.140270833333332" stroke-linejoin="round"/>', '<path class="dot" d="M 1.5195833333333333,14.140270833333332 L 1.519583333333333,14.140270833333332 C 1.2295833333333333,13.850270833333333 0.7800833333333331,13.850270833333333 0.4900833333333331,14.140270833333332 L 0.11308333333333317,14.517270833333333 C -0.17691666666666686,14.807270833333334 -0.17691666666666692,15.256770833333333 0.11308333333333317,15.546770833333333 L 0.504583333333333,15.938270833333332 C 0.794583333333333,16.228270833333333 1.2440833333333332,16.228270833333333 1.534083333333333,15.938270833333332 L 1.9110833333333335,15.546770833333333 C 2.2010833333333335,15.256770833333333 2.2010833333333335,14.807270833333334 1.9110833333333335,14.517270833333333 L 1.5195833333333335,14.140270833333332" stroke-linejoin="round"/>', '<path class="dot" d="M 5.519583333333333,9.140270833333332 L 5.519583333333333,9.140270833333332 C 5.229583333333333,8.850270833333333 4.780083333333333,8.850270833333333 4.490083333333333,9.140270833333332 L 4.113083333333333,9.517270833333333 C 3.823083333333333,9.807270833333334 3.823083333333333,10.256770833333333 4.113083333333333,10.546770833333333 L 4.504583333333333,10.938270833333332 C 4.794583333333333,11.228270833333333 5.244083333333333,11.228270833333333 5.534083333333333,10.938270833333332 L 5.911083333333334,10.546770833333333 C 6.201083333333333,10.256770833333333 6.201083333333333,9.807270833333334 5.911083333333334,9.517270833333333 L 5.519583333333333,9.140270833333332" stroke-linejoin="round"/>', '<path class="dot" d="M 1.5195833333333333,4.140270833333333 L 1.519583333333333,4.140270833333333 C 1.2295833333333333,3.8502708333333326 0.7800833333333331,3.8502708333333326 0.4900833333333331,4.140270833333333 L 0.11308333333333317,4.517270833333333 C -0.17691666666666686,4.807270833333333 -0.17691666666666692,5.2567708333333325 0.11308333333333317,5.546770833333333 L 0.504583333333333,5.938270833333332 C 0.794583333333333,6.228270833333333 1.2440833333333332,6.228270833333333 1.534083333333333,5.938270833333332 L 1.9110833333333335,5.546770833333333 C 2.2010833333333335,5.2567708333333325 2.2010833333333335,4.807270833333333 1.9110833333333335,4.517270833333333 L 1.5195833333333335,4.140270833333333" stroke-linejoin="round"/>']
            
            
            <path d="M 5.0,15.0 L 9.0,10.0 L 5.0,5.0 M 1.0,15.0 L 5.0,10.0 L 1.0,5.0" fill="none"
            stroke="black"
            stroke-width="1.5"
            stroke-linecap="round"
            stroke-linejoin="round"
            />
            
            
        </svg>