<?xml version="1.0"?><!DOCTYPE svg PUBLIC "-//W3C//DTD SVG 1.1//EN" "http://www.w3.org/Graphics/SVG/1.1/DTD/svg11.dtd"><svg xmlns="http://www.w3.org/2000/svg" xmlns:xlink="http://www.w3.org/1999/xlink" width="350" height="1000" viewBox="0 0 10 26" >
            
                ['<path class="dot" d="M 3.5195833333333333,18.140270833333336 L 3.5195833333333333,18.140270833333336 C 3.2295833333333333,17.850270833333333 2.7800833333333332,17.850270833333333 2.490083333333333,18.140270833333336 L 2.113083333333333,18.517270833333335 C 1.8230833333333332,18.807270833333334 1.8230833333333332,19.256770833333334 2.113083333333333,19.546770833333333 L 2.504583333333333,19.938270833333334 C 2.7945833333333328,20.228270833333333 3.244083333333333,20.228270833333333 3.5340833333333332,19.938270833333334 L 3.9110833333333335,19.546770833333333 C 4.201083333333333,19.256770833333334 4.201083333333333,18.807270833333334 3.9110833333333335,18.517270833333335 L 3.5195833333333333,18.140270833333336" stroke-linejoin="round"/>', '<path class="dot" d="M 7.519583333333333,18.140270833333336 L 7.519583333333332,18.140270833333336 C 7.229583333333332,17.850270833333333 6.780083333333333,17.850270833333333 6.490083333333333,18.140270833333336 L 6.113083333333333,18.517270833333335 C 5.823083333333333,18.807270833333334 5.823083333333333,19.256770833333334 6.113083333333333,19.546770833333333 L 6.504583333333333,19.938270833333334 C 6.794583333333333,20.228270833333333 7.244083333333332,20.228270833333333 7.534083333333332,19.938270833333334 L 7.911083333333333,19.546770833333333 C 8.201083333333333,19.256770833333334 8.201083333333333,18.807270833333334 7.911083333333333,18.517270833333335 L 7.519583333333333,18.140270833333336" stroke-linejoin="round"/>']
            
                ['<path class="dot" d="M 3.5195833333333333,0.1402708333333331 L 3.5195833333333333,0.1402708333333331 C 3.2295833333333333,-0.14972916666666694 2.7800833333333332,-0.149729166666667 2.490083333333333,0.1402708333333331 L 2.113083333333333,0.5172708333333332 C 1.8230833333333332,0.8072708333333332 1.8230833333333332,1.2567708333333332 2.113083333333333,1.5467708333333332 L 2.504583333333333,1.938270833333333 C 2.7945833333333328,2.228270833333333 3.244083333333333,2.228270833333333 3.5340833333333332,1.938270833333333 L 3.9110833333333335,1.5467708333333332 C 4.201083333333333,1.2567708333333332 4.201083333333333,0.8072708333333333 3.9110833333333335,0.5172708333333331 L 3.5195833333333333,0.14027083333333312" stroke-linejoin="round"/>', '<path class="dot" d="M 7.519583333333333,0.1402708333333331 L 7.519583333333332,0.1402708333333331 C 7.229583333333332,-0.14972916666666694 6.780083333333333,-0.149729166666667 6.490083333333333,0.1402708333333331 L 6.113083333333333,0.5172708333333332 C 5.823083333333333,0.8072708333333332 5.823083333333333,1.2567708333333332 6.113083333333333,1.5467708333333332 L 6.504583333333333,1.938270833333333 C 6.794583333333333,2.228270833333333 7.244083333333332,2.228270833333333 7.534083333333332,1.938270833333333 L 7.911083333333333,1.5467708333333332 C 8.201083333333333,1.2567708333333332 8.201083333333333,0.8072708333333333 7.911083333333333,0.5172708333333331 L 7.519583333333333,0.14027083333333312" stroke-linejoin="round"/>']
            
                ['<path class="dot" d="M 7.519583333333333,0.1402708333333331 L 7.519583333333332,0.1402708333333331 C 7.229583333333332,-0.14972916666666694 6.780083333333333,-0.149729166666667 6.490083333333333,0.1402708333333331 L 6.113083333333333,0.5172708333333332 C 5.823083333333333,0.8072708333333332 5.823083333333333,1.2567708333333332 6.113083333333333,1.5467708333333332 L 6.504583333333333,1.938270833333333 C 6.794583333333333,2.228270833333333 7.244083333333332,2.228270833333333 7.534083333333332,1.938270833333333 L 7.911083333333333,1.5467708333333332 C 8.201083333333333,1.2567708333333332 8.201083333333333,0.8072708333333333 7.911083333333333,0.5172708333333331 L 7.519583333333333,0.14027083333333312" stroke-linejoin="round"/>', '<path class="dot" d="M 7.519583333333333,18.140270833333336 L 7.519583333333332,18.140270833333336 C 7.229583333333332,17.850270833333333 6.780083333333333,17.850270833333333 6.490083333333333,18.140270833333336 L 6.113083333333333,18.517270833333335 C 5.823083333333333,18.807270833333334 5.823083333333333,19.256770833333334 6.113083333333333,19.546770833333333 L 6.504583333333333,19.938270833333334 C 6.794583333333333,20.228270833333333 7.244083333333332,20.228270833333333 7.534083333333332,19.938270833333334 L 7.911083333333333,19.546770833333333 C 8.201083333333333,19.256770833333334 8.201083333333333,18.807270833333334 7.911083333333333,18.517270833333335 L 7.519583333333333,18.140270833333336" stroke-linejoin="round"/>']
            
            
            <path d="M 3.0,19.0 L 7.0,19.0" fill="none"
            stroke="black"
            stroke-width="1.5"
            stroke-linecap="round"
            stroke-linejoin="round"
            />
            
            <path d="M 3.0,1.0 L 7.0,1.0" fill="none"
            stroke="black"
            stroke-width="1.5"
            stroke-linecap="round"
            stroke-linejoin="round"
            />
            
            <path d="M 7.0,1.0 L 7.0,19.0" fill="none"
            stroke="black"
            stroke-width="1.5"
            stroke-linecap="round"
            stroke-linejoin="round"
            />
            
            
        </svg>