<?xml version="1.0" encoding="UTF-8" standalone="no"?>
<svg
   data-dec="107"
   width="12"
   height="23"
   version="1.1"
   id="svg6983"
   sodipodi:docname="copyright.svg"
   inkscape:version="1.3.2 (091e20ef0f, 2023-11-25, custom)"
   xmlns:inkscape="http://www.inkscape.org/namespaces/inkscape"
   xmlns:sodipodi="http://sodipodi.sourceforge.net/DTD/sodipodi-0.dtd"
   xmlns="http://www.w3.org/2000/svg"
   xmlns:svg="http://www.w3.org/2000/svg"
   xmlns:rdf="http://www.w3.org/1999/02/22-rdf-syntax-ns#"
   xmlns:cc="http://creativecommons.org/ns#"
   xmlns:dc="http://purl.org/dc/elements/1.1/">
  <metadata
     id="metadata6989">
    <rdf:RDF>
      <cc:Work
         rdf:about="">
        <dc:format>image/svg+xml</dc:format>
        <dc:type
           rdf:resource="http://purl.org/dc/dcmitype/StillImage" />
      </cc:Work>
    </rdf:RDF>
  </metadata>
  <defs
     id="defs6987" />
  <sodipodi:namedview
     pagecolor="#ffffff"
     bordercolor="#666666"
     borderopacity="1"
     objecttolerance="10"
     gridtolerance="10"
     guidetolerance="10"
     inkscape:pageopacity="0"
     inkscape:pageshadow="2"
     inkscape:window-width="2560"
     inkscape:window-height="1403"
     id="namedview6985"
     showgrid="true"
     showguides="true"
     inkscape:guide-bbox="true"
     inkscape:zoom="33.213946"
     inkscape:cx="-5.2387633"
     inkscape:cy="13.699065"
     inkscape:window-x="0"
     inkscape:window-y="0"
     inkscape:window-maximized="1"
     inkscape:current-layer="svg6983"
     inkscape:showpageshadow="2"
     inkscape:pagecheckerboard="0"
     inkscape:deskcolor="#d1d1d1">
    <sodipodi:guide
       position="2.5,19"
       orientation="0,1"
       id="guide7534"
       inkscape:locked="false" />
    <inkscape:grid
       type="xygrid"
       id="grid7536"
       originx="-0.99999996"
       originy="-1"
       spacingy="1"
       spacingx="1"
       units="px"
       visible="true" />
    <sodipodi:guide
       position="12,33"
       orientation="0,1"
       id="guide7538"
       inkscape:locked="false" />
    <sodipodi:guide
       position="6,40"
       orientation="0,1"
       id="guide7540"
       inkscape:locked="false" />
  </sodipodi:namedview>
  <path
     d="M 1.0000001,3 1.1920929e-7,7 5.9604645e-8,16 1.0000001,20 3,22 5,23 h 2 l 2,-1 2,-2 1,-4 V 7 L 11,3 9,1 7,0 H 5 L 3,1 Z m 8,6 -1,-4 -1,-1 H 5 L 4,5 3.0000001,10 v 3 L 4,18 5,19 h 2.0000001 l 1,-1 1,-4"
     style="fill:none;stroke:none;stroke-width:2;stroke-linecap:round;stroke-linejoin:round"
     id="path1"
     sodipodi:nodetypes="ccccccccccccccccccccccccccccc" />
</svg>
