<?xml version="1.0"?><!DOCTYPE svg PUBLIC "-//W3C//DTD SVG 1.1//EN" "http://www.w3.org/Graphics/SVG/1.1/DTD/svg11.dtd"><svg xmlns="http://www.w3.org/2000/svg" xmlns:xlink="http://www.w3.org/1999/xlink" width="350" height="1000" viewBox="0 0 14 40" >
            
                ['<path class="dot" d="M 11.790943877551019,6.777193877551018 L 11.790943877551019,6.777193877551018 C 11.34094387755102,6.327193877551018 10.64344387755102,6.327193877551018 10.193443877551019,6.777193877551018 L 9.60844387755102,7.362193877551018 C 9.158443877551019,7.812193877551018 9.158443877551019,8.509693877551019 9.60844387755102,8.959693877551018 L 10.21594387755102,9.567193877551018 C 10.665943877551019,10.017193877551017 11.363443877551019,10.017193877551017 11.81344387755102,9.567193877551018 L 12.39844387755102,8.959693877551018 C 12.84844387755102,8.509693877551019 12.84844387755102,7.812193877551018 12.39844387755102,7.362193877551018 L 11.790943877551019,6.777193877551018" stroke-linejoin="round"/>', '<path class="dot" d="M 10.790943877551019,9.777193877551019 L 10.790943877551019,9.777193877551019 C 10.34094387755102,9.327193877551018 9.64344387755102,9.327193877551018 9.193443877551019,9.777193877551019 L 8.60844387755102,10.362193877551018 C 8.158443877551019,10.81219387755102 8.158443877551019,11.509693877551019 8.60844387755102,11.959693877551018 L 9.21594387755102,12.567193877551018 C 9.665943877551019,13.01719387755102 10.363443877551019,13.01719387755102 10.81344387755102,12.567193877551018 L 11.39844387755102,11.959693877551018 C 11.84844387755102,11.509693877551019 11.84844387755102,10.81219387755102 11.39844387755102,10.362193877551018 L 10.790943877551019,9.777193877551019" stroke-linejoin="round"/>', '<path class="dot" d="M 9.79094387755102,11.777193877551019 L 9.790943877551019,11.777193877551019 C 9.34094387755102,11.327193877551018 8.64344387755102,11.327193877551018 8.19344387755102,11.777193877551019 L 7.608443877551021,12.362193877551018 C 7.15844387755102,12.81219387755102 7.15844387755102,13.509693877551019 7.608443877551021,13.959693877551018 L 8.21594387755102,14.567193877551018 C 8.66594387755102,15.01719387755102 9.36344387755102,15.01719387755102 9.81344387755102,14.567193877551018 L 10.39844387755102,13.959693877551018 C 10.84844387755102,13.509693877551019 10.84844387755102,12.81219387755102 10.39844387755102,12.362193877551018 L 9.79094387755102,11.777193877551019" stroke-linejoin="round"/>', '<path class="dot" d="M 7.790943877551021,12.777193877551019 L 7.79094387755102,12.777193877551019 C 7.34094387755102,12.327193877551018 6.64344387755102,12.327193877551018 6.1934438775510205,12.777193877551019 L 5.608443877551021,13.362193877551018 C 5.15844387755102,13.81219387755102 5.15844387755102,14.509693877551019 5.608443877551021,14.959693877551018 L 6.21594387755102,15.567193877551018 C 6.66594387755102,16.01719387755102 7.3634438775510205,16.01719387755102 7.81344387755102,15.567193877551018 L 8.39844387755102,14.959693877551018 C 8.84844387755102,14.509693877551019 8.84844387755102,13.81219387755102 8.39844387755102,13.362193877551018 L 7.790943877551021,12.777193877551019" stroke-linejoin="round"/>', '<path class="dot" d="M 6.790943877551021,12.777193877551019 L 6.79094387755102,12.777193877551019 C 6.34094387755102,12.327193877551018 5.64344387755102,12.327193877551018 5.1934438775510205,12.777193877551019 L 4.608443877551021,13.362193877551018 C 4.15844387755102,13.81219387755102 4.15844387755102,14.509693877551019 4.608443877551021,14.959693877551018 L 5.21594387755102,15.567193877551018 C 5.66594387755102,16.01719387755102 6.3634438775510205,16.01719387755102 6.81344387755102,15.567193877551018 L 7.398443877551021,14.959693877551018 C 7.84844387755102,14.509693877551019 7.84844387755102,13.81219387755102 7.398443877551021,13.362193877551018 L 6.790943877551021,12.777193877551019" stroke-linejoin="round"/>', '<path class="dot" d="M 4.790943877551021,11.777193877551019 L 4.79094387755102,11.777193877551019 C 4.34094387755102,11.327193877551018 3.64344387755102,11.327193877551018 3.19344387755102,11.777193877551019 L 2.60844387755102,12.362193877551018 C 2.1584438775510204,12.81219387755102 2.15844387755102,13.509693877551019 2.60844387755102,13.959693877551018 L 3.21594387755102,14.567193877551018 C 3.66594387755102,15.01719387755102 4.3634438775510205,15.01719387755102 4.81344387755102,14.567193877551018 L 5.398443877551021,13.959693877551018 C 5.84844387755102,13.509693877551019 5.84844387755102,12.81219387755102 5.398443877551021,12.362193877551018 L 4.790943877551021,11.777193877551019" stroke-linejoin="round"/>', '<path class="dot" d="M 3.7909438775510207,9.777193877551019 L 3.79094387755102,9.777193877551019 C 3.3409438775510196,9.327193877551018 2.64344387755102,9.327193877551018 2.19344387755102,9.777193877551019 L 1.60844387755102,10.362193877551018 C 1.15844387755102,10.81219387755102 1.15844387755102,11.509693877551019 1.60844387755102,11.959693877551018 L 2.2159438775510196,12.567193877551018 C 2.66594387755102,13.01719387755102 3.3634438775510196,13.01719387755102 3.8134438775510198,12.567193877551018 L 4.398443877551021,11.959693877551018 C 4.84844387755102,11.509693877551019 4.84844387755102,10.81219387755102 4.398443877551021,10.362193877551018 L 3.7909438775510207,9.777193877551019" stroke-linejoin="round"/>', '<path class="dot" d="M 2.7909438775510207,6.777193877551018 L 2.79094387755102,6.777193877551018 C 2.3409438775510196,6.327193877551018 1.6434438775510198,6.327193877551018 1.19344387755102,6.777193877551018 L 0.6084438775510199,7.362193877551018 C 0.15844387755101996,7.812193877551018 0.15844387755101985,8.509693877551019 0.6084438775510199,8.959693877551018 L 1.2159438775510198,9.567193877551018 C 1.6659438775510198,10.017193877551017 2.3634438775510196,10.017193877551017 2.8134438775510198,9.567193877551018 L 3.3984438775510206,8.959693877551018 C 3.84844387755102,8.509693877551019 3.84844387755102,7.812193877551018 3.3984438775510206,7.362193877551018 L 2.7909438775510207,6.777193877551018" stroke-linejoin="round"/>', '<path class="dot" d="M 2.7909438775510207,5.777193877551018 L 2.79094387755102,5.777193877551018 C 2.3409438775510196,5.327193877551018 1.6434438775510198,5.327193877551018 1.19344387755102,5.777193877551018 L 0.6084438775510199,6.362193877551018 C 0.15844387755101996,6.812193877551018 0.15844387755101985,7.509693877551018 0.6084438775510199,7.959693877551018 L 1.2159438775510198,8.567193877551018 C 1.6659438775510198,9.017193877551017 2.3634438775510196,9.017193877551017 2.8134438775510198,8.567193877551018 L 3.3984438775510206,7.959693877551018 C 3.84844387755102,7.509693877551018 3.84844387755102,6.812193877551018 3.3984438775510206,6.362193877551018 L 2.7909438775510207,5.777193877551018" stroke-linejoin="round"/>', '<path class="dot" d="M 3.7909438775510207,2.7771938775510177 L 3.79094387755102,2.7771938775510177 C 3.3409438775510196,2.327193877551018 2.64344387755102,2.3271938775510175 2.19344387755102,2.7771938775510177 L 1.60844387755102,3.362193877551018 C 1.15844387755102,3.8121938775510182 1.15844387755102,4.509693877551018 1.60844387755102,4.959693877551018 L 2.2159438775510196,5.567193877551018 C 2.66594387755102,6.017193877551017 3.3634438775510196,6.017193877551017 3.8134438775510198,5.567193877551018 L 4.398443877551021,4.959693877551018 C 4.84844387755102,4.509693877551018 4.84844387755102,3.8121938775510182 4.398443877551021,3.362193877551018 L 3.7909438775510207,2.777193877551018" stroke-linejoin="round"/>', '<path class="dot" d="M 4.790943877551021,0.7771938775510179 L 4.79094387755102,0.7771938775510179 C 4.34094387755102,0.3271938775510179 3.64344387755102,0.3271938775510178 3.19344387755102,0.7771938775510179 L 2.60844387755102,1.3621938775510183 C 2.1584438775510204,1.8121938775510182 2.15844387755102,2.509693877551018 2.60844387755102,2.959693877551018 L 3.21594387755102,3.567193877551018 C 3.66594387755102,4.017193877551017 4.3634438775510205,4.017193877551017 4.81344387755102,3.567193877551018 L 5.398443877551021,2.959693877551018 C 5.84844387755102,2.509693877551018 5.84844387755102,1.8121938775510182 5.398443877551021,1.362193877551018 L 4.790943877551021,0.7771938775510181" stroke-linejoin="round"/>', '<path class="dot" d="M 6.790943877551021,-0.22280612244898207 L 6.79094387755102,-0.22280612244898207 C 6.34094387755102,-0.6728061224489821 5.64344387755102,-0.6728061224489822 5.1934438775510205,-0.22280612244898207 L 4.608443877551021,0.3621938775510183 C 4.15844387755102,0.8121938775510182 4.15844387755102,1.5096938775510182 4.608443877551021,1.9596938775510184 L 5.21594387755102,2.567193877551018 C 5.66594387755102,3.0171938775510174 6.3634438775510205,3.0171938775510174 6.81344387755102,2.567193877551018 L 7.398443877551021,1.9596938775510184 C 7.84844387755102,1.5096938775510182 7.84844387755102,0.8121938775510182 7.398443877551021,0.36219387755101806 L 6.790943877551021,-0.2228061224489819" stroke-linejoin="round"/>', '<path class="dot" d="M 7.790943877551021,-0.22280612244898207 L 7.79094387755102,-0.22280612244898207 C 7.34094387755102,-0.6728061224489821 6.64344387755102,-0.6728061224489822 6.1934438775510205,-0.22280612244898207 L 5.608443877551021,0.3621938775510183 C 5.15844387755102,0.8121938775510182 5.15844387755102,1.5096938775510182 5.608443877551021,1.9596938775510184 L 6.21594387755102,2.567193877551018 C 6.66594387755102,3.0171938775510174 7.3634438775510205,3.0171938775510174 7.81344387755102,2.567193877551018 L 8.39844387755102,1.9596938775510184 C 8.84844387755102,1.5096938775510182 8.84844387755102,0.8121938775510182 8.39844387755102,0.36219387755101806 L 7.790943877551021,-0.2228061224489819" stroke-linejoin="round"/>', '<path class="dot" d="M 9.79094387755102,0.7771938775510179 L 9.790943877551019,0.7771938775510179 C 9.34094387755102,0.3271938775510179 8.64344387755102,0.3271938775510178 8.19344387755102,0.7771938775510179 L 7.608443877551021,1.3621938775510183 C 7.15844387755102,1.8121938775510182 7.15844387755102,2.509693877551018 7.608443877551021,2.959693877551018 L 8.21594387755102,3.567193877551018 C 8.66594387755102,4.017193877551017 9.36344387755102,4.017193877551017 9.81344387755102,3.567193877551018 L 10.39844387755102,2.959693877551018 C 10.84844387755102,2.509693877551018 10.84844387755102,1.8121938775510182 10.39844387755102,1.362193877551018 L 9.79094387755102,0.7771938775510181" stroke-linejoin="round"/>', '<path class="dot" d="M 10.790943877551019,2.7771938775510177 L 10.790943877551019,2.7771938775510177 C 10.34094387755102,2.327193877551018 9.64344387755102,2.3271938775510175 9.193443877551019,2.7771938775510177 L 8.60844387755102,3.362193877551018 C 8.158443877551019,3.8121938775510182 8.158443877551019,4.509693877551018 8.60844387755102,4.959693877551018 L 9.21594387755102,5.567193877551018 C 9.665943877551019,6.017193877551017 10.363443877551019,6.017193877551017 10.81344387755102,5.567193877551018 L 11.39844387755102,4.959693877551018 C 11.84844387755102,4.509693877551018 11.84844387755102,3.8121938775510182 11.39844387755102,3.362193877551018 L 10.790943877551019,2.777193877551018" stroke-linejoin="round"/>', '<path class="dot" d="M 11.790943877551019,5.777193877551018 L 11.790943877551019,5.777193877551018 C 11.34094387755102,5.327193877551018 10.64344387755102,5.327193877551018 10.193443877551019,5.777193877551018 L 9.60844387755102,6.362193877551018 C 9.158443877551019,6.812193877551018 9.158443877551019,7.509693877551018 9.60844387755102,7.959693877551018 L 10.21594387755102,8.567193877551018 C 10.665943877551019,9.017193877551017 11.363443877551019,9.017193877551017 11.81344387755102,8.567193877551018 L 12.39844387755102,7.959693877551018 C 12.84844387755102,7.509693877551018 12.84844387755102,6.812193877551018 12.39844387755102,6.362193877551018 L 11.790943877551019,5.777193877551018" stroke-linejoin="round"/>', '<path class="dot" d="M 11.790943877551019,6.777193877551018 L 11.790943877551019,6.777193877551018 C 11.34094387755102,6.327193877551018 10.64344387755102,6.327193877551018 10.193443877551019,6.777193877551018 L 9.60844387755102,7.362193877551018 C 9.158443877551019,7.812193877551018 9.158443877551019,8.509693877551019 9.60844387755102,8.959693877551018 L 10.21594387755102,9.567193877551018 C 10.665943877551019,10.017193877551017 11.363443877551019,10.017193877551017 11.81344387755102,9.567193877551018 L 12.39844387755102,8.959693877551018 C 12.84844387755102,8.509693877551019 12.84844387755102,7.812193877551018 12.39844387755102,7.362193877551018 L 11.790943877551019,6.777193877551018" stroke-linejoin="round"/>', '<path class="dot" d="M 11.790943877551019,11.777193877551019 L 11.790943877551019,11.777193877551019 C 11.34094387755102,11.327193877551018 10.64344387755102,11.327193877551018 10.193443877551019,11.777193877551019 L 9.60844387755102,12.362193877551018 C 9.158443877551019,12.81219387755102 9.158443877551019,13.509693877551019 9.60844387755102,13.959693877551018 L 10.21594387755102,14.567193877551018 C 10.665943877551019,15.01719387755102 11.363443877551019,15.01719387755102 11.81344387755102,14.567193877551018 L 12.39844387755102,13.959693877551018 C 12.84844387755102,13.509693877551019 12.84844387755102,12.81219387755102 12.39844387755102,12.362193877551018 L 11.790943877551019,11.777193877551019" stroke-linejoin="round"/>', '<path class="dot" d="M 10.790943877551019,16.777193877551017 L 10.790943877551019,16.777193877551017 C 10.34094387755102,16.327193877551018 9.64344387755102,16.327193877551018 9.193443877551019,16.777193877551017 L 8.60844387755102,17.362193877551018 C 8.158443877551019,17.812193877551017 8.158443877551019,18.50969387755102 8.60844387755102,18.959693877551018 L 9.21594387755102,19.56719387755102 C 9.665943877551019,20.01719387755102 10.363443877551019,20.01719387755102 10.81344387755102,19.56719387755102 L 11.39844387755102,18.959693877551018 C 11.84844387755102,18.50969387755102 11.84844387755102,17.812193877551017 11.39844387755102,17.362193877551018 L 10.790943877551019,16.777193877551017" stroke-linejoin="round"/>', '<path class="dot" d="M 9.79094387755102,19.777193877551017 L 9.790943877551019,19.777193877551017 C 9.34094387755102,19.327193877551018 8.64344387755102,19.327193877551018 8.19344387755102,19.777193877551017 L 7.608443877551021,20.362193877551018 C 7.15844387755102,20.812193877551017 7.15844387755102,21.50969387755102 7.608443877551021,21.959693877551018 L 8.21594387755102,22.56719387755102 C 8.66594387755102,23.01719387755102 9.36344387755102,23.01719387755102 9.81344387755102,22.56719387755102 L 10.39844387755102,21.959693877551018 C 10.84844387755102,21.50969387755102 10.84844387755102,20.812193877551017 10.39844387755102,20.362193877551018 L 9.79094387755102,19.777193877551017" stroke-linejoin="round"/>', '<path class="dot" d="M 7.790943877551021,20.777193877551017 L 7.79094387755102,20.777193877551017 C 7.34094387755102,20.327193877551018 6.64344387755102,20.327193877551018 6.1934438775510205,20.777193877551017 L 5.608443877551021,21.362193877551018 C 5.15844387755102,21.812193877551017 5.15844387755102,22.50969387755102 5.608443877551021,22.959693877551018 L 6.21594387755102,23.56719387755102 C 6.66594387755102,24.01719387755102 7.3634438775510205,24.01719387755102 7.81344387755102,23.56719387755102 L 8.39844387755102,22.959693877551018 C 8.84844387755102,22.50969387755102 8.84844387755102,21.812193877551017 8.39844387755102,21.362193877551018 L 7.790943877551021,20.777193877551017" stroke-linejoin="round"/>', '<path class="dot" d="M 6.790943877551021,20.777193877551017 L 6.79094387755102,20.777193877551017 C 6.34094387755102,20.327193877551018 5.64344387755102,20.327193877551018 5.1934438775510205,20.777193877551017 L 4.608443877551021,21.362193877551018 C 4.15844387755102,21.812193877551017 4.15844387755102,22.50969387755102 4.608443877551021,22.959693877551018 L 5.21594387755102,23.56719387755102 C 5.66594387755102,24.01719387755102 6.3634438775510205,24.01719387755102 6.81344387755102,23.56719387755102 L 7.398443877551021,22.959693877551018 C 7.84844387755102,22.50969387755102 7.84844387755102,21.812193877551017 7.398443877551021,21.362193877551018 L 6.790943877551021,20.777193877551017" stroke-linejoin="round"/>', '<path class="dot" d="M 4.790943877551021,19.777193877551017 L 4.79094387755102,19.777193877551017 C 4.34094387755102,19.327193877551018 3.64344387755102,19.327193877551018 3.19344387755102,19.777193877551017 L 2.60844387755102,20.362193877551018 C 2.1584438775510204,20.812193877551017 2.15844387755102,21.50969387755102 2.60844387755102,21.959693877551018 L 3.21594387755102,22.56719387755102 C 3.66594387755102,23.01719387755102 4.3634438775510205,23.01719387755102 4.81344387755102,22.56719387755102 L 5.398443877551021,21.959693877551018 C 5.84844387755102,21.50969387755102 5.84844387755102,20.812193877551017 5.398443877551021,20.362193877551018 L 4.790943877551021,19.777193877551017" stroke-linejoin="round"/>', '<path class="dot" d="M 3.7909438775510207,17.777193877551017 L 3.79094387755102,17.777193877551017 C 3.3409438775510196,17.327193877551018 2.64344387755102,17.327193877551018 2.19344387755102,17.777193877551017 L 1.60844387755102,18.362193877551018 C 1.15844387755102,18.812193877551017 1.15844387755102,19.50969387755102 1.60844387755102,19.959693877551018 L 2.2159438775510196,20.56719387755102 C 2.66594387755102,21.01719387755102 3.3634438775510196,21.01719387755102 3.8134438775510198,20.56719387755102 L 4.398443877551021,19.959693877551018 C 4.84844387755102,19.50969387755102 4.84844387755102,18.812193877551017 4.398443877551021,18.362193877551018 L 3.7909438775510207,17.777193877551017" stroke-linejoin="round"/>']
            
            
            <path d="M 11.0,8.0 L 10.0,11.0 L 9.0,13.0 L 7.0,14.0 L 6.0,14.0 L 4.0,13.0 L 3.0,11.0 L 2.0,8.0 L 2.0,7.0 L 3.0,4.0 L 4.0,2.0 L 6.0,1.0 L 7.0,1.0 L 9.0,2.0 L 10.0,4.0 L 11.0,7.0 L 11.0,8.0 L 11.0,13.0 L 10.0,18.0 L 9.0,21.0 L 7.0,22.0 L 6.0,22.0 L 4.0,21.0 L 3.0,19.0" fill="none"
            stroke="black"
            stroke-width="2.5"
            stroke-linecap="round"
            stroke-linejoin="round"
            />
            
            
        </svg>