<?xml version="1.0"?><!DOCTYPE svg PUBLIC "-//W3C//DTD SVG 1.1//EN" "http://www.w3.org/Graphics/SVG/1.1/DTD/svg11.dtd"><svg xmlns="http://www.w3.org/2000/svg" xmlns:xlink="http://www.w3.org/1999/xlink" width="350" height="1000" viewBox="0 0 10 26" >
            
                ['<path class="dot" d="M 8.519583333333333,4.140271133333333 L 8.519583333333333,4.140271133333333 C 8.229583333333332,3.8502711333333326 7.780083333333333,3.8502711333333326 7.490083333333333,4.140271133333333 L 7.113083333333333,4.517271133333333 C 6.823083333333333,4.807271133333333 6.823083333333333,5.2567711333333325 7.113083333333333,5.546771133333333 L 7.504583333333333,5.938271133333332 C 7.794583333333333,6.228271133333333 8.244083333333332,6.228271133333333 8.534083333333333,5.938271133333332 L 8.911083333333334,5.546771133333333 C 9.201083333333333,5.2567711333333325 9.201083333333333,4.807271133333333 8.911083333333334,4.517271133333333 L 8.519583333333333,4.140271133333333" stroke-linejoin="round"/>', '<path class="dot" d="M 8.519583333333333,14.140270833333332 L 8.519583333333333,14.140270833333332 C 8.229583333333332,13.850270833333333 7.780083333333333,13.850270833333333 7.490083333333333,14.140270833333332 L 7.113083333333333,14.517270833333333 C 6.823083333333333,14.807270833333334 6.823083333333333,15.256770833333333 7.113083333333333,15.546770833333333 L 7.504583333333333,15.938270833333332 C 7.794583333333333,16.228270833333333 8.244083333333332,16.228270833333333 8.534083333333333,15.938270833333332 L 8.911083333333334,15.546770833333333 C 9.201083333333333,15.256770833333333 9.201083333333333,14.807270833333334 8.911083333333334,14.517270833333333 L 8.519583333333333,14.140270833333332" stroke-linejoin="round"/>']
            
                ['<path class="dot" d="M 2.519583333333333,4.140270833333333 L 2.5195833333333324,4.140270833333333 C 2.229583333333333,3.8502708333333326 1.7800833333333328,3.8502708333333326 1.4900833333333328,4.140270833333333 L 1.1130833333333328,4.517270833333333 C 0.8230833333333327,4.807270833333333 0.8230833333333326,5.2567708333333325 1.1130833333333328,5.546770833333333 L 1.5045833333333327,5.938270833333332 C 1.7945833333333325,6.228270833333333 2.2440833333333328,6.228270833333333 2.5340833333333324,5.938270833333332 L 2.911083333333333,5.546770833333333 C 3.201083333333333,5.2567708333333325 3.201083333333333,4.807270833333333 2.911083333333333,4.517270833333333 L 2.5195833333333333,4.140270833333333" stroke-linejoin="round"/>', '<path class="dot" d="M 2.5195835333333343,11.140270933333333 L 2.519583533333334,11.140270933333333 C 2.2295835333333343,10.850270933333334 1.7800835333333342,10.850270933333334 1.4900835333333342,11.140270933333333 L 1.1130835333333342,11.517270933333334 C 0.8230835333333342,11.807270933333335 0.8230835333333341,12.256770933333334 1.1130835333333342,12.546770933333335 L 1.5045835333333342,12.938270933333333 C 1.794583533333334,13.228270933333334 2.244083533333334,13.228270933333334 2.534083533333334,12.938270933333333 L 2.9110835333333345,12.546770933333335 C 3.2010835333333345,12.256770933333334 3.2010835333333345,11.807270933333335 2.9110835333333345,11.517270933333334 L 2.5195835333333347,11.140270933333333" stroke-linejoin="round"/>', '<path class="dot" d="M 3.5195835333333343,13.140270873333332 L 3.519583533333334,13.140270873333332 C 3.2295835333333343,12.850270873333333 2.7800835333333342,12.850270873333333 2.490083533333334,13.140270873333332 L 2.113083533333334,13.517270873333333 C 1.8230835333333342,13.807270873333334 1.8230835333333342,14.256770873333332 2.113083533333334,14.546770873333333 L 2.504583533333334,14.938270873333332 C 2.794583533333334,15.228270873333333 3.244083533333334,15.228270873333333 3.534083533333334,14.938270873333332 L 3.9110835333333345,14.546770873333333 C 4.2010835333333345,14.256770873333332 4.2010835333333345,13.807270873333334 3.9110835333333345,13.517270873333333 L 3.5195835333333347,13.140270873333332" stroke-linejoin="round"/>', '<path class="dot" d="M 4.519583533333335,14.140270833333332 L 4.519583533333335,14.140270833333332 C 4.229583533333335,13.850270833333333 3.7800835333333347,13.850270833333333 3.4900835333333347,14.140270833333332 L 3.1130835333333344,14.517270833333333 C 2.8230835333333344,14.807270833333334 2.8230835333333344,15.256770833333333 3.1130835333333344,15.546770833333333 L 3.5045835333333346,15.938270833333332 C 3.794583533333334,16.228270833333333 4.244083533333335,16.228270833333333 4.534083533333335,15.938270833333332 L 4.9110835333333345,15.546770833333333 C 5.201083533333335,15.256770833333333 5.201083533333335,14.807270833333334 4.9110835333333345,14.517270833333333 L 4.519583533333335,14.140270833333332" stroke-linejoin="round"/>', '<path class="dot" d="M 6.5195834333333345,14.140270583333344 L 6.519583433333334,14.140270583333344 C 6.2295834333333335,13.850270583333344 5.780083433333334,13.850270583333344 5.490083433333334,14.140270583333344 L 5.113083433333334,14.517270583333344 C 4.823083433333334,14.807270583333345 4.823083433333334,15.256770583333344 5.113083433333334,15.546770583333345 L 5.504583433333334,15.938270583333344 C 5.794583433333334,16.228270583333344 6.2440834333333335,16.228270583333344 6.5340834333333335,15.938270583333344 L 6.911083433333334,15.546770583333345 C 7.201083433333334,15.256770583333344 7.201083433333334,14.807270583333345 6.911083433333334,14.517270583333344 L 6.5195834333333345,14.140270583333344" stroke-linejoin="round"/>', '<path class="dot" d="M 7.519583373333333,13.140270873333332 L 7.519583373333332,13.140270873333332 C 7.229583373333332,12.850270873333333 6.7800833733333326,12.850270873333333 6.4900833733333325,13.140270873333332 L 6.113083373333333,13.517270873333333 C 5.823083373333333,13.807270873333334 5.823083373333333,14.256770873333332 6.113083373333333,14.546770873333333 L 6.5045833733333325,14.938270873333332 C 6.7945833733333325,15.228270873333333 7.244083373333332,15.228270873333333 7.534083373333332,14.938270873333332 L 7.911083373333333,14.546770873333333 C 8.201083373333333,14.256770873333332 8.201083373333333,13.807270873333334 7.911083373333333,13.517270873333333 L 7.519583373333333,13.140270873333332" stroke-linejoin="round"/>', '<path class="dot" d="M 8.519583333333333,11.140270733333333 L 8.519583333333333,11.140270733333333 C 8.229583333333332,10.850270733333334 7.780083333333333,10.850270733333334 7.490083333333333,11.140270733333333 L 7.113083333333333,11.517270733333334 C 6.823083333333333,11.807270733333333 6.823083333333333,12.256770733333333 7.113083333333333,12.546770733333334 L 7.504583333333333,12.938270733333333 C 7.794583333333333,13.228270733333334 8.244083333333332,13.228270733333334 8.534083333333333,12.938270733333333 L 8.911083333333334,12.546770733333334 C 9.201083333333333,12.256770733333333 9.201083333333333,11.807270733333334 8.911083333333334,11.517270733333334 L 8.519583333333333,11.140270733333333" stroke-linejoin="round"/>']
            
                ['<path class="dot" d="M 4.519583333333333,1.1402708333333331 L 4.519583333333333,1.1402708333333331 C 4.229583333333333,0.8502708333333331 3.7800833333333332,0.850270833333333 3.490083333333333,1.1402708333333331 L 3.113083333333333,1.5172708333333333 C 2.823083333333333,1.8072708333333332 2.823083333333333,2.2567708333333334 3.113083333333333,2.5467708333333334 L 3.504583333333333,2.938270833333333 C 3.7945833333333328,3.228270833333333 4.244083333333333,3.228270833333333 4.534083333333333,2.938270833333333 L 4.911083333333334,2.5467708333333334 C 5.201083333333333,2.2567708333333334 5.201083333333333,1.8072708333333334 4.911083333333334,1.5172708333333331 L 4.519583333333333,1.1402708333333331" stroke-linejoin="round"/>', '<path class="dot" d="M 3.5195833333333333,2.140270833333333 L 3.5195833333333333,2.140270833333333 C 3.2295833333333333,1.850270833333333 2.7800833333333332,1.850270833333333 2.490083333333333,2.140270833333333 L 2.113083333333333,2.5172708333333333 C 1.8230833333333332,2.807270833333333 1.8230833333333332,3.2567708333333334 2.113083333333333,3.5467708333333334 L 2.504583333333333,3.938270833333333 C 2.7945833333333328,4.228270833333333 3.244083333333333,4.228270833333333 3.5340833333333332,3.938270833333333 L 3.9110833333333335,3.5467708333333334 C 4.201083333333333,3.2567708333333334 4.201083333333333,2.8072708333333334 3.9110833333333335,2.517270833333333 L 3.5195833333333333,2.140270833333333" stroke-linejoin="round"/>', '<path class="dot" d="M 2.5195833333333333,1.140270633333333 L 2.5195833333333333,1.140270633333333 C 2.2295833333333333,0.850270633333333 1.7800833333333332,0.8502706333333329 1.4900833333333332,1.140270633333333 L 1.1130833333333332,1.5172706333333332 C 0.8230833333333332,1.807270633333333 0.8230833333333331,2.256770633333333 1.1130833333333332,2.546770633333333 L 1.5045833333333332,2.9382706333333326 C 1.794583333333333,3.2282706333333326 2.244083333333333,3.2282706333333326 2.5340833333333332,2.9382706333333326 L 2.9110833333333335,2.546770633333333 C 3.2010833333333335,2.256770633333333 3.2010833333333335,1.8072706333333333 2.9110833333333335,1.517270633333333 L 2.5195833333333333,1.140270633333333" stroke-linejoin="round"/>', '<path class="dot" d="M 3.5195833333333333,0.1402708333333331 L 3.5195833333333333,0.1402708333333331 C 3.2295833333333333,-0.14972916666666694 2.7800833333333332,-0.149729166666667 2.490083333333333,0.1402708333333331 L 2.113083333333333,0.5172708333333332 C 1.8230833333333332,0.8072708333333332 1.8230833333333332,1.2567708333333332 2.113083333333333,1.5467708333333332 L 2.504583333333333,1.938270833333333 C 2.7945833333333328,2.228270833333333 3.244083333333333,2.228270833333333 3.5340833333333332,1.938270833333333 L 3.9110833333333335,1.5467708333333332 C 4.201083333333333,1.2567708333333332 4.201083333333333,0.8072708333333333 3.9110833333333335,0.5172708333333331 L 3.5195833333333333,0.14027083333333312" stroke-linejoin="round"/>', '<path class="dot" d="M 8.519583333333333,1.1402708333333331 L 8.519583333333333,1.1402708333333331 C 8.229583333333332,0.8502708333333331 7.780083333333333,0.850270833333333 7.490083333333333,1.1402708333333331 L 7.113083333333333,1.5172708333333333 C 6.823083333333333,1.8072708333333332 6.823083333333333,2.2567708333333334 7.113083333333333,2.5467708333333334 L 7.504583333333333,2.938270833333333 C 7.794583333333333,3.228270833333333 8.244083333333332,3.228270833333333 8.534083333333333,2.938270833333333 L 8.911083333333334,2.5467708333333334 C 9.201083333333333,2.2567708333333334 9.201083333333333,1.8072708333333334 8.911083333333334,1.5172708333333331 L 8.519583333333333,1.1402708333333331" stroke-linejoin="round"/>', '<path class="dot" d="M 7.519583333333333,2.140270833333333 L 7.519583333333332,2.140270833333333 C 7.229583333333332,1.850270833333333 6.780083333333333,1.850270833333333 6.490083333333333,2.140270833333333 L 6.113083333333333,2.5172708333333333 C 5.823083333333333,2.807270833333333 5.823083333333333,3.2567708333333334 6.113083333333333,3.5467708333333334 L 6.504583333333333,3.938270833333333 C 6.794583333333333,4.228270833333333 7.244083333333332,4.228270833333333 7.534083333333332,3.938270833333333 L 7.911083333333333,3.5467708333333334 C 8.201083333333333,3.2567708333333334 8.201083333333333,2.8072708333333334 7.911083333333333,2.517270833333333 L 7.519583333333333,2.140270833333333" stroke-linejoin="round"/>', '<path class="dot" d="M 6.519583333333333,1.1402708333333331 L 6.519583333333332,1.1402708333333331 C 6.229583333333332,0.8502708333333331 5.780083333333333,0.850270833333333 5.490083333333333,1.1402708333333331 L 5.113083333333333,1.5172708333333333 C 4.823083333333333,1.8072708333333332 4.823083333333333,2.2567708333333334 5.113083333333333,2.5467708333333334 L 5.504583333333333,2.938270833333333 C 5.794583333333333,3.228270833333333 6.244083333333332,3.228270833333333 6.534083333333332,2.938270833333333 L 6.911083333333333,2.5467708333333334 C 7.201083333333333,2.2567708333333334 7.201083333333333,1.8072708333333334 6.911083333333333,1.5172708333333331 L 6.519583333333333,1.1402708333333331" stroke-linejoin="round"/>', '<path class="dot" d="M 7.519583333333333,0.1402708333333331 L 7.519583333333332,0.1402708333333331 C 7.229583333333332,-0.14972916666666694 6.780083333333333,-0.149729166666667 6.490083333333333,0.1402708333333331 L 6.113083333333333,0.5172708333333332 C 5.823083333333333,0.8072708333333332 5.823083333333333,1.2567708333333332 6.113083333333333,1.5467708333333332 L 6.504583333333333,1.938270833333333 C 6.794583333333333,2.228270833333333 7.244083333333332,2.228270833333333 7.534083333333332,1.938270833333333 L 7.911083333333333,1.5467708333333332 C 8.201083333333333,1.2567708333333332 8.201083333333333,0.8072708333333333 7.911083333333333,0.5172708333333331 L 7.519583333333333,0.14027083333333312" stroke-linejoin="round"/>', '<path class="dot" d="M 8.519583333333333,1.1402708333333331 L 8.519583333333333,1.1402708333333331 C 8.229583333333332,0.8502708333333331 7.780083333333333,0.850270833333333 7.490083333333333,1.1402708333333331 L 7.113083333333333,1.5172708333333333 C 6.823083333333333,1.8072708333333332 6.823083333333333,2.2567708333333334 7.113083333333333,2.5467708333333334 L 7.504583333333333,2.938270833333333 C 7.794583333333333,3.228270833333333 8.244083333333332,3.228270833333333 8.534083333333333,2.938270833333333 L 8.911083333333334,2.5467708333333334 C 9.201083333333333,2.2567708333333334 9.201083333333333,1.8072708333333334 8.911083333333334,1.5172708333333331 L 8.519583333333333,1.1402708333333331" stroke-linejoin="round"/>']
            
            
            <path d="M 8.0,5.0000003 L 8.0,15.0" fill="none"
            stroke="black"
            stroke-width="1.5"
            stroke-linecap="round"
            stroke-linejoin="round"
            />
            
            <path d="M 1.9999999999999996,5.0 L 2.000000200000001,12.000000100000001 L 3.000000200000001,14.00000004 L 4.0000002000000014,15.0 L 6.000000100000001,14.999999750000011 L 7.00000004,14.00000004 L 8.0,11.9999999" fill="none"
            stroke="black"
            stroke-width="1.5"
            stroke-linecap="round"
            stroke-linejoin="round"
            />
            
            <path d="M 4.0,2.0 L 3.0,3.0 L 2.0,1.9999997999999999 L 3.0,1.0 L 4.0,2.0 M 8.0,2.0 L 7.0,3.0 L 6.0,2.0 L 7.0,1.0 L 8.0,2.0" fill="none"
            stroke="black"
            stroke-width="1.5"
            stroke-linecap="round"
            stroke-linejoin="round"
            />
            
            
        </svg>