<?xml version="1.0"?><!DOCTYPE svg PUBLIC "-//W3C//DTD SVG 1.1//EN" "http://www.w3.org/Graphics/SVG/1.1/DTD/svg11.dtd"><svg xmlns="http://www.w3.org/2000/svg" xmlns:xlink="http://www.w3.org/1999/xlink" width="350" height="1000" viewBox="0 0 14 40" >
            
                ['<path class="dot" d="M 7.790943877551021,20.777193877551017 L 7.79094387755102,20.777193877551017 C 7.34094387755102,20.327193877551018 6.64344387755102,20.327193877551018 6.1934438775510205,20.777193877551017 L 5.608443877551021,21.362193877551018 C 5.15844387755102,21.812193877551017 5.15844387755102,22.50969387755102 5.608443877551021,22.959693877551018 L 6.21594387755102,23.56719387755102 C 6.66594387755102,24.01719387755102 7.3634438775510205,24.01719387755102 7.81344387755102,23.56719387755102 L 8.39844387755102,22.959693877551018 C 8.84844387755102,22.50969387755102 8.84844387755102,21.812193877551017 8.39844387755102,21.362193877551018 L 7.790943877551021,20.777193877551017" stroke-linejoin="round"/>', '<path class="dot" d="M 9.79094387755102,19.777193877551017 L 9.790943877551019,19.777193877551017 C 9.34094387755102,19.327193877551018 8.64344387755102,19.327193877551018 8.19344387755102,19.777193877551017 L 7.608443877551021,20.362193877551018 C 7.15844387755102,20.812193877551017 7.15844387755102,21.50969387755102 7.608443877551021,21.959693877551018 L 8.21594387755102,22.56719387755102 C 8.66594387755102,23.01719387755102 9.36344387755102,23.01719387755102 9.81344387755102,22.56719387755102 L 10.39844387755102,21.959693877551018 C 10.84844387755102,21.50969387755102 10.84844387755102,20.812193877551017 10.39844387755102,20.362193877551018 L 9.79094387755102,19.777193877551017" stroke-linejoin="round"/>', '<path class="dot" d="M 7.790943877551021,18.777193877551017 L 7.79094387755102,18.777193877551017 C 7.34094387755102,18.327193877551018 6.64344387755102,18.327193877551018 6.1934438775510205,18.777193877551017 L 5.608443877551021,19.362193877551018 C 5.15844387755102,19.812193877551017 5.15844387755102,20.50969387755102 5.608443877551021,20.959693877551018 L 6.21594387755102,21.56719387755102 C 6.66594387755102,22.01719387755102 7.3634438775510205,22.01719387755102 7.81344387755102,21.56719387755102 L 8.39844387755102,20.959693877551018 C 8.84844387755102,20.50969387755102 8.84844387755102,19.812193877551017 8.39844387755102,19.362193877551018 L 7.790943877551021,18.777193877551017" stroke-linejoin="round"/>', '<path class="dot" d="M 5.790943877551021,19.777193877551017 L 5.79094387755102,19.777193877551017 C 5.34094387755102,19.327193877551018 4.64344387755102,19.327193877551018 4.1934438775510205,19.777193877551017 L 3.60844387755102,20.362193877551018 C 3.1584438775510204,20.812193877551017 3.15844387755102,21.50969387755102 3.60844387755102,21.959693877551018 L 4.21594387755102,22.56719387755102 C 4.66594387755102,23.01719387755102 5.3634438775510205,23.01719387755102 5.81344387755102,22.56719387755102 L 6.398443877551021,21.959693877551018 C 6.84844387755102,21.50969387755102 6.84844387755102,20.812193877551017 6.398443877551021,20.362193877551018 L 5.790943877551021,19.777193877551017" stroke-linejoin="round"/>', '<path class="dot" d="M 7.790943877551021,20.777193877551017 L 7.79094387755102,20.777193877551017 C 7.34094387755102,20.327193877551018 6.64344387755102,20.327193877551018 6.1934438775510205,20.777193877551017 L 5.608443877551021,21.362193877551018 C 5.15844387755102,21.812193877551017 5.15844387755102,22.50969387755102 5.608443877551021,22.959693877551018 L 6.21594387755102,23.56719387755102 C 6.66594387755102,24.01719387755102 7.3634438775510205,24.01719387755102 7.81344387755102,23.56719387755102 L 8.39844387755102,22.959693877551018 C 8.84844387755102,22.50969387755102 8.84844387755102,21.812193877551017 8.39844387755102,21.362193877551018 L 7.790943877551021,20.777193877551017" stroke-linejoin="round"/>']
            
                ['<path class="dot" d="M 2.7909438775510207,4.777193877551018 L 2.79094387755102,4.777193877551018 C 2.3409438775510196,4.327193877551018 1.6434438775510198,4.327193877551018 1.19344387755102,4.777193877551018 L 0.6084438775510199,5.362193877551018 C 0.15844387755101996,5.812193877551018 0.15844387755101985,6.509693877551018 0.6084438775510199,6.959693877551018 L 1.2159438775510198,7.567193877551018 C 1.6659438775510198,8.017193877551017 2.3634438775510196,8.017193877551017 2.8134438775510198,7.567193877551018 L 3.3984438775510206,6.959693877551018 C 3.84844387755102,6.509693877551018 3.84844387755102,5.812193877551018 3.3984438775510206,5.362193877551018 L 2.7909438775510207,4.777193877551018" stroke-linejoin="round"/>', '<path class="dot" d="M 2.7909438775510207,3.7771938775510177 L 2.79094387755102,3.7771938775510177 C 2.3409438775510196,3.327193877551018 1.6434438775510198,3.3271938775510175 1.19344387755102,3.7771938775510177 L 0.6084438775510199,4.362193877551018 C 0.15844387755101996,4.812193877551018 0.15844387755101985,5.509693877551018 0.6084438775510199,5.959693877551018 L 1.2159438775510198,6.567193877551018 C 1.6659438775510198,7.017193877551017 2.3634438775510196,7.017193877551017 2.8134438775510198,6.567193877551018 L 3.3984438775510206,5.959693877551018 C 3.84844387755102,5.509693877551018 3.84844387755102,4.812193877551018 3.3984438775510206,4.362193877551018 L 2.7909438775510207,3.777193877551018" stroke-linejoin="round"/>', '<path class="dot" d="M 3.7909428775510206,1.7771938775510179 L 3.7909428775510197,1.7771938775510179 C 3.3409428775510195,1.327193877551018 2.6434428775510197,1.327193877551018 2.19344287755102,1.7771938775510179 L 1.6084428775510198,2.362193877551018 C 1.1584428775510198,2.8121938775510182 1.1584428775510198,3.509693877551018 1.6084428775510198,3.959693877551018 L 2.2159428775510195,4.567193877551018 C 2.6659428775510197,5.017193877551017 3.3634428775510194,5.017193877551017 3.8134428775510196,4.567193877551018 L 4.3984428775510205,3.959693877551018 C 4.84844287755102,3.509693877551018 4.84844287755102,2.8121938775510182 4.3984428775510205,2.362193877551018 L 3.7909428775510206,1.777193877551018" stroke-linejoin="round"/>', '<path class="dot" d="M 4.7909428775510206,0.7771938775510179 L 4.79094287755102,0.7771938775510179 C 4.34094287755102,0.3271938775510179 3.6434428775510197,0.3271938775510178 3.19344287755102,0.7771938775510179 L 2.60844287755102,1.3621938775510183 C 2.1584428775510203,1.8121938775510182 2.15844287755102,2.509693877551018 2.60844287755102,2.959693877551018 L 3.21594287755102,3.567193877551018 C 3.6659428775510197,4.017193877551017 4.3634428775510194,4.017193877551017 4.81344287755102,3.567193877551018 L 5.3984428775510205,2.959693877551018 C 5.848442877551021,2.509693877551018 5.848442877551021,1.8121938775510182 5.3984428775510205,1.362193877551018 L 4.7909428775510206,0.7771938775510181" stroke-linejoin="round"/>', '<path class="dot" d="M 6.7909428775510206,-0.22280612244898207 L 6.79094287755102,-0.22280612244898207 C 6.34094287755102,-0.6728061224489821 5.64344287755102,-0.6728061224489822 5.19344287755102,-0.22280612244898207 L 4.6084428775510204,0.3621938775510183 C 4.15844287755102,0.8121938775510182 4.15844287755102,1.5096938775510182 4.6084428775510204,1.9596938775510184 L 5.21594287755102,2.567193877551018 C 5.66594287755102,3.0171938775510174 6.3634428775510194,3.0171938775510174 6.81344287755102,2.567193877551018 L 7.3984428775510205,1.9596938775510184 C 7.848442877551021,1.5096938775510182 7.848442877551021,0.8121938775510182 7.3984428775510205,0.36219387755101806 L 6.7909428775510206,-0.2228061224489819" stroke-linejoin="round"/>', '<path class="dot" d="M 8.790942877551021,-0.22280612244898207 L 8.79094287755102,-0.22280612244898207 C 8.34094287755102,-0.6728061224489821 7.64344287755102,-0.6728061224489822 7.19344287755102,-0.22280612244898207 L 6.6084428775510204,0.3621938775510183 C 6.15844287755102,0.8121938775510182 6.15844287755102,1.5096938775510182 6.6084428775510204,1.9596938775510184 L 7.21594287755102,2.567193877551018 C 7.66594287755102,3.0171938775510174 8.36344287755102,3.0171938775510174 8.813442877551019,2.567193877551018 L 9.39844287755102,1.9596938775510184 C 9.84844287755102,1.5096938775510182 9.84844287755102,0.8121938775510182 9.39844287755102,0.36219387755101806 L 8.790942877551021,-0.2228061224489819" stroke-linejoin="round"/>', '<path class="dot" d="M 10.790942877551018,0.7771938775510179 L 10.790942877551018,0.7771938775510179 C 10.340942877551019,0.3271938775510179 9.643442877551019,0.3271938775510178 9.193442877551018,0.7771938775510179 L 8.608442877551019,1.3621938775510183 C 8.158442877551018,1.8121938775510182 8.158442877551018,2.509693877551018 8.608442877551019,2.959693877551018 L 9.215942877551019,3.567193877551018 C 9.665942877551018,4.017193877551017 10.363442877551018,4.017193877551017 10.813442877551019,3.567193877551018 L 11.39844287755102,2.959693877551018 C 11.848442877551019,2.509693877551018 11.848442877551019,1.8121938775510182 11.39844287755102,1.362193877551018 L 10.790942877551018,0.7771938775510181" stroke-linejoin="round"/>', '<path class="dot" d="M 11.790942877551018,1.7771938775510179 L 11.790942877551018,1.7771938775510179 C 11.340942877551019,1.327193877551018 10.643442877551019,1.327193877551018 10.193442877551018,1.7771938775510179 L 9.608442877551019,2.362193877551018 C 9.158442877551018,2.8121938775510182 9.158442877551018,3.509693877551018 9.608442877551019,3.959693877551018 L 10.215942877551019,4.567193877551018 C 10.665942877551018,5.017193877551017 11.363442877551018,5.017193877551017 11.813442877551019,4.567193877551018 L 12.39844287755102,3.959693877551018 C 12.848442877551019,3.509693877551018 12.848442877551019,2.8121938775510182 12.39844287755102,2.362193877551018 L 11.790942877551018,1.777193877551018" stroke-linejoin="round"/>', '<path class="dot" d="M 12.79094087755102,3.7771938775510177 L 12.790940877551018,3.7771938775510177 C 12.340940877551018,3.327193877551018 11.643440877551019,3.3271938775510175 11.193440877551017,3.7771938775510177 L 10.608440877551018,4.362193877551018 C 10.158440877551017,4.812193877551018 10.158440877551017,5.509693877551018 10.608440877551018,5.959693877551018 L 11.215940877551018,6.567193877551018 C 11.665940877551018,7.017193877551017 12.363440877551017,7.017193877551017 12.813440877551017,6.567193877551018 L 13.398440877551018,5.959693877551018 C 13.848440877551019,5.509693877551018 13.848440877551019,4.812193877551018 13.398440877551018,4.362193877551018 L 12.79094087755102,3.777193877551018" stroke-linejoin="round"/>', '<path class="dot" d="M 12.79094087755102,5.777193877551018 L 12.790940877551018,5.777193877551018 C 12.340940877551018,5.327193877551018 11.643440877551019,5.327193877551018 11.193440877551017,5.777193877551018 L 10.608440877551018,6.362193877551018 C 10.158440877551017,6.812193877551018 10.158440877551017,7.509693877551018 10.608440877551018,7.959693877551018 L 11.215940877551018,8.567193877551018 C 11.665940877551018,9.017193877551017 12.363440877551017,9.017193877551017 12.813440877551017,8.567193877551018 L 13.398440877551018,7.959693877551018 C 13.848440877551019,7.509693877551018 13.848440877551019,6.812193877551018 13.398440877551018,6.362193877551018 L 12.79094087755102,5.777193877551018" stroke-linejoin="round"/>', '<path class="dot" d="M 11.790942877551018,7.777193877551018 L 11.790942877551018,7.777193877551018 C 11.340942877551019,7.327193877551018 10.643442877551019,7.327193877551018 10.193442877551018,7.777193877551018 L 9.608442877551019,8.362193877551018 C 9.158442877551018,8.812193877551017 9.158442877551018,9.509693877551019 9.608442877551019,9.959693877551018 L 10.215942877551019,10.567193877551018 C 10.665942877551018,11.017193877551017 11.363442877551018,11.017193877551017 11.813442877551019,10.567193877551018 L 12.39844287755102,9.959693877551018 C 12.848442877551019,9.509693877551019 12.848442877551019,8.812193877551017 12.39844287755102,8.362193877551018 L 11.790942877551018,7.777193877551018" stroke-linejoin="round"/>', '<path class="dot" d="M 10.790942877551018,8.777193877551019 L 10.790942877551018,8.777193877551019 C 10.340942877551019,8.327193877551018 9.643442877551019,8.327193877551018 9.193442877551018,8.777193877551019 L 8.608442877551019,9.362193877551018 C 8.158442877551018,9.81219387755102 8.158442877551018,10.509693877551019 8.608442877551019,10.959693877551018 L 9.215942877551019,11.567193877551018 C 9.665942877551018,12.01719387755102 10.363442877551018,12.01719387755102 10.813442877551019,11.567193877551018 L 11.39844287755102,10.959693877551018 C 11.848442877551019,10.509693877551019 11.848442877551019,9.81219387755102 11.39844287755102,9.362193877551018 L 10.790942877551018,8.777193877551019" stroke-linejoin="round"/>', '<path class="dot" d="M 7.79094257755102,10.777193877551019 L 7.790942577551019,10.777193877551019 C 7.340942577551019,10.327193877551018 6.643442577551019,10.327193877551018 6.19344257755102,10.777193877551019 L 5.60844257755102,11.362193877551018 C 5.158442577551019,11.81219387755102 5.158442577551019,12.509693877551019 5.60844257755102,12.959693877551018 L 6.215942577551019,13.567193877551018 C 6.665942577551019,14.01719387755102 7.3634425775510195,14.01719387755102 7.813442577551019,13.567193877551018 L 8.39844257755102,12.959693877551018 C 8.848442577551019,12.509693877551019 8.848442577551019,11.81219387755102 8.39844257755102,11.362193877551018 L 7.79094257755102,10.777193877551019" stroke-linejoin="round"/>', '<path class="dot" d="M 7.79094257755102,13.777193877551019 L 7.790942577551019,13.777193877551019 C 7.340942577551019,13.327193877551018 6.643442577551019,13.327193877551018 6.19344257755102,13.777193877551019 L 5.60844257755102,14.362193877551018 C 5.158442577551019,14.81219387755102 5.158442577551019,15.509693877551019 5.60844257755102,15.959693877551018 L 6.215942577551019,16.56719387755102 C 6.665942577551019,17.01719387755102 7.3634425775510195,17.01719387755102 7.813442577551019,16.56719387755102 L 8.39844257755102,15.959693877551018 C 8.848442577551019,15.509693877551019 8.848442577551019,14.81219387755102 8.39844257755102,14.362193877551018 L 7.79094257755102,13.777193877551019" stroke-linejoin="round"/>']
            
            
            <path d="M 7.0,22.0 L 9.0,21.0 L 7.0,20.0 L 5.0,21.0 L 7.0,22.0" fill="none"
            stroke="black"
            stroke-width="2.5"
            stroke-linecap="round"
            stroke-linejoin="round"
            />
            
            <path d="M 2.0,6.0 L 2.0,5.0 L 2.999999,3.0 L 3.999999,2.0 L 5.999999,1.0 L 7.999999,1.0 L 9.999998999999999,2.0 L 10.999998999999999,3.0 L 11.999996999999999,5.0 L 11.999996999999999,7.0 L 10.999998999999999,9.0 L 9.999998999999999,10.0 L 6.999998699999999,12.0 L 6.999998699999999,15.0" fill="none"
            stroke="black"
            stroke-width="2.5"
            stroke-linecap="round"
            stroke-linejoin="round"
            />
            
            
        </svg>