<?xml version="1.0"?><!DOCTYPE svg PUBLIC "-//W3C//DTD SVG 1.1//EN" "http://www.w3.org/Graphics/SVG/1.1/DTD/svg11.dtd"><svg xmlns="http://www.w3.org/2000/svg" xmlns:xlink="http://www.w3.org/1999/xlink" width="350" height="1000" viewBox="0 0 7 17" >
            
                ['<path class="dot" d="M 6.3850003,7.3180000000000005 L 6.3850003,7.3180000000000005 C 6.165000299999999,7.098000000000001 5.8240003,7.098000000000001 5.604000299999999,7.3180000000000005 L 5.3180003,7.604000000000001 C 5.0980003,7.824000000000001 5.0980003,8.165000000000001 5.3180003,8.385000000000002 L 5.615000299999999,8.682 C 5.835000299999999,8.902000000000001 6.1760003,8.902000000000001 6.396000299999999,8.682 L 6.6820003,8.385000000000002 C 6.9020003,8.165000000000001 6.9020003,7.824000000000001 6.6820003,7.604000000000001 L 6.3850003,7.3180000000000005" stroke-linejoin="round"/>', '<path class="dot" d="M 6.3850003,3.3180000999999995 L 6.3850003,3.3180000999999995 C 6.165000299999999,3.0980000999999993 5.8240003,3.0980000999999993 5.604000299999999,3.3180000999999995 L 5.3180003,3.6040000999999995 C 5.0980003,3.8240000999999997 5.0980003,4.165000099999999 5.3180003,4.385000099999999 L 5.615000299999999,4.6820001 C 5.835000299999999,4.9020000999999995 6.1760003,4.9020000999999995 6.396000299999999,4.6820001 L 6.6820003,4.385000099999999 C 6.9020003,4.165000099999999 6.9020003,3.8240000999999997 6.6820003,3.6040000999999995 L 6.3850003,3.3180000999999995" stroke-linejoin="round"/>', '<path class="dot" d="M 2.3850001,7.3180000000000005 L 2.3850000999999996,7.3180000000000005 C 2.1650000999999994,7.098000000000001 1.8240000999999997,7.098000000000001 1.6040000999999997,7.3180000000000005 L 1.3180000999999997,7.604000000000001 C 1.0980000999999997,7.824000000000001 1.0980000999999995,8.165000000000001 1.3180000999999997,8.385000000000002 L 1.6150000999999996,8.682 C 1.8350000999999996,8.902000000000001 2.1760000999999995,8.902000000000001 2.3960000999999993,8.682 L 2.6820000999999998,8.385000000000002 C 2.9020001,8.165000000000001 2.9020001,7.824000000000001 2.6820000999999998,7.604000000000001 L 2.3850001,7.3180000000000005" stroke-linejoin="round"/>']
            
            
            <path d="M 6.0000003,8.0 L 2.0000001,4.000000099999999 M 6.0000003,4.000000099999999 L 2.0000001,8.0" fill="none"
            stroke="black"
            stroke-width="1"
            stroke-linecap="round"
            stroke-linejoin="round"
            />
            
            
        </svg>