<?xml version="1.0"?><!DOCTYPE svg PUBLIC "-//W3C//DTD SVG 1.1//EN" "http://www.w3.org/Graphics/SVG/1.1/DTD/svg11.dtd"><svg xmlns="http://www.w3.org/2000/svg" xmlns:xlink="http://www.w3.org/1999/xlink" width="350" height="1000" viewBox="0 0 7 17" >
            
                ['<path class="dot" d="M 5.885,8.318 L 5.885,8.318 C 5.664999999999999,8.098 5.324,8.098 5.103999999999999,8.318 L 4.818,8.604000000000001 C 4.598,8.824 4.598,9.165000000000001 4.818,9.385000000000002 L 5.114999999999999,9.682 C 5.334999999999999,9.902000000000001 5.676,9.902000000000001 5.895999999999999,9.682 L 6.182,9.385000000000002 C 6.402,9.165000000000001 6.402,8.824 6.182,8.604000000000001 L 5.885,8.318000000000001" stroke-linejoin="round"/>', '<path class="dot" d="M 3.885,10.318 L 3.885,10.318 C 3.6649999999999996,10.098 3.324,10.098 3.1039999999999996,10.318 L 2.8179999999999996,10.604000000000001 C 2.5979999999999994,10.824 2.5979999999999994,11.165000000000001 2.8179999999999996,11.385000000000002 L 3.1149999999999993,11.682 C 3.3349999999999995,11.902000000000001 3.6759999999999997,11.902000000000001 3.8959999999999995,11.682 L 4.182,11.385000000000002 C 4.402,11.165000000000001 4.402,10.824 4.182,10.604000000000001 L 3.885,10.318000000000001" stroke-linejoin="round"/>', '<path class="dot" d="M 1.885,8.318 L 1.8849999999999998,8.318 C 1.6649999999999998,8.098 1.3239999999999998,8.098 1.1039999999999999,8.318 L 0.8179999999999998,8.604000000000001 C 0.5979999999999998,8.824 0.5979999999999998,9.165000000000001 0.8179999999999998,9.385000000000002 L 1.1149999999999998,9.682 C 1.3349999999999997,9.902000000000001 1.676,9.902000000000001 1.8959999999999997,9.682 L 2.1820000000000004,9.385000000000002 C 2.402,9.165000000000001 2.402,8.824 2.1820000000000004,8.604000000000001 L 1.885,8.318000000000001" stroke-linejoin="round"/>', '<path class="dot" d="M 1.885,5.3180000000000005 L 1.8849999999999998,5.3180000000000005 C 1.6649999999999998,5.098000000000001 1.3239999999999998,5.098000000000001 1.1039999999999999,5.3180000000000005 L 0.8179999999999998,5.604000000000001 C 0.5979999999999998,5.824000000000001 0.5979999999999998,6.165000000000001 0.8179999999999998,6.385000000000001 L 1.1149999999999998,6.682 C 1.3349999999999997,6.902 1.676,6.902 1.8959999999999997,6.682 L 2.1820000000000004,6.385000000000001 C 2.402,6.165000000000001 2.402,5.824000000000001 2.1820000000000004,5.604000000000001 L 1.885,5.3180000000000005" stroke-linejoin="round"/>', '<path class="dot" d="M 3.885,3.318 L 3.885,3.318 C 3.6649999999999996,3.098 3.324,3.098 3.1039999999999996,3.318 L 2.8179999999999996,3.604 C 2.5979999999999994,3.8240000000000003 2.5979999999999994,4.165 2.8179999999999996,4.385 L 3.1149999999999993,4.682 C 3.3349999999999995,4.902 3.6759999999999997,4.902 3.8959999999999995,4.682 L 4.182,4.385 C 4.402,4.165 4.402,3.8240000000000003 4.182,3.604 L 3.885,3.318" stroke-linejoin="round"/>', '<path class="dot" d="M 5.885,5.3180000000000005 L 5.885,5.3180000000000005 C 5.664999999999999,5.098000000000001 5.324,5.098000000000001 5.103999999999999,5.3180000000000005 L 4.818,5.604000000000001 C 4.598,5.824000000000001 4.598,6.165000000000001 4.818,6.385000000000001 L 5.114999999999999,6.682 C 5.334999999999999,6.902 5.676,6.902 5.895999999999999,6.682 L 6.182,6.385000000000001 C 6.402,6.165000000000001 6.402,5.824000000000001 6.182,5.604000000000001 L 5.885,5.3180000000000005" stroke-linejoin="round"/>']
            
                ['<path class="dot" d="M 5.885,3.318 L 5.885,3.318 C 5.664999999999999,3.098 5.324,3.098 5.103999999999999,3.318 L 4.818,3.604 C 4.598,3.8240000000000003 4.598,4.165 4.818,4.385 L 5.114999999999999,4.682 C 5.334999999999999,4.902 5.676,4.902 5.895999999999999,4.682 L 6.182,4.385 C 6.402,4.165 6.402,3.8240000000000003 6.182,3.604 L 5.885,3.318" stroke-linejoin="round"/>', '<path class="dot" d="M 5.885,10.318 L 5.885,10.318 C 5.664999999999999,10.098 5.324,10.098 5.103999999999999,10.318 L 4.818,10.604000000000001 C 4.598,10.824 4.598,11.165000000000001 4.818,11.385000000000002 L 5.114999999999999,11.682 C 5.334999999999999,11.902000000000001 5.676,11.902000000000001 5.895999999999999,11.682 L 6.182,11.385000000000002 C 6.402,11.165000000000001 6.402,10.824 6.182,10.604000000000001 L 5.885,10.318000000000001" stroke-linejoin="round"/>']
            
            
            <path d="M 5.5,9.0 L 3.5,11.0 L 1.5,9.0 L 1.5,6.0 L 3.5,4.0 L 5.5,6.0" fill="none"
            stroke="black"
            stroke-width="1"
            stroke-linecap="round"
            stroke-linejoin="round"
            />
            
            <path d="M 5.5,4.0 L 5.5,11.0" fill="none"
            stroke="black"
            stroke-width="1"
            stroke-linecap="round"
            stroke-linejoin="round"
            />
            
            
        </svg>