<?xml version="1.0"?><!DOCTYPE svg PUBLIC "-//W3C//DTD SVG 1.1//EN" "http://www.w3.org/Graphics/SVG/1.1/DTD/svg11.dtd"><svg xmlns="http://www.w3.org/2000/svg" xmlns:xlink="http://www.w3.org/1999/xlink" width="350" height="1000" viewBox="0 0 10 26" >
            
                ['<path class="dot" d="M 5.5195831333333345,14.140270833333332 L 5.5195831333333345,14.140270833333332 C 5.2295831333333345,13.850270833333333 4.780083133333334,13.850270833333333 4.490083133333334,14.140270833333332 L 4.113083133333334,14.517270833333333 C 3.823083133333334,14.807270833333334 3.823083133333334,15.256770833333333 4.113083133333334,15.546770833333333 L 4.504583133333334,15.938270833333332 C 4.794583133333334,16.228270833333333 5.244083133333334,16.228270833333333 5.5340831333333345,15.938270833333332 L 5.911083133333335,15.546770833333333 C 6.201083133333334,15.256770833333333 6.201083133333334,14.807270833333334 5.911083133333335,14.517270833333333 L 5.5195831333333345,14.140270833333332" stroke-linejoin="round"/>', '<path class="dot" d="M 10.519583033333333,9.140271033333333 L 10.519583033333333,9.140271033333333 C 10.229583033333332,8.850271033333334 9.780083033333332,8.850271033333334 9.490083033333333,9.140271033333333 L 9.113083033333332,9.517271033333333 C 8.823083033333333,9.807271033333333 8.823083033333333,10.256771033333333 9.113083033333332,10.546771033333334 L 9.504583033333333,10.938271033333333 C 9.794583033333332,11.228271033333334 10.244083033333332,11.228271033333334 10.534083033333333,10.938271033333333 L 10.911083033333334,10.546771033333334 C 11.201083033333333,10.256771033333333 11.201083033333333,9.807271033333334 10.911083033333334,9.517271033333333 L 10.519583033333333,9.140271033333333" stroke-linejoin="round"/>', '<path class="dot" d="M 5.5195831333333345,4.140271133333333 L 5.5195831333333345,4.140271133333333 C 5.2295831333333345,3.8502711333333326 4.780083133333334,3.8502711333333326 4.490083133333334,4.140271133333333 L 4.113083133333334,4.517271133333333 C 3.823083133333334,4.807271133333333 3.823083133333334,5.2567711333333325 4.113083133333334,5.546771133333333 L 4.504583133333334,5.938271133333332 C 4.794583133333334,6.228271133333333 5.244083133333334,6.228271133333333 5.5340831333333345,5.938271133333332 L 5.911083133333335,5.546771133333333 C 6.201083133333334,5.2567711333333325 6.201083133333334,4.807271133333333 5.911083133333335,4.517271133333333 L 5.5195831333333345,4.140271133333333" stroke-linejoin="round"/>', '<path class="dot" d="M 0.5195833333333333,9.140271033333331 L 0.5195833333333331,9.140271033333331 C 0.22958333333333325,8.850271033333332 -0.21991666666666687,8.850271033333332 -0.5099166666666669,9.140271033333331 L -0.8869166666666668,9.517271033333332 C -1.1769166666666668,9.807271033333333 -1.1769166666666668,10.256771033333331 -0.8869166666666668,10.546771033333332 L -0.49541666666666695,10.938271033333331 C -0.20541666666666702,11.228271033333332 0.2440833333333332,11.228271033333332 0.534083333333333,10.938271033333331 L 0.9110833333333335,10.546771033333332 C 1.2010833333333335,10.256771033333331 1.2010833333333335,9.807271033333333 0.9110833333333335,9.517271033333332 L 0.5195833333333335,9.140271033333331" stroke-linejoin="round"/>']
            
            
            <path d="M 4.999999800000001,15.0 L 4.999999800000001,5.0000003 M 9.9999997,10.0000002 L 4.999999800000001,5.0000003 L 0.0,10.000000199999999" fill="none"
            stroke="black"
            stroke-width="1.5"
            stroke-linecap="round"
            stroke-linejoin="round"
            />
            
            
        </svg>