<?xml version="1.0"?><!DOCTYPE svg PUBLIC "-//W3C//DTD SVG 1.1//EN" "http://www.w3.org/Graphics/SVG/1.1/DTD/svg11.dtd"><svg xmlns="http://www.w3.org/2000/svg" xmlns:xlink="http://www.w3.org/1999/xlink" width="350" height="1000" viewBox="0 0 10 26" >
            
                ['<path class="dot" d="M 5.519583333333333,4.140271133333333 L 5.519583333333333,4.140271133333333 C 5.229583333333333,3.8502711333333326 4.780083333333333,3.8502711333333326 4.490083333333333,4.140271133333333 L 4.113083333333333,4.517271133333333 C 3.823083333333333,4.807271133333333 3.823083333333333,5.2567711333333325 4.113083333333333,5.546771133333333 L 4.504583333333333,5.938271133333332 C 4.794583333333333,6.228271133333333 5.244083333333333,6.228271133333333 5.534083333333333,5.938271133333332 L 5.911083333333334,5.546771133333333 C 6.201083333333333,5.2567711333333325 6.201083333333333,4.807271133333333 5.911083333333334,4.517271133333333 L 5.519583333333333,4.140271133333333" stroke-linejoin="round"/>', '<path class="dot" d="M 5.519583333333333,14.140270833333332 L 5.519583333333333,14.140270833333332 C 5.229583333333333,13.850270833333333 4.780083333333333,13.850270833333333 4.490083333333333,14.140270833333332 L 4.113083333333333,14.517270833333333 C 3.823083333333333,14.807270833333334 3.823083333333333,15.256770833333333 4.113083333333333,15.546770833333333 L 4.504583333333333,15.938270833333332 C 4.794583333333333,16.228270833333333 5.244083333333333,16.228270833333333 5.534083333333333,15.938270833333332 L 5.911083333333334,15.546770833333333 C 6.201083333333333,15.256770833333333 6.201083333333333,14.807270833333334 5.911083333333334,14.517270833333333 L 5.519583333333333,14.140270833333332" stroke-linejoin="round"/>']
            
                ['<path class="dot" d="M 2.5195833333333333,4.140270833333333 L 2.5195833333333333,4.140270833333333 C 2.2295833333333333,3.8502708333333326 1.7800833333333332,3.8502708333333326 1.4900833333333332,4.140270833333333 L 1.1130833333333332,4.517270833333333 C 0.8230833333333332,4.807270833333333 0.8230833333333331,5.2567708333333325 1.1130833333333332,5.546770833333333 L 1.5045833333333332,5.938270833333332 C 1.794583333333333,6.228270833333333 2.244083333333333,6.228270833333333 2.5340833333333332,5.938270833333332 L 2.9110833333333335,5.546770833333333 C 3.2010833333333335,5.2567708333333325 3.2010833333333335,4.807270833333333 2.9110833333333335,4.517270833333333 L 2.5195833333333333,4.140270833333333" stroke-linejoin="round"/>', '<path class="dot" d="M 5.519583333333333,4.140270833333333 L 5.519583333333333,4.140270833333333 C 5.229583333333333,3.8502708333333326 4.780083333333333,3.8502708333333326 4.490083333333333,4.140270833333333 L 4.113083333333333,4.517270833333333 C 3.823083333333333,4.807270833333333 3.823083333333333,5.2567708333333325 4.113083333333333,5.546770833333333 L 4.504583333333333,5.938270833333332 C 4.794583333333333,6.228270833333333 5.244083333333333,6.228270833333333 5.534083333333333,5.938270833333332 L 5.911083333333334,5.546770833333333 C 6.201083333333333,5.2567708333333325 6.201083333333333,4.807270833333333 5.911083333333334,4.517270833333333 L 5.519583333333333,4.140270833333333" stroke-linejoin="round"/>']
            
                ['<path class="dot" d="M 2.5195833333333333,14.140270833333332 L 2.5195833333333333,14.140270833333332 C 2.2295833333333333,13.850270833333333 1.7800833333333332,13.850270833333333 1.4900833333333332,14.140270833333332 L 1.1130833333333332,14.517270833333333 C 0.8230833333333332,14.807270833333334 0.8230833333333331,15.256770833333333 1.1130833333333332,15.546770833333333 L 1.5045833333333332,15.938270833333332 C 1.794583333333333,16.228270833333333 2.244083333333333,16.228270833333333 2.5340833333333332,15.938270833333332 L 2.9110833333333335,15.546770833333333 C 3.2010833333333335,15.256770833333333 3.2010833333333335,14.807270833333334 2.9110833333333335,14.517270833333333 L 2.5195833333333333,14.140270833333332" stroke-linejoin="round"/>', '<path class="dot" d="M 8.519583333333333,14.140270833333332 L 8.519583333333333,14.140270833333332 C 8.229583333333332,13.850270833333333 7.780083333333333,13.850270833333333 7.490083333333333,14.140270833333332 L 7.113083333333333,14.517270833333333 C 6.823083333333333,14.807270833333334 6.823083333333333,15.256770833333333 7.113083333333333,15.546770833333333 L 7.504583333333333,15.938270833333332 C 7.794583333333333,16.228270833333333 8.244083333333332,16.228270833333333 8.534083333333333,15.938270833333332 L 8.911083333333334,15.546770833333333 C 9.201083333333333,15.256770833333333 9.201083333333333,14.807270833333334 8.911083333333334,14.517270833333333 L 8.519583333333333,14.140270833333332" stroke-linejoin="round"/>']
            
                ['<path class="dot" d="M 3.5349959961768387,0.11002217931886002 L 3.5349959961768382,0.11002217931886002 C 3.2449959961768386,-0.17997782068114002 2.7954959961768386,-0.17997782068114007 2.5054959961768386,0.11002217931886002 L 2.1284959961768384,0.48702217931886016 C 1.8384959961768386,0.7770221793188601 1.8384959961768386,1.22652217931886 2.1284959961768384,1.5165221793188601 L 2.5199959961768386,1.9080221793188599 C 2.8099959961768386,2.19802217931886 3.2594959961768386,2.19802217931886 3.549495996176838,1.9080221793188599 L 3.926495996176839,1.5165221793188601 C 4.216495996176839,1.22652217931886 4.216495996176839,0.7770221793188602 3.926495996176839,0.48702217931886005 L 3.534995996176839,0.11002217931886005" stroke-linejoin="round"/>', '<path class="dot" d="M 7.504170670489827,2.1705198873478047 L 7.5041706704898266,2.1705198873478047 C 7.2141706704898265,1.8805198873478046 6.764670670489827,1.8805198873478046 6.474670670489827,2.1705198873478047 L 6.097670670489827,2.547519887347805 C 5.807670670489827,2.8375198873478045 5.807670670489827,3.287019887347805 6.097670670489827,3.577019887347805 L 6.489170670489827,3.9685198873478047 C 6.779170670489827,4.258519887347805 7.2286706704898265,4.258519887347805 7.5186706704898265,3.9685198873478047 L 7.895670670489827,3.577019887347805 C 8.185670670489827,3.287019887347805 8.185670670489827,2.837519887347805 7.895670670489827,2.5475198873478044 L 7.504170670489827,2.1705198873478047" stroke-linejoin="round"/>']
            
            
            <path d="M 5.0,5.0000003 L 5.0,15.0" fill="none"
            stroke="black"
            stroke-width="1.5"
            stroke-linecap="round"
            stroke-linejoin="round"
            />
            
            <path d="M 2.0,5.0 L 5.0,5.0" fill="none"
            stroke="black"
            stroke-width="1.5"
            stroke-linecap="round"
            stroke-linejoin="round"
            />
            
            <path d="M 2.0,15.0 L 8.0,15.0" fill="none"
            stroke="black"
            stroke-width="1.5"
            stroke-linecap="round"
            stroke-linejoin="round"
            />
            
            <path d="M 3.0154126628435054,0.9697513459855269 L 6.984587337156494,3.0302490540144715" fill="none"
            stroke="black"
            stroke-width="1.5"
            stroke-linecap="round"
            stroke-linejoin="round"
            />
            
            
        </svg>