<?xml version="1.0"?><!DOCTYPE svg PUBLIC "-//W3C//DTD SVG 1.1//EN" "http://www.w3.org/Graphics/SVG/1.1/DTD/svg11.dtd"><svg xmlns="http://www.w3.org/2000/svg" xmlns:xlink="http://www.w3.org/1999/xlink" width="350" height="1000" viewBox="0 0 14 40" >
            
                ['<path class="dot" d="M 6.790943877551021,7.777193877551018 L 6.79094387755102,7.777193877551018 C 6.34094387755102,7.327193877551018 5.64344387755102,7.327193877551018 5.1934438775510205,7.777193877551018 L 4.608443877551021,8.362193877551018 C 4.15844387755102,8.812193877551017 4.15844387755102,9.509693877551019 4.608443877551021,9.959693877551018 L 5.21594387755102,10.567193877551018 C 5.66594387755102,11.017193877551017 6.3634438775510205,11.017193877551017 6.81344387755102,10.567193877551018 L 7.398443877551021,9.959693877551018 C 7.84844387755102,9.509693877551019 7.84844387755102,8.812193877551017 7.398443877551021,8.362193877551018 L 6.790943877551021,7.777193877551018" stroke-linejoin="round"/>', '<path class="dot" d="M 2.7909438775510207,10.777193877551019 L 2.79094387755102,10.777193877551019 C 2.3409438775510196,10.327193877551018 1.6434438775510198,10.327193877551018 1.19344387755102,10.777193877551019 L 0.6084438775510199,11.362193877551018 C 0.15844387755101996,11.81219387755102 0.15844387755101985,12.509693877551019 0.6084438775510199,12.959693877551018 L 1.2159438775510198,13.567193877551018 C 1.6659438775510198,14.01719387755102 2.3634438775510196,14.01719387755102 2.8134438775510198,13.567193877551018 L 3.3984438775510206,12.959693877551018 C 3.84844387755102,12.509693877551019 3.84844387755102,11.81219387755102 3.3984438775510206,11.362193877551018 L 2.7909438775510207,10.777193877551019" stroke-linejoin="round"/>', '<path class="dot" d="M 10.790943877551019,10.777193877551019 L 10.790943877551019,10.777193877551019 C 10.34094387755102,10.327193877551018 9.64344387755102,10.327193877551018 9.193443877551019,10.777193877551019 L 8.60844387755102,11.362193877551018 C 8.158443877551019,11.81219387755102 8.158443877551019,12.509693877551019 8.60844387755102,12.959693877551018 L 9.21594387755102,13.567193877551018 C 9.665943877551019,14.01719387755102 10.363443877551019,14.01719387755102 10.81344387755102,13.567193877551018 L 11.39844387755102,12.959693877551018 C 11.84844387755102,12.509693877551019 11.84844387755102,11.81219387755102 11.39844387755102,11.362193877551018 L 10.790943877551019,10.777193877551019" stroke-linejoin="round"/>', '<path class="dot" d="M 2.7909438775510207,16.777193877551017 L 2.79094387755102,16.777193877551017 C 2.3409438775510196,16.327193877551018 1.6434438775510198,16.327193877551018 1.19344387755102,16.777193877551017 L 0.6084438775510199,17.362193877551018 C 0.15844387755101996,17.812193877551017 0.15844387755101985,18.50969387755102 0.6084438775510199,18.959693877551018 L 1.2159438775510198,19.56719387755102 C 1.6659438775510198,20.01719387755102 2.3634438775510196,20.01719387755102 2.8134438775510198,19.56719387755102 L 3.3984438775510206,18.959693877551018 C 3.84844387755102,18.50969387755102 3.84844387755102,17.812193877551017 3.3984438775510206,17.362193877551018 L 2.7909438775510207,16.777193877551017" stroke-linejoin="round"/>']
            
            
            <path d="M 6.0,9.0 L 6.0,21.0 M 2.0,12.0 L 10.0,18.0 M 10.0,12.0 L 2.0,18.0" fill="none"
            stroke="black"
            stroke-width="2.5"
            stroke-linecap="round"
            stroke-linejoin="round"
            />
            
            
        </svg>