<?xml version="1.0"?><!DOCTYPE svg PUBLIC "-//W3C//DTD SVG 1.1//EN" "http://www.w3.org/Graphics/SVG/1.1/DTD/svg11.dtd"><svg xmlns="http://www.w3.org/2000/svg" xmlns:xlink="http://www.w3.org/1999/xlink" width="350" height="1000" viewBox="0 0 10 26" >
            
                ['<path class="dot" d="M 2.5195833333333333,7.140270833333333 L 2.5195833333333333,7.140270833333333 C 2.2295833333333333,6.850270833333333 1.7800833333333332,6.850270833333333 1.4900833333333332,7.140270833333333 L 1.1130833333333332,7.517270833333333 C 0.8230833333333332,7.807270833333333 0.8230833333333331,8.256770833333333 1.1130833333333332,8.546770833333333 L 1.5045833333333332,8.938270833333332 C 1.794583333333333,9.228270833333333 2.244083333333333,9.228270833333333 2.5340833333333332,8.938270833333332 L 2.9110833333333335,8.546770833333333 C 3.2010833333333335,8.256770833333333 3.2010833333333335,7.807270833333333 2.9110833333333335,7.517270833333333 L 2.5195833333333333,7.140270833333333" stroke-linejoin="round"/>', '<path class="dot" d="M 9.519583333333333,7.140270833333333 L 9.519583333333333,7.140270833333333 C 9.229583333333332,6.850270833333333 8.780083333333332,6.850270833333333 8.490083333333333,7.140270833333333 L 8.113083333333332,7.517270833333333 C 7.823083333333333,7.807270833333333 7.823083333333333,8.256770833333333 8.113083333333332,8.546770833333333 L 8.504583333333333,8.938270833333332 C 8.794583333333332,9.228270833333333 9.244083333333332,9.228270833333333 9.534083333333333,8.938270833333332 L 9.911083333333334,8.546770833333333 C 10.201083333333333,8.256770833333333 10.201083333333333,7.807270833333333 9.911083333333334,7.517270833333333 L 9.519583333333333,7.140270833333333" stroke-linejoin="round"/>']
            
            
            <path d="M 2.0,8.0 L 9.0,8.0" fill="none"
            stroke="black"
            stroke-width="1.5"
            stroke-linecap="round"
            stroke-linejoin="round"
            />
            
            
        </svg>