<?xml version="1.0"?><!DOCTYPE svg PUBLIC "-//W3C//DTD SVG 1.1//EN" "http://www.w3.org/Graphics/SVG/1.1/DTD/svg11.dtd"><svg xmlns="http://www.w3.org/2000/svg" xmlns:xlink="http://www.w3.org/1999/xlink" width="350" height="1000" viewBox="0 0 14 40" >
            
                ['<path class="dot" d="M 2.790943977551021,0.7771938775510179 L 2.79094397755102,0.7771938775510179 C 2.34094397755102,0.3271938775510179 1.6434439775510201,0.3271938775510178 1.1934439775510204,0.7771938775510179 L 0.6084439775510202,1.3621938775510183 C 0.15844397755102024,1.8121938775510182 0.15844397755102013,2.509693877551018 0.6084439775510202,2.959693877551018 L 1.2159439775510201,3.567193877551018 C 1.66594397755102,4.017193877551017 2.36344397755102,4.017193877551017 2.81344397755102,3.567193877551018 L 3.398443977551021,2.959693877551018 C 3.84844397755102,2.509693877551018 3.84844397755102,1.8121938775510182 3.398443977551021,1.362193877551018 L 2.790943977551021,0.7771938775510181" stroke-linejoin="round"/>', '<path class="dot" d="M 1.7909439967603105,4.777193877551018 L 1.7909439967603096,4.777193877551018 C 1.3409439967603098,4.327193877551018 0.6434439967603098,4.327193877551018 0.19344399676031,4.777193877551018 L -0.39155600323969003,5.362193877551018 C -0.84155600323969,5.812193877551018 -0.8415560032396902,6.509693877551018 -0.39155600323969003,6.959693877551018 L 0.21594399676030984,7.567193877551018 C 0.6659439967603098,8.017193877551017 1.3634439967603098,8.017193877551017 1.8134439967603095,7.567193877551018 L 2.39844399676031,6.959693877551018 C 2.8484439967603103,6.509693877551018 2.8484439967603103,5.812193877551018 2.39844399676031,5.362193877551018 L 1.7909439967603105,4.777193877551018" stroke-linejoin="round"/>', '<path class="dot" d="M 1.7909439371556655,13.777193877551019 L 1.7909439371556646,13.777193877551019 C 1.3409439371556648,13.327193877551018 0.6434439371556648,13.327193877551018 0.193443937155665,13.777193877551019 L -0.39155606284433503,14.362193877551018 C -0.841556062844335,14.81219387755102 -0.8415560628443352,15.509693877551019 -0.39155606284433503,15.959693877551018 L 0.21594393715566484,16.56719387755102 C 0.6659439371556648,17.01719387755102 1.3634439371556648,17.01719387755102 1.8134439371556645,16.56719387755102 L 2.3984439371556654,15.959693877551018 C 2.848443937155665,15.509693877551019 2.848443937155665,14.81219387755102 2.3984439371556654,14.362193877551018 L 1.7909439371556655,13.777193877551019" stroke-linejoin="round"/>', '<path class="dot" d="M 2.790943977551021,17.777193877551017 L 2.79094397755102,17.777193877551017 C 2.34094397755102,17.327193877551018 1.6434439775510201,17.327193877551018 1.1934439775510204,17.777193877551017 L 0.6084439775510202,18.362193877551018 C 0.15844397755102024,18.812193877551017 0.15844397755102013,19.50969387755102 0.6084439775510202,19.959693877551018 L 1.2159439775510201,20.56719387755102 C 1.66594397755102,21.01719387755102 2.36344397755102,21.01719387755102 2.81344397755102,20.56719387755102 L 3.398443977551021,19.959693877551018 C 3.84844397755102,19.50969387755102 3.84844397755102,18.812193877551017 3.398443977551021,18.362193877551018 L 2.790943977551021,17.777193877551017" stroke-linejoin="round"/>', '<path class="dot" d="M 4.790943877551021,19.777193877551017 L 4.79094387755102,19.777193877551017 C 4.34094387755102,19.327193877551018 3.64344387755102,19.327193877551018 3.19344387755102,19.777193877551017 L 2.60844387755102,20.362193877551018 C 2.1584438775510204,20.812193877551017 2.15844387755102,21.50969387755102 2.60844387755102,21.959693877551018 L 3.21594387755102,22.56719387755102 C 3.66594387755102,23.01719387755102 4.3634438775510205,23.01719387755102 4.81344387755102,22.56719387755102 L 5.398443877551021,21.959693877551018 C 5.84844387755102,21.50969387755102 5.84844387755102,20.812193877551017 5.398443877551021,20.362193877551018 L 4.790943877551021,19.777193877551017" stroke-linejoin="round"/>', '<path class="dot" d="M 6.790943877551021,20.777193877551017 L 6.79094387755102,20.777193877551017 C 6.34094387755102,20.327193877551018 5.64344387755102,20.327193877551018 5.1934438775510205,20.777193877551017 L 4.608443877551021,21.362193877551018 C 4.15844387755102,21.812193877551017 4.15844387755102,22.50969387755102 4.608443877551021,22.959693877551018 L 5.21594387755102,23.56719387755102 C 5.66594387755102,24.01719387755102 6.3634438775510205,24.01719387755102 6.81344387755102,23.56719387755102 L 7.398443877551021,22.959693877551018 C 7.84844387755102,22.50969387755102 7.84844387755102,21.812193877551017 7.398443877551021,21.362193877551018 L 6.790943877551021,20.777193877551017" stroke-linejoin="round"/>', '<path class="dot" d="M 8.79094387755102,20.777193877551017 L 8.790943877551019,20.777193877551017 C 8.34094387755102,20.327193877551018 7.64344387755102,20.327193877551018 7.1934438775510205,20.777193877551017 L 6.608443877551021,21.362193877551018 C 6.15844387755102,21.812193877551017 6.15844387755102,22.50969387755102 6.608443877551021,22.959693877551018 L 7.21594387755102,23.56719387755102 C 7.66594387755102,24.01719387755102 8.36344387755102,24.01719387755102 8.81344387755102,23.56719387755102 L 9.39844387755102,22.959693877551018 C 9.84844387755102,22.50969387755102 9.84844387755102,21.812193877551017 9.39844387755102,21.362193877551018 L 8.79094387755102,20.777193877551017" stroke-linejoin="round"/>', '<path class="dot" d="M 10.790943877551019,19.777193877551017 L 10.790943877551019,19.777193877551017 C 10.34094387755102,19.327193877551018 9.64344387755102,19.327193877551018 9.193443877551019,19.777193877551017 L 8.60844387755102,20.362193877551018 C 8.158443877551019,20.812193877551017 8.158443877551019,21.50969387755102 8.60844387755102,21.959693877551018 L 9.21594387755102,22.56719387755102 C 9.665943877551019,23.01719387755102 10.363443877551019,23.01719387755102 10.81344387755102,22.56719387755102 L 11.39844387755102,21.959693877551018 C 11.84844387755102,21.50969387755102 11.84844387755102,20.812193877551017 11.39844387755102,20.362193877551018 L 10.790943877551019,19.777193877551017" stroke-linejoin="round"/>', '<path class="dot" d="M 12.790943877551019,17.777193877551017 L 12.790943877551019,17.777193877551017 C 12.34094387755102,17.327193877551018 11.64344387755102,17.327193877551018 11.193443877551019,17.777193877551017 L 10.60844387755102,18.362193877551018 C 10.158443877551019,18.812193877551017 10.158443877551019,19.50969387755102 10.60844387755102,19.959693877551018 L 11.21594387755102,20.56719387755102 C 11.665943877551019,21.01719387755102 12.363443877551019,21.01719387755102 12.81344387755102,20.56719387755102 L 13.39844387755102,19.959693877551018 C 13.84844387755102,19.50969387755102 13.84844387755102,18.812193877551017 13.39844387755102,18.362193877551018 L 12.790943877551019,17.777193877551017" stroke-linejoin="round"/>', '<path class="dot" d="M 13.790943877551019,13.777193877551019 L 13.790943877551019,13.777193877551019 C 13.34094387755102,13.327193877551018 12.64344387755102,13.327193877551018 12.193443877551019,13.777193877551019 L 11.60844387755102,14.362193877551018 C 11.158443877551019,14.81219387755102 11.158443877551019,15.509693877551019 11.60844387755102,15.959693877551018 L 12.21594387755102,16.56719387755102 C 12.665943877551019,17.01719387755102 13.363443877551019,17.01719387755102 13.81344387755102,16.56719387755102 L 14.39844387755102,15.959693877551018 C 14.84844387755102,15.509693877551019 14.84844387755102,14.81219387755102 14.39844387755102,14.362193877551018 L 13.790943877551019,13.777193877551019" stroke-linejoin="round"/>', '<path class="dot" d="M 13.790943877551019,4.777193877551018 L 13.790943877551019,4.777193877551018 C 13.34094387755102,4.327193877551018 12.64344387755102,4.327193877551018 12.193443877551019,4.777193877551018 L 11.60844387755102,5.362193877551018 C 11.158443877551019,5.812193877551018 11.158443877551019,6.509693877551018 11.60844387755102,6.959693877551018 L 12.21594387755102,7.567193877551018 C 12.665943877551019,8.017193877551017 13.363443877551019,8.017193877551017 13.81344387755102,7.567193877551018 L 14.39844387755102,6.959693877551018 C 14.84844387755102,6.509693877551018 14.84844387755102,5.812193877551018 14.39844387755102,5.362193877551018 L 13.790943877551019,4.777193877551018" stroke-linejoin="round"/>', '<path class="dot" d="M 12.790943877551019,0.7771938775510179 L 12.790943877551019,0.7771938775510179 C 12.34094387755102,0.3271938775510179 11.64344387755102,0.3271938775510178 11.193443877551019,0.7771938775510179 L 10.60844387755102,1.3621938775510183 C 10.158443877551019,1.8121938775510182 10.158443877551019,2.509693877551018 10.60844387755102,2.959693877551018 L 11.21594387755102,3.567193877551018 C 11.665943877551019,4.017193877551017 12.363443877551019,4.017193877551017 12.81344387755102,3.567193877551018 L 13.39844387755102,2.959693877551018 C 13.84844387755102,2.509693877551018 13.84844387755102,1.8121938775510182 13.39844387755102,1.362193877551018 L 12.790943877551019,0.7771938775510181" stroke-linejoin="round"/>', '<path class="dot" d="M 10.790943877551019,-1.2228061224489821 L 10.790943877551019,-1.2228061224489821 C 10.34094387755102,-1.672806122448982 9.64344387755102,-1.672806122448982 9.193443877551019,-1.2228061224489821 L 8.60844387755102,-0.6378061224489817 C 8.158443877551019,-0.18780612244898176 8.158443877551019,0.5096938775510182 8.60844387755102,0.9596938775510184 L 9.21594387755102,1.567193877551018 C 9.665943877551019,2.0171938775510174 10.363443877551019,2.0171938775510174 10.81344387755102,1.567193877551018 L 11.39844387755102,0.9596938775510184 C 11.84844387755102,0.5096938775510182 11.84844387755102,-0.18780612244898176 11.39844387755102,-0.6378061224489819 L 10.790943877551019,-1.222806122448982" stroke-linejoin="round"/>', '<path class="dot" d="M 8.79094387755102,-2.2228061224489823 L 8.790943877551019,-2.2228061224489823 C 8.34094387755102,-2.672806122448982 7.64344387755102,-2.6728061224489825 7.1934438775510205,-2.2228061224489823 L 6.608443877551021,-1.637806122448982 C 6.15844387755102,-1.187806122448982 6.15844387755102,-0.490306122448982 6.608443877551021,-0.040306122448981796 L 7.21594387755102,0.5671938775510177 C 7.66594387755102,1.0171938775510174 8.36344387755102,1.0171938775510174 8.81344387755102,0.5671938775510177 L 9.39844387755102,-0.040306122448981796 C 9.84844387755102,-0.490306122448982 9.84844387755102,-1.187806122448982 9.39844387755102,-1.6378061224489822 L 8.79094387755102,-2.222806122448982" stroke-linejoin="round"/>', '<path class="dot" d="M 6.790943877551021,-2.2228061224489823 L 6.79094387755102,-2.2228061224489823 C 6.34094387755102,-2.672806122448982 5.64344387755102,-2.6728061224489825 5.1934438775510205,-2.2228061224489823 L 4.608443877551021,-1.637806122448982 C 4.15844387755102,-1.187806122448982 4.15844387755102,-0.490306122448982 4.608443877551021,-0.040306122448981796 L 5.21594387755102,0.5671938775510177 C 5.66594387755102,1.0171938775510174 6.3634438775510205,1.0171938775510174 6.81344387755102,0.5671938775510177 L 7.398443877551021,-0.040306122448981796 C 7.84844387755102,-0.490306122448982 7.84844387755102,-1.187806122448982 7.398443877551021,-1.6378061224489822 L 6.790943877551021,-2.222806122448982" stroke-linejoin="round"/>', '<path class="dot" d="M 4.790943877551021,-1.2228061224489821 L 4.79094387755102,-1.2228061224489821 C 4.34094387755102,-1.672806122448982 3.64344387755102,-1.672806122448982 3.19344387755102,-1.2228061224489821 L 2.60844387755102,-0.6378061224489817 C 2.1584438775510204,-0.18780612244898176 2.15844387755102,0.5096938775510182 2.60844387755102,0.9596938775510184 L 3.21594387755102,1.567193877551018 C 3.66594387755102,2.0171938775510174 4.3634438775510205,2.0171938775510174 4.81344387755102,1.567193877551018 L 5.398443877551021,0.9596938775510184 C 5.84844387755102,0.5096938775510182 5.84844387755102,-0.18780612244898176 5.398443877551021,-0.6378061224489819 L 4.790943877551021,-1.222806122448982" stroke-linejoin="round"/>', '<path class="dot" d="M 10.79094397755102,6.777193877551018 L 10.790943977551018,6.777193877551018 C 10.340943977551019,6.327193877551018 9.64344397755102,6.327193877551018 9.193443977551018,6.777193877551018 L 8.608443977551019,7.362193877551018 C 8.158443977551018,7.812193877551018 8.158443977551018,8.509693877551019 8.608443977551019,8.959693877551018 L 9.215943977551019,9.567193877551018 C 9.665943977551018,10.017193877551017 10.363443977551018,10.017193877551017 10.813443977551017,9.567193877551018 L 11.398443977551018,8.959693877551018 C 11.84844397755102,8.509693877551019 11.84844397755102,7.812193877551018 11.398443977551018,7.362193877551018 L 10.79094397755102,6.777193877551018" stroke-linejoin="round"/>', '<path class="dot" d="M 9.79094397755102,2.7771938775510177 L 9.79094397755102,2.7771938775510177 C 9.340943977551019,2.327193877551018 8.64344397755102,2.3271938775510175 8.19344397755102,2.7771938775510177 L 7.60844397755102,3.362193877551018 C 7.15844397755102,3.8121938775510182 7.15844397755102,4.509693877551018 7.60844397755102,4.959693877551018 L 8.215943977551019,5.567193877551018 C 8.66594397755102,6.017193877551017 9.36344397755102,6.017193877551017 9.81344397755102,5.567193877551018 L 10.39844397755102,4.959693877551018 C 10.84844397755102,4.509693877551018 10.84844397755102,3.8121938775510182 10.39844397755102,3.362193877551018 L 9.79094397755102,2.777193877551018" stroke-linejoin="round"/>', '<path class="dot" d="M 8.79094397755102,1.7771938775510179 L 8.79094397755102,1.7771938775510179 C 8.340943977551019,1.327193877551018 7.643443977551019,1.327193877551018 7.19344397755102,1.7771938775510179 L 6.60844397755102,2.362193877551018 C 6.15844397755102,2.8121938775510182 6.15844397755102,3.509693877551018 6.60844397755102,3.959693877551018 L 7.215943977551019,4.567193877551018 C 7.665943977551019,5.017193877551017 8.36344397755102,5.017193877551017 8.81344397755102,4.567193877551018 L 9.39844397755102,3.959693877551018 C 9.84844397755102,3.509693877551018 9.84844397755102,2.8121938775510182 9.39844397755102,2.362193877551018 L 8.79094397755102,1.777193877551018" stroke-linejoin="round"/>', '<path class="dot" d="M 6.790943877551021,1.7771938775510179 L 6.79094387755102,1.7771938775510179 C 6.34094387755102,1.327193877551018 5.64344387755102,1.327193877551018 5.1934438775510205,1.7771938775510179 L 4.608443877551021,2.362193877551018 C 4.15844387755102,2.8121938775510182 4.15844387755102,3.509693877551018 4.608443877551021,3.959693877551018 L 5.21594387755102,4.567193877551018 C 5.66594387755102,5.017193877551017 6.3634438775510205,5.017193877551017 6.81344387755102,4.567193877551018 L 7.398443877551021,3.959693877551018 C 7.84844387755102,3.509693877551018 7.84844387755102,2.8121938775510182 7.398443877551021,2.362193877551018 L 6.790943877551021,1.777193877551018" stroke-linejoin="round"/>', '<path class="dot" d="M 5.790943877551021,2.7771938775510177 L 5.79094387755102,2.7771938775510177 C 5.34094387755102,2.327193877551018 4.64344387755102,2.3271938775510175 4.1934438775510205,2.7771938775510177 L 3.60844387755102,3.362193877551018 C 3.1584438775510204,3.8121938775510182 3.15844387755102,4.509693877551018 3.60844387755102,4.959693877551018 L 4.21594387755102,5.567193877551018 C 4.66594387755102,6.017193877551017 5.3634438775510205,6.017193877551017 5.81344387755102,5.567193877551018 L 6.398443877551021,4.959693877551018 C 6.84844387755102,4.509693877551018 6.84844387755102,3.8121938775510182 6.398443877551021,3.362193877551018 L 5.790943877551021,2.777193877551018" stroke-linejoin="round"/>', '<path class="dot" d="M 4.79094397755102,7.777193877551018 L 4.790943977551019,7.777193877551018 C 4.340943977551019,7.327193877551018 3.6434439775510192,7.327193877551018 3.1934439775510195,7.777193877551018 L 2.6084439775510195,8.362193877551018 C 2.15844397755102,8.812193877551017 2.1584439775510194,9.509693877551019 2.6084439775510195,9.959693877551018 L 3.2159439775510195,10.567193877551018 C 3.665943977551019,11.017193877551017 4.36344397755102,11.017193877551017 4.813443977551019,10.567193877551018 L 5.39844397755102,9.959693877551018 C 5.848443977551019,9.509693877551019 5.848443977551019,8.812193877551017 5.39844397755102,8.362193877551018 L 4.79094397755102,7.777193877551018" stroke-linejoin="round"/>', '<path class="dot" d="M 4.79094397755102,10.777193877551019 L 4.790943977551019,10.777193877551019 C 4.340943977551019,10.327193877551018 3.6434439775510192,10.327193877551018 3.1934439775510195,10.777193877551019 L 2.6084439775510195,11.362193877551018 C 2.15844397755102,11.81219387755102 2.1584439775510194,12.509693877551019 2.6084439775510195,12.959693877551018 L 3.2159439775510195,13.567193877551018 C 3.665943977551019,14.01719387755102 4.36344397755102,14.01719387755102 4.813443977551019,13.567193877551018 L 5.39844397755102,12.959693877551018 C 5.848443977551019,12.509693877551019 5.848443977551019,11.81219387755102 5.39844397755102,11.362193877551018 L 4.79094397755102,10.777193877551019" stroke-linejoin="round"/>', '<path class="dot" d="M 5.790943877551021,15.777193877551019 L 5.79094387755102,15.777193877551019 C 5.34094387755102,15.327193877551018 4.64344387755102,15.327193877551018 4.1934438775510205,15.777193877551019 L 3.60844387755102,16.362193877551018 C 3.1584438775510204,16.812193877551017 3.15844387755102,17.50969387755102 3.60844387755102,17.959693877551018 L 4.21594387755102,18.56719387755102 C 4.66594387755102,19.01719387755102 5.3634438775510205,19.01719387755102 5.81344387755102,18.56719387755102 L 6.398443877551021,17.959693877551018 C 6.84844387755102,17.50969387755102 6.84844387755102,16.812193877551017 6.398443877551021,16.362193877551018 L 5.790943877551021,15.777193877551019" stroke-linejoin="round"/>', '<path class="dot" d="M 6.790943877551021,16.777193877551017 L 6.79094387755102,16.777193877551017 C 6.34094387755102,16.327193877551018 5.64344387755102,16.327193877551018 5.1934438775510205,16.777193877551017 L 4.608443877551021,17.362193877551018 C 4.15844387755102,17.812193877551017 4.15844387755102,18.50969387755102 4.608443877551021,18.959693877551018 L 5.21594387755102,19.56719387755102 C 5.66594387755102,20.01719387755102 6.3634438775510205,20.01719387755102 6.81344387755102,19.56719387755102 L 7.398443877551021,18.959693877551018 C 7.84844387755102,18.50969387755102 7.84844387755102,17.812193877551017 7.398443877551021,17.362193877551018 L 6.790943877551021,16.777193877551017" stroke-linejoin="round"/>', '<path class="dot" d="M 8.79094397755102,16.777193877551017 L 8.79094397755102,16.777193877551017 C 8.340943977551019,16.327193877551018 7.643443977551019,16.327193877551018 7.19344397755102,16.777193877551017 L 6.60844397755102,17.362193877551018 C 6.15844397755102,17.812193877551017 6.15844397755102,18.50969387755102 6.60844397755102,18.959693877551018 L 7.215943977551019,19.56719387755102 C 7.665943977551019,20.01719387755102 8.36344397755102,20.01719387755102 8.81344397755102,19.56719387755102 L 9.39844397755102,18.959693877551018 C 9.84844397755102,18.50969387755102 9.84844397755102,17.812193877551017 9.39844397755102,17.362193877551018 L 8.79094397755102,16.777193877551017" stroke-linejoin="round"/>', '<path class="dot" d="M 9.79094397755102,15.777193877551019 L 9.79094397755102,15.777193877551019 C 9.340943977551019,15.327193877551018 8.64344397755102,15.327193877551018 8.19344397755102,15.777193877551019 L 7.60844397755102,16.362193877551018 C 7.15844397755102,16.812193877551017 7.15844397755102,17.50969387755102 7.60844397755102,17.959693877551018 L 8.215943977551019,18.56719387755102 C 8.66594397755102,19.01719387755102 9.36344397755102,19.01719387755102 9.81344397755102,18.56719387755102 L 10.39844397755102,17.959693877551018 C 10.84844397755102,17.50969387755102 10.84844397755102,16.812193877551017 10.39844397755102,16.362193877551018 L 9.79094397755102,15.777193877551019" stroke-linejoin="round"/>', '<path class="dot" d="M 10.79094397755102,11.777193877551019 L 10.790943977551018,11.777193877551019 C 10.340943977551019,11.327193877551018 9.64344397755102,11.327193877551018 9.193443977551018,11.777193877551019 L 8.608443977551019,12.362193877551018 C 8.158443977551018,12.81219387755102 8.158443977551018,13.509693877551019 8.608443977551019,13.959693877551018 L 9.215943977551019,14.567193877551018 C 9.665943977551018,15.01719387755102 10.363443977551018,15.01719387755102 10.813443977551017,14.567193877551018 L 11.398443977551018,13.959693877551018 C 11.84844397755102,13.509693877551019 11.84844397755102,12.81219387755102 11.398443977551018,12.362193877551018 L 10.79094397755102,11.777193877551019" stroke-linejoin="round"/>']
            
            
            <path d="M 2.0000001000000003,2.0 L 1.00000011920929,6.0 L 1.000000059604645,15.0 L 2.0000001000000003,19.0 L 4.0,21.0 L 6.0,22.0 L 8.0,22.0 L 10.0,21.0 L 12.0,19.0 L 13.0,15.0 L 13.0,6.0 L 12.0,2.0 L 10.0,0.0 L 8.0,-1.0 L 6.0,-1.0 L 4.0,0.0 L 2.0000001000000003,2.0 M 10.0000001,8.0 L 9.0000001,4.0 L 8.0000001,3.0 L 6.0,3.0 L 5.0,4.0 L 4.000000099999999,9.0 L 4.000000099999999,12.0 L 5.0,17.0 L 6.0,18.0 L 8.0000001,18.0 L 9.0000001,17.0 L 10.0000001,13.0" fill="none"
            stroke="black"
            stroke-width="2.5"
            stroke-linecap="round"
            stroke-linejoin="round"
            />
            
            
        </svg>