<?xml version="1.0"?><!DOCTYPE svg PUBLIC "-//W3C//DTD SVG 1.1//EN" "http://www.w3.org/Graphics/SVG/1.1/DTD/svg11.dtd"><svg xmlns="http://www.w3.org/2000/svg" xmlns:xlink="http://www.w3.org/1999/xlink" width="350" height="1000" viewBox="0 0 14 40" >
            
                ['<path class="dot" d="M 4.790943877551021,-0.22280612244898207 L 4.79094387755102,-0.22280612244898207 C 4.34094387755102,-0.6728061224489821 3.64344387755102,-0.6728061224489822 3.19344387755102,-0.22280612244898207 L 2.60844387755102,0.3621938775510183 C 2.1584438775510204,0.8121938775510182 2.15844387755102,1.5096938775510182 2.60844387755102,1.9596938775510184 L 3.21594387755102,2.567193877551018 C 3.66594387755102,3.0171938775510174 4.3634438775510205,3.0171938775510174 4.81344387755102,2.567193877551018 L 5.398443877551021,1.9596938775510184 C 5.84844387755102,1.5096938775510182 5.84844387755102,0.8121938775510182 5.398443877551021,0.36219387755101806 L 4.790943877551021,-0.2228061224489819" stroke-linejoin="round"/>', '<path class="dot" d="M 10.790943877551019,-0.22280612244898207 L 10.790943877551019,-0.22280612244898207 C 10.34094387755102,-0.6728061224489821 9.64344387755102,-0.6728061224489822 9.193443877551019,-0.22280612244898207 L 8.60844387755102,0.3621938775510183 C 8.158443877551019,0.8121938775510182 8.158443877551019,1.5096938775510182 8.60844387755102,1.9596938775510184 L 9.21594387755102,2.567193877551018 C 9.665943877551019,3.0171938775510174 10.363443877551019,3.0171938775510174 10.81344387755102,2.567193877551018 L 11.39844387755102,1.9596938775510184 C 11.84844387755102,1.5096938775510182 11.84844387755102,0.8121938775510182 11.39844387755102,0.36219387755101806 L 10.790943877551019,-0.2228061224489819" stroke-linejoin="round"/>', '<path class="dot" d="M 10.790943877551019,6.777193877551018 L 10.790943877551019,6.777193877551018 C 10.34094387755102,6.327193877551018 9.64344387755102,6.327193877551018 9.193443877551019,6.777193877551018 L 8.60844387755102,7.362193877551018 C 8.158443877551019,7.812193877551018 8.158443877551019,8.509693877551019 8.60844387755102,8.959693877551018 L 9.21594387755102,9.567193877551018 C 9.665943877551019,10.017193877551017 10.363443877551019,10.017193877551017 10.81344387755102,9.567193877551018 L 11.39844387755102,8.959693877551018 C 11.84844387755102,8.509693877551019 11.84844387755102,7.812193877551018 11.39844387755102,7.362193877551018 L 10.790943877551019,6.777193877551018" stroke-linejoin="round"/>']
            
            
            <path d="M 4.0,1.0 L 4.0,8.0 M 10.0,1.0 L 10.0,8.0" fill="none"
            stroke="black"
            stroke-width="2.5"
            stroke-linecap="round"
            stroke-linejoin="round"
            />
            
            
        </svg>