<?xml version="1.0"?><!DOCTYPE svg PUBLIC "-//W3C//DTD SVG 1.1//EN" "http://www.w3.org/Graphics/SVG/1.1/DTD/svg11.dtd"><svg xmlns="http://www.w3.org/2000/svg" xmlns:xlink="http://www.w3.org/1999/xlink" width="350" height="1000" viewBox="0 0 10 26" >
            
                ['<path class="dot" d="M 4.519583333333333,13.167291733333332 L 4.519583333333333,13.167291733333332 C 4.229583333333333,12.877291733333333 3.7800833333333332,12.877291733333333 3.490083333333333,13.167291733333332 L 3.113083333333333,13.544291733333333 C 2.823083333333333,13.834291733333334 2.823083333333333,14.283791733333333 3.113083333333333,14.573791733333334 L 3.504583333333333,14.965291733333332 C 3.7945833333333328,15.255291733333333 4.244083333333333,15.255291733333333 4.534083333333333,14.965291733333332 L 4.911083333333334,14.573791733333334 C 5.201083333333333,14.283791733333333 5.201083333333333,13.834291733333334 4.911083333333334,13.544291733333333 L 4.519583333333333,13.167291733333332" stroke-linejoin="round"/>', '<path class="dot" d="M 5.519583333333333,14.140270833333332 L 5.519583333333333,14.140270833333332 C 5.229583333333333,13.850270833333333 4.780083333333333,13.850270833333333 4.490083333333333,14.140270833333332 L 4.113083333333333,14.517270833333333 C 3.823083333333333,14.807270833333334 3.823083333333333,15.256770833333333 4.113083333333333,15.546770833333333 L 4.504583333333333,15.938270833333332 C 4.794583333333333,16.228270833333333 5.244083333333333,16.228270833333333 5.534083333333333,15.938270833333332 L 5.911083333333334,15.546770833333333 C 6.201083333333333,15.256770833333333 6.201083333333333,14.807270833333334 5.911083333333334,14.517270833333333 L 5.519583333333333,14.140270833333332" stroke-linejoin="round"/>', '<path class="dot" d="M 6.519583333333333,13.140270833333332 L 6.519583333333332,13.140270833333332 C 6.229583333333332,12.850270833333333 5.780083333333333,12.850270833333333 5.490083333333333,13.140270833333332 L 5.113083333333333,13.517270833333333 C 4.823083333333333,13.807270833333334 4.823083333333333,14.256770833333333 5.113083333333333,14.546770833333333 L 5.504583333333333,14.938270833333332 C 5.794583333333333,15.228270833333333 6.244083333333332,15.228270833333333 6.534083333333332,14.938270833333332 L 6.911083333333333,14.546770833333333 C 7.201083333333333,14.256770833333333 7.201083333333333,13.807270833333334 6.911083333333333,13.517270833333333 L 6.519583333333333,13.140270833333332" stroke-linejoin="round"/>', '<path class="dot" d="M 5.519583333333333,12.140270833333332 L 5.519583333333333,12.140270833333332 C 5.229583333333333,11.850270833333333 4.780083333333333,11.850270833333333 4.490083333333333,12.140270833333332 L 4.113083333333333,12.517270833333333 C 3.823083333333333,12.807270833333334 3.823083333333333,13.256770833333333 4.113083333333333,13.546770833333333 L 4.504583333333333,13.938270833333332 C 4.794583333333333,14.228270833333333 5.244083333333333,14.228270833333333 5.534083333333333,13.938270833333332 L 5.911083333333334,13.546770833333333 C 6.201083333333333,13.256770833333333 6.201083333333333,12.807270833333334 5.911083333333334,12.517270833333333 L 5.519583333333333,12.140270833333332" stroke-linejoin="round"/>', '<path class="dot" d="M 4.519583333333333,13.167291733333332 L 4.519583333333333,13.167291733333332 C 4.229583333333333,12.877291733333333 3.7800833333333332,12.877291733333333 3.490083333333333,13.167291733333332 L 3.113083333333333,13.544291733333333 C 2.823083333333333,13.834291733333334 2.823083333333333,14.283791733333333 3.113083333333333,14.573791733333334 L 3.504583333333333,14.965291733333332 C 3.7945833333333328,15.255291733333333 4.244083333333333,15.255291733333333 4.534083333333333,14.965291733333332 L 4.911083333333334,14.573791733333334 C 5.201083333333333,14.283791733333333 5.201083333333333,13.834291733333334 4.911083333333334,13.544291733333333 L 4.519583333333333,13.167291733333332" stroke-linejoin="round"/>']
            
                ['<path class="dot" d="M 4.519583333333333,5.167291733333333 L 4.519583333333333,5.167291733333333 C 4.229583333333333,4.877291733333333 3.7800833333333332,4.877291733333333 3.490083333333333,5.167291733333333 L 3.113083333333333,5.544291733333333 C 2.823083333333333,5.834291733333333 2.823083333333333,6.283791733333333 3.113083333333333,6.5737917333333336 L 3.504583333333333,6.965291733333332 C 3.7945833333333328,7.255291733333333 4.244083333333333,7.255291733333333 4.534083333333333,6.965291733333332 L 4.911083333333334,6.5737917333333336 C 5.201083333333333,6.283791733333333 5.201083333333333,5.834291733333333 4.911083333333334,5.544291733333333 L 4.519583333333333,5.167291733333333" stroke-linejoin="round"/>', '<path class="dot" d="M 5.519583333333333,6.140270833333333 L 5.519583333333333,6.140270833333333 C 5.229583333333333,5.850270833333333 4.780083333333333,5.850270833333333 4.490083333333333,6.140270833333333 L 4.113083333333333,6.517270833333333 C 3.823083333333333,6.807270833333333 3.823083333333333,7.2567708333333325 4.113083333333333,7.546770833333333 L 4.504583333333333,7.938270833333332 C 4.794583333333333,8.228270833333333 5.244083333333333,8.228270833333333 5.534083333333333,7.938270833333332 L 5.911083333333334,7.546770833333333 C 6.201083333333333,7.2567708333333325 6.201083333333333,6.807270833333333 5.911083333333334,6.517270833333333 L 5.519583333333333,6.140270833333333" stroke-linejoin="round"/>', '<path class="dot" d="M 6.519583333333333,5.140270833333333 L 6.519583333333332,5.140270833333333 C 6.229583333333332,4.850270833333333 5.780083333333333,4.850270833333333 5.490083333333333,5.140270833333333 L 5.113083333333333,5.517270833333333 C 4.823083333333333,5.807270833333333 4.823083333333333,6.2567708333333325 5.113083333333333,6.546770833333333 L 5.504583333333333,6.938270833333332 C 5.794583333333333,7.228270833333333 6.244083333333332,7.228270833333333 6.534083333333332,6.938270833333332 L 6.911083333333333,6.546770833333333 C 7.201083333333333,6.2567708333333325 7.201083333333333,5.807270833333333 6.911083333333333,5.517270833333333 L 6.519583333333333,5.140270833333333" stroke-linejoin="round"/>', '<path class="dot" d="M 5.519583333333333,4.140270833333333 L 5.519583333333333,4.140270833333333 C 5.229583333333333,3.8502708333333326 4.780083333333333,3.8502708333333326 4.490083333333333,4.140270833333333 L 4.113083333333333,4.517270833333333 C 3.823083333333333,4.807270833333333 3.823083333333333,5.2567708333333325 4.113083333333333,5.546770833333333 L 4.504583333333333,5.938270833333332 C 4.794583333333333,6.228270833333333 5.244083333333333,6.228270833333333 5.534083333333333,5.938270833333332 L 5.911083333333334,5.546770833333333 C 6.201083333333333,5.2567708333333325 6.201083333333333,4.807270833333333 5.911083333333334,4.517270833333333 L 5.519583333333333,4.140270833333333" stroke-linejoin="round"/>', '<path class="dot" d="M 4.519583333333333,5.167291733333333 L 4.519583333333333,5.167291733333333 C 4.229583333333333,4.877291733333333 3.7800833333333332,4.877291733333333 3.490083333333333,5.167291733333333 L 3.113083333333333,5.544291733333333 C 2.823083333333333,5.834291733333333 2.823083333333333,6.283791733333333 3.113083333333333,6.5737917333333336 L 3.504583333333333,6.965291733333332 C 3.7945833333333328,7.255291733333333 4.244083333333333,7.255291733333333 4.534083333333333,6.965291733333332 L 4.911083333333334,6.5737917333333336 C 5.201083333333333,6.283791733333333 5.201083333333333,5.834291733333333 4.911083333333334,5.544291733333333 L 4.519583333333333,5.167291733333333" stroke-linejoin="round"/>']
            
            
            <path d="M 4.0,14.0270209 L 5.0,15.0 L 6.0,14.0 L 5.0,13.0 L 4.0,14.0270209" fill="none"
            stroke="black"
            stroke-width="1.5"
            stroke-linecap="round"
            stroke-linejoin="round"
            />
            
            <path d="M 4.0,6.0270209 L 5.0,7.0 L 6.0,6.0 L 5.0,5.0 L 4.0,6.0270209" fill="none"
            stroke="black"
            stroke-width="1.5"
            stroke-linecap="round"
            stroke-linejoin="round"
            />
            
            
        </svg>