<?xml version="1.0"?><!DOCTYPE svg PUBLIC "-//W3C//DTD SVG 1.1//EN" "http://www.w3.org/Graphics/SVG/1.1/DTD/svg11.dtd"><svg xmlns="http://www.w3.org/2000/svg" xmlns:xlink="http://www.w3.org/1999/xlink" width="350" height="1000" viewBox="0 0 7 17" >
            
                ['<path class="dot" d="M 2.385,0.31800000000000006 L 2.385,0.31800000000000006 C 2.165,0.09799999999999998 1.8239999999999998,0.09799999999999995 1.6039999999999999,0.31800000000000006 L 1.3179999999999998,0.6040000000000002 C 1.0979999999999999,0.8240000000000002 1.0979999999999996,1.1650000000000003 1.3179999999999998,1.3850000000000002 L 1.6149999999999998,1.682 C 1.8349999999999997,1.902 2.176,1.902 2.396,1.682 L 2.6820000000000004,1.3850000000000002 C 2.902,1.165 2.902,0.8240000000000002 2.6820000000000004,0.6040000000000001 L 2.385,0.31800000000000006" stroke-linejoin="round"/>', '<path class="dot" d="M 6.385,0.31800000000000006 L 6.385,0.31800000000000006 C 6.164999999999999,0.09799999999999998 5.824,0.09799999999999995 5.603999999999999,0.31800000000000006 L 5.318,0.6040000000000002 C 5.098,0.8240000000000002 5.098,1.1650000000000003 5.318,1.3850000000000002 L 5.614999999999999,1.682 C 5.834999999999999,1.902 6.176,1.902 6.395999999999999,1.682 L 6.682,1.3850000000000002 C 6.902,1.165 6.902,0.8240000000000002 6.682,0.6040000000000001 L 6.385,0.31800000000000006" stroke-linejoin="round"/>']
            
                ['<path class="dot" d="M 2.263679656440358,10.267747468305833 L 2.263679656440358,10.267747468305833 C 2.043679656440358,10.047747468305834 1.702679656440358,10.047747468305834 1.482679656440358,10.267747468305833 L 1.196679656440358,10.553747468305835 C 0.9766796564403578,10.773747468305833 0.9766796564403578,11.114747468305834 1.196679656440358,11.334747468305835 L 1.4936796564403578,11.631747468305834 C 1.7136796564403578,11.851747468305835 2.054679656440358,11.851747468305835 2.274679656440358,11.631747468305834 L 2.5606796564403584,11.334747468305835 C 2.780679656440358,11.114747468305834 2.780679656440358,10.773747468305833 2.5606796564403584,10.553747468305835 L 2.263679656440358,10.267747468305835" stroke-linejoin="round"/>', '<path class="dot" d="M 6.506320343559642,0.3682525316941674 L 6.506320343559642,0.3682525316941674 C 6.286320343559641,0.1482525316941673 5.945320343559642,0.14825253169416727 5.725320343559641,0.3682525316941674 L 5.439320343559642,0.6542525316941675 C 5.219320343559642,0.8742525316941675 5.219320343559642,1.2152525316941676 5.439320343559642,1.4352525316941676 L 5.736320343559641,1.7322525316941673 C 5.956320343559641,1.9522525316941672 6.297320343559642,1.9522525316941672 6.517320343559641,1.7322525316941673 L 6.803320343559642,1.4352525316941676 C 7.023320343559642,1.2152525316941674 7.023320343559642,0.8742525316941675 6.803320343559642,0.6542525316941674 L 6.506320343559642,0.3682525316941674" stroke-linejoin="round"/>']
            
                ['<path class="dot" d="M 2.385,10.318 L 2.385,10.318 C 2.165,10.098 1.8239999999999998,10.098 1.6039999999999999,10.318 L 1.3179999999999998,10.604000000000001 C 1.0979999999999999,10.824 1.0979999999999996,11.165000000000001 1.3179999999999998,11.385000000000002 L 1.6149999999999998,11.682 C 1.8349999999999997,11.902000000000001 2.176,11.902000000000001 2.396,11.682 L 2.6820000000000004,11.385000000000002 C 2.902,11.165000000000001 2.902,10.824 2.6820000000000004,10.604000000000001 L 2.385,10.318000000000001" stroke-linejoin="round"/>', '<path class="dot" d="M 6.385,10.318 L 6.385,10.318 C 6.164999999999999,10.098 5.824,10.098 5.603999999999999,10.318 L 5.318,10.604000000000001 C 5.098,10.824 5.098,11.165000000000001 5.318,11.385000000000002 L 5.614999999999999,11.682 C 5.834999999999999,11.902000000000001 6.176,11.902000000000001 6.395999999999999,11.682 L 6.682,11.385000000000002 C 6.902,11.165000000000001 6.902,10.824 6.682,10.604000000000001 L 6.385,10.318000000000001" stroke-linejoin="round"/>']
            
            
            <path d="M 2.0,1.0 L 6.0,1.0" fill="none"
            stroke="black"
            stroke-width="1"
            stroke-linecap="round"
            stroke-linejoin="round"
            />
            
            <path d="M 1.878679656440358,10.949747468305834 L 6.121320343559642,1.0502525316941673" fill="none"
            stroke="black"
            stroke-width="1"
            stroke-linecap="round"
            stroke-linejoin="round"
            />
            
            <path d="M 2.0,11.0 L 6.0,11.0" fill="none"
            stroke="black"
            stroke-width="1"
            stroke-linecap="round"
            stroke-linejoin="round"
            />
            
            
        </svg>