<?xml version="1.0"?><!DOCTYPE svg PUBLIC "-//W3C//DTD SVG 1.1//EN" "http://www.w3.org/Graphics/SVG/1.1/DTD/svg11.dtd"><svg xmlns="http://www.w3.org/2000/svg" xmlns:xlink="http://www.w3.org/1999/xlink" width="350" height="1000" viewBox="0 0 7 17" >
            
                ['<path class="dot" d="M 3.885,3.318 L 3.885,3.318 C 3.6649999999999996,3.098 3.324,3.098 3.1039999999999996,3.318 L 2.8179999999999996,3.604 C 2.5979999999999994,3.8240000000000003 2.5979999999999994,4.165 2.8179999999999996,4.385 L 3.1149999999999993,4.682 C 3.3349999999999995,4.902 3.6759999999999997,4.902 3.8959999999999995,4.682 L 4.182,4.385 C 4.402,4.165 4.402,3.8240000000000003 4.182,3.604 L 3.885,3.318" stroke-linejoin="round"/>', '<path class="dot" d="M 2.885,4.3180000000000005 L 2.885,4.3180000000000005 C 2.665,4.098000000000001 2.324,4.098000000000001 2.1039999999999996,4.3180000000000005 L 1.8179999999999998,4.604000000000001 C 1.5979999999999999,4.824000000000001 1.5979999999999996,5.165000000000001 1.8179999999999998,5.385000000000001 L 2.1149999999999998,5.682 C 2.335,5.902 2.676,5.902 2.896,5.682 L 3.1820000000000004,5.385000000000001 C 3.402,5.165000000000001 3.402,4.824000000000001 3.1820000000000004,4.604000000000001 L 2.885,4.3180000000000005" stroke-linejoin="round"/>', '<path class="dot" d="M 1.885,6.3180000000000005 L 1.8849999999999998,6.3180000000000005 C 1.6649999999999998,6.098000000000001 1.3239999999999998,6.098000000000001 1.1039999999999999,6.3180000000000005 L 0.8179999999999998,6.604000000000001 C 0.5979999999999998,6.824000000000001 0.5979999999999998,7.165000000000001 0.8179999999999998,7.385000000000001 L 1.1149999999999998,7.682 C 1.3349999999999997,7.902 1.676,7.902 1.8959999999999997,7.682 L 2.1820000000000004,7.385000000000001 C 2.402,7.165000000000001 2.402,6.824000000000001 2.1820000000000004,6.604000000000001 L 1.885,6.3180000000000005" stroke-linejoin="round"/>', '<path class="dot" d="M 1.885,7.3180000000000005 L 1.8849999999999998,7.3180000000000005 C 1.6649999999999998,7.098000000000001 1.3239999999999998,7.098000000000001 1.1039999999999999,7.3180000000000005 L 0.8179999999999998,7.604000000000001 C 0.5979999999999998,7.824000000000001 0.5979999999999998,8.165000000000001 0.8179999999999998,8.385000000000002 L 1.1149999999999998,8.682 C 1.3349999999999997,8.902000000000001 1.676,8.902000000000001 1.8959999999999997,8.682 L 2.1820000000000004,8.385000000000002 C 2.402,8.165000000000001 2.402,7.824000000000001 2.1820000000000004,7.604000000000001 L 1.885,7.3180000000000005" stroke-linejoin="round"/>', '<path class="dot" d="M 2.885,9.318 L 2.885,9.318 C 2.665,9.098 2.324,9.098 2.1039999999999996,9.318 L 1.8179999999999998,9.604000000000001 C 1.5979999999999999,9.824 1.5979999999999996,10.165000000000001 1.8179999999999998,10.385000000000002 L 2.1149999999999998,10.682 C 2.335,10.902000000000001 2.676,10.902000000000001 2.896,10.682 L 3.1820000000000004,10.385000000000002 C 3.402,10.165000000000001 3.402,9.824 3.1820000000000004,9.604000000000001 L 2.885,9.318000000000001" stroke-linejoin="round"/>', '<path class="dot" d="M 3.885,10.318 L 3.885,10.318 C 3.6649999999999996,10.098 3.324,10.098 3.1039999999999996,10.318 L 2.8179999999999996,10.604000000000001 C 2.5979999999999994,10.824 2.5979999999999994,11.165000000000001 2.8179999999999996,11.385000000000002 L 3.1149999999999993,11.682 C 3.3349999999999995,11.902000000000001 3.6759999999999997,11.902000000000001 3.8959999999999995,11.682 L 4.182,11.385000000000002 C 4.402,11.165000000000001 4.402,10.824 4.182,10.604000000000001 L 3.885,10.318000000000001" stroke-linejoin="round"/>', '<path class="dot" d="M 4.885,9.318 L 4.885,9.318 C 4.664999999999999,9.098 4.324,9.098 4.103999999999999,9.318 L 3.8179999999999996,9.604000000000001 C 3.5979999999999994,9.824 3.5979999999999994,10.165000000000001 3.8179999999999996,10.385000000000002 L 4.114999999999999,10.682 C 4.334999999999999,10.902000000000001 4.676,10.902000000000001 4.895999999999999,10.682 L 5.182,10.385000000000002 C 5.402,10.165000000000001 5.402,9.824 5.182,9.604000000000001 L 4.885,9.318000000000001" stroke-linejoin="round"/>', '<path class="dot" d="M 5.885,7.3180000000000005 L 5.885,7.3180000000000005 C 5.664999999999999,7.098000000000001 5.324,7.098000000000001 5.103999999999999,7.3180000000000005 L 4.818,7.604000000000001 C 4.598,7.824000000000001 4.598,8.165000000000001 4.818,8.385000000000002 L 5.114999999999999,8.682 C 5.334999999999999,8.902000000000001 5.676,8.902000000000001 5.895999999999999,8.682 L 6.182,8.385000000000002 C 6.402,8.165000000000001 6.402,7.824000000000001 6.182,7.604000000000001 L 5.885,7.3180000000000005" stroke-linejoin="round"/>', '<path class="dot" d="M 5.885,6.3180000000000005 L 5.885,6.3180000000000005 C 5.664999999999999,6.098000000000001 5.324,6.098000000000001 5.103999999999999,6.3180000000000005 L 4.818,6.604000000000001 C 4.598,6.824000000000001 4.598,7.165000000000001 4.818,7.385000000000001 L 5.114999999999999,7.682 C 5.334999999999999,7.902 5.676,7.902 5.895999999999999,7.682 L 6.182,7.385000000000001 C 6.402,7.165000000000001 6.402,6.824000000000001 6.182,6.604000000000001 L 5.885,6.3180000000000005" stroke-linejoin="round"/>', '<path class="dot" d="M 4.885,4.3180000000000005 L 4.885,4.3180000000000005 C 4.664999999999999,4.098000000000001 4.324,4.098000000000001 4.103999999999999,4.3180000000000005 L 3.8179999999999996,4.604000000000001 C 3.5979999999999994,4.824000000000001 3.5979999999999994,5.165000000000001 3.8179999999999996,5.385000000000001 L 4.114999999999999,5.682 C 4.334999999999999,5.902 4.676,5.902 4.895999999999999,5.682 L 5.182,5.385000000000001 C 5.402,5.165000000000001 5.402,4.824000000000001 5.182,4.604000000000001 L 4.885,4.3180000000000005" stroke-linejoin="round"/>', '<path class="dot" d="M 3.885,3.318 L 3.885,3.318 C 3.6649999999999996,3.098 3.324,3.098 3.1039999999999996,3.318 L 2.8179999999999996,3.604 C 2.5979999999999994,3.8240000000000003 2.5979999999999994,4.165 2.8179999999999996,4.385 L 3.1149999999999993,4.682 C 3.3349999999999995,4.902 3.6759999999999997,4.902 3.8959999999999995,4.682 L 4.182,4.385 C 4.402,4.165 4.402,3.8240000000000003 4.182,3.604 L 3.885,3.318" stroke-linejoin="round"/>']
            
            
            <path d="M 3.5,4.0 L 2.5,5.0 L 1.5,7.0 L 1.5,8.0 L 2.5,10.0 L 3.5,11.0 L 4.5,10.0 L 5.5,8.0 L 5.5,7.0 L 4.5,5.0 L 3.5,4.0" fill="none"
            stroke="black"
            stroke-width="1"
            stroke-linecap="round"
            stroke-linejoin="round"
            />
            
            
        </svg>