<?xml version="1.0"?><!DOCTYPE svg PUBLIC "-//W3C//DTD SVG 1.1//EN" "http://www.w3.org/Graphics/SVG/1.1/DTD/svg11.dtd"><svg xmlns="http://www.w3.org/2000/svg" xmlns:xlink="http://www.w3.org/1999/xlink" width="350" height="1000" viewBox="0 0 14 40" >
            
                ['<path class="dot" d="M 4.790943577551021,-0.22280612244898207 L 4.79094357755102,-0.22280612244898207 C 4.34094357755102,-0.6728061224489821 3.64344357755102,-0.6728061224489822 3.19344357755102,-0.22280612244898207 L 2.60844357755102,0.3621938775510183 C 2.1584435775510205,0.8121938775510182 2.15844357755102,1.5096938775510182 2.60844357755102,1.9596938775510184 L 3.21594357755102,2.567193877551018 C 3.66594357755102,3.0171938775510174 4.3634435775510205,3.0171938775510174 4.81344357755102,2.567193877551018 L 5.398443577551021,1.9596938775510184 C 5.84844357755102,1.5096938775510182 5.84844357755102,0.8121938775510182 5.398443577551021,0.36219387755101806 L 4.790943577551021,-0.2228061224489819" stroke-linejoin="round"/>', '<path class="dot" d="M 3.7909438775510207,0.7771938775510179 L 3.79094387755102,0.7771938775510179 C 3.3409438775510196,0.3271938775510179 2.64344387755102,0.3271938775510178 2.19344387755102,0.7771938775510179 L 1.60844387755102,1.3621938775510183 C 1.15844387755102,1.8121938775510182 1.15844387755102,2.509693877551018 1.60844387755102,2.959693877551018 L 2.2159438775510196,3.567193877551018 C 2.66594387755102,4.017193877551017 3.3634438775510196,4.017193877551017 3.8134438775510198,3.567193877551018 L 4.398443877551021,2.959693877551018 C 4.84844387755102,2.509693877551018 4.84844387755102,1.8121938775510182 4.398443877551021,1.362193877551018 L 3.7909438775510207,0.7771938775510181" stroke-linejoin="round"/>', '<path class="dot" d="M 4.790943577551021,1.7771938775510179 L 4.79094357755102,1.7771938775510179 C 4.34094357755102,1.327193877551018 3.64344357755102,1.327193877551018 3.19344357755102,1.7771938775510179 L 2.60844357755102,2.362193877551018 C 2.1584435775510205,2.8121938775510182 2.15844357755102,3.509693877551018 2.60844357755102,3.959693877551018 L 3.21594357755102,4.567193877551018 C 3.66594357755102,5.017193877551017 4.3634435775510205,5.017193877551017 4.81344357755102,4.567193877551018 L 5.398443577551021,3.959693877551018 C 5.84844357755102,3.509693877551018 5.84844357755102,2.8121938775510182 5.398443577551021,2.362193877551018 L 4.790943577551021,1.777193877551018" stroke-linejoin="round"/>', '<path class="dot" d="M 5.790943877551021,0.7771938775510179 L 5.79094387755102,0.7771938775510179 C 5.34094387755102,0.3271938775510179 4.64344387755102,0.3271938775510178 4.1934438775510205,0.7771938775510179 L 3.60844387755102,1.3621938775510183 C 3.1584438775510204,1.8121938775510182 3.15844387755102,2.509693877551018 3.60844387755102,2.959693877551018 L 4.21594387755102,3.567193877551018 C 4.66594387755102,4.017193877551017 5.3634438775510205,4.017193877551017 5.81344387755102,3.567193877551018 L 6.398443877551021,2.959693877551018 C 6.84844387755102,2.509693877551018 6.84844387755102,1.8121938775510182 6.398443877551021,1.362193877551018 L 5.790943877551021,0.7771938775510181" stroke-linejoin="round"/>', '<path class="dot" d="M 10.79094487755102,-0.22280612244898207 L 10.79094487755102,-0.22280612244898207 C 10.34094487755102,-0.6728061224489821 9.64344487755102,-0.6728061224489822 9.19344487755102,-0.22280612244898207 L 8.60844487755102,0.3621938775510183 C 8.15844487755102,0.8121938775510182 8.15844487755102,1.5096938775510182 8.60844487755102,1.9596938775510184 L 9.21594487755102,2.567193877551018 C 9.66594487755102,3.0171938775510174 10.36344487755102,3.0171938775510174 10.81344487755102,2.567193877551018 L 11.398444877551022,1.9596938775510184 C 11.848444877551021,1.5096938775510182 11.848444877551021,0.8121938775510182 11.398444877551022,0.36219387755101806 L 10.79094487755102,-0.2228061224489819" stroke-linejoin="round"/>', '<path class="dot" d="M 9.79094377755102,0.7771938775510179 L 9.790943777551018,0.7771938775510179 C 9.340943777551018,0.3271938775510179 8.643443777551019,0.3271938775510178 8.19344377755102,0.7771938775510179 L 7.608443777551019,1.3621938775510183 C 7.158443777551019,1.8121938775510182 7.158443777551019,2.509693877551018 7.608443777551019,2.959693877551018 L 8.215943777551018,3.567193877551018 C 8.66594377755102,4.017193877551017 9.36344377755102,4.017193877551017 9.813443777551019,3.567193877551018 L 10.39844377755102,2.959693877551018 C 10.848443777551019,2.509693877551018 10.848443777551019,1.8121938775510182 10.39844377755102,1.362193877551018 L 9.79094377755102,0.7771938775510181" stroke-linejoin="round"/>', '<path class="dot" d="M 10.79094487755102,1.7771938775510179 L 10.79094487755102,1.7771938775510179 C 10.34094487755102,1.327193877551018 9.64344487755102,1.327193877551018 9.19344487755102,1.7771938775510179 L 8.60844487755102,2.362193877551018 C 8.15844487755102,2.8121938775510182 8.15844487755102,3.509693877551018 8.60844487755102,3.959693877551018 L 9.21594487755102,4.567193877551018 C 9.66594487755102,5.017193877551017 10.36344487755102,5.017193877551017 10.81344487755102,4.567193877551018 L 11.398444877551022,3.959693877551018 C 11.848444877551021,3.509693877551018 11.848444877551021,2.8121938775510182 11.398444877551022,2.362193877551018 L 10.79094487755102,1.777193877551018" stroke-linejoin="round"/>', '<path class="dot" d="M 11.790943877551019,0.7771938775510179 L 11.790943877551019,0.7771938775510179 C 11.34094387755102,0.3271938775510179 10.64344387755102,0.3271938775510178 10.193443877551019,0.7771938775510179 L 9.60844387755102,1.3621938775510183 C 9.158443877551019,1.8121938775510182 9.158443877551019,2.509693877551018 9.60844387755102,2.959693877551018 L 10.21594387755102,3.567193877551018 C 10.665943877551019,4.017193877551017 11.363443877551019,4.017193877551017 11.81344387755102,3.567193877551018 L 12.39844387755102,2.959693877551018 C 12.84844387755102,2.509693877551018 12.84844387755102,1.8121938775510182 12.39844387755102,1.362193877551018 L 11.790943877551019,0.7771938775510181" stroke-linejoin="round"/>', '<path class="dot" d="M 10.79094487755102,-0.22280612244898207 L 10.79094487755102,-0.22280612244898207 C 10.34094487755102,-0.6728061224489821 9.64344487755102,-0.6728061224489822 9.19344487755102,-0.22280612244898207 L 8.60844487755102,0.3621938775510183 C 8.15844487755102,0.8121938775510182 8.15844487755102,1.5096938775510182 8.60844487755102,1.9596938775510184 L 9.21594487755102,2.567193877551018 C 9.66594487755102,3.0171938775510174 10.36344487755102,3.0171938775510174 10.81344487755102,2.567193877551018 L 11.398444877551022,1.9596938775510184 C 11.848444877551021,1.5096938775510182 11.848444877551021,0.8121938775510182 11.398444877551022,0.36219387755101806 L 10.79094487755102,-0.2228061224489819" stroke-linejoin="round"/>']
            
            
            <path d="M 3.9999997,1.0 L 3.0,2.0 L 3.9999997,3.0 L 5.0,2.0 L 3.9999997,1.0 M 10.000001000000001,1.0 L 8.999999899999999,2.0 L 10.000001000000001,3.0 L 11.0,2.0 L 10.000001000000001,1.0" fill="none"
            stroke="black"
            stroke-width="2.5"
            stroke-linecap="round"
            stroke-linejoin="round"
            />
            
            
        </svg>