<?xml version="1.0"?><!DOCTYPE svg PUBLIC "-//W3C//DTD SVG 1.1//EN" "http://www.w3.org/Graphics/SVG/1.1/DTD/svg11.dtd"><svg xmlns="http://www.w3.org/2000/svg" xmlns:xlink="http://www.w3.org/1999/xlink" width="350" height="1000" viewBox="0 0 7 17" >
            
                ['<path class="dot" d="M 5.385,0.31800000000000006 L 5.385,0.31800000000000006 C 5.164999999999999,0.09799999999999998 4.824,0.09799999999999995 4.603999999999999,0.31800000000000006 L 4.318,0.6040000000000002 C 4.098,0.8240000000000002 4.098,1.1650000000000003 4.318,1.3850000000000002 L 4.614999999999999,1.682 C 4.834999999999999,1.902 5.176,1.902 5.395999999999999,1.682 L 5.682,1.3850000000000002 C 5.902,1.165 5.902,0.8240000000000002 5.682,0.6040000000000001 L 5.385,0.31800000000000006" stroke-linejoin="round"/>', '<path class="dot" d="M 4.385,1.318 L 4.385,1.318 C 4.164999999999999,1.0979999999999999 3.824,1.0979999999999999 3.6039999999999996,1.318 L 3.3179999999999996,1.604 C 3.0979999999999994,1.8240000000000003 3.0979999999999994,2.165 3.3179999999999996,2.3850000000000002 L 3.6149999999999993,2.682 C 3.8349999999999995,2.902 4.176,2.902 4.395999999999999,2.682 L 4.682,2.3850000000000002 C 4.902,2.165 4.902,1.8240000000000003 4.682,1.604 L 4.385,1.318" stroke-linejoin="round"/>', '<path class="dot" d="M 3.385,0.31800000000000006 L 3.385,0.31800000000000006 C 3.1649999999999996,0.09799999999999998 2.824,0.09799999999999995 2.6039999999999996,0.31800000000000006 L 2.3179999999999996,0.6040000000000002 C 2.0979999999999994,0.8240000000000002 2.0979999999999994,1.1650000000000003 2.3179999999999996,1.3850000000000002 L 2.6149999999999993,1.682 C 2.8349999999999995,1.902 3.1759999999999997,1.902 3.3959999999999995,1.682 L 3.682,1.3850000000000002 C 3.902,1.165 3.902,0.8240000000000002 3.682,0.6040000000000001 L 3.385,0.31800000000000006" stroke-linejoin="round"/>', '<path class="dot" d="M 4.385,-0.6819999999999999 L 4.385,-0.6819999999999999 C 4.164999999999999,-0.902 3.824,-0.902 3.6039999999999996,-0.6819999999999999 L 3.3179999999999996,-0.3959999999999998 C 3.0979999999999994,-0.17599999999999982 3.0979999999999994,0.16500000000000026 3.3179999999999996,0.38500000000000023 L 3.6149999999999993,0.6819999999999999 C 3.8349999999999995,0.9019999999999999 4.176,0.9019999999999999 4.395999999999999,0.6819999999999999 L 4.682,0.38500000000000023 C 4.902,0.16500000000000004 4.902,-0.17599999999999982 4.682,-0.3959999999999999 L 4.385,-0.6819999999999999" stroke-linejoin="round"/>', '<path class="dot" d="M 5.385,0.31800000000000006 L 5.385,0.31800000000000006 C 5.164999999999999,0.09799999999999998 4.824,0.09799999999999995 4.603999999999999,0.31800000000000006 L 4.318,0.6040000000000002 C 4.098,0.8240000000000002 4.098,1.1650000000000003 4.318,1.3850000000000002 L 4.614999999999999,1.682 C 4.834999999999999,1.902 5.176,1.902 5.395999999999999,1.682 L 5.682,1.3850000000000002 C 5.902,1.165 5.902,0.8240000000000002 5.682,0.6040000000000001 L 5.385,0.31800000000000006" stroke-linejoin="round"/>', '<path class="dot" d="M 5.385,2.318 L 5.385,2.318 C 5.164999999999999,2.098 4.824,2.098 4.603999999999999,2.318 L 4.318,2.604 C 4.098,2.8240000000000003 4.098,3.165 4.318,3.3850000000000002 L 4.614999999999999,3.682 C 4.834999999999999,3.902 5.176,3.902 5.395999999999999,3.682 L 5.682,3.3850000000000002 C 5.902,3.165 5.902,2.8240000000000003 5.682,2.604 L 5.385,2.318" stroke-linejoin="round"/>', '<path class="dot" d="M 3.385,4.3180000000000005 L 3.385,4.3180000000000005 C 3.1649999999999996,4.098000000000001 2.824,4.098000000000001 2.6039999999999996,4.3180000000000005 L 2.3179999999999996,4.604000000000001 C 2.0979999999999994,4.824000000000001 2.0979999999999994,5.165000000000001 2.3179999999999996,5.385000000000001 L 2.6149999999999993,5.682 C 2.8349999999999995,5.902 3.1759999999999997,5.902 3.3959999999999995,5.682 L 3.682,5.385000000000001 C 3.902,5.165000000000001 3.902,4.824000000000001 3.682,4.604000000000001 L 3.385,4.3180000000000005" stroke-linejoin="round"/>']
            
            
            <path d="M 5.0,1.0 L 4.0,2.0 L 3.0,1.0 L 4.0,0.0 L 5.0,1.0 L 5.0,3.0 L 3.0,5.0" fill="none"
            stroke="black"
            stroke-width="1"
            stroke-linecap="round"
            stroke-linejoin="round"
            />
            
            
        </svg>