<?xml version="1.0" encoding="UTF-8" standalone="no"?>
<svg
   data-dec="87"
   width="10"
   height="21"
   version="1.1"
   id="svg1"
   sodipodi:docname="W.svg"
   inkscape:version="1.3.2 (091e20ef0f, 2023-11-25, custom)"
   xmlns:inkscape="http://www.inkscape.org/namespaces/inkscape"
   xmlns:sodipodi="http://sodipodi.sourceforge.net/DTD/sodipodi-0.dtd"
   xmlns="http://www.w3.org/2000/svg"
   xmlns:svg="http://www.w3.org/2000/svg">
  <sodipodi:namedview
     id="namedview1"
     pagecolor="#ffffff"
     bordercolor="#666666"
     borderopacity="1.0"
     inkscape:showpageshadow="2"
     inkscape:pageopacity="0.0"
     inkscape:pagecheckerboard="0"
     inkscape:deskcolor="#d1d1d1"
     inkscape:zoom="20.75"
     inkscape:cx="4.9638554"
     inkscape:cy="11.277108"
     inkscape:window-width="1920"
     inkscape:window-height="1043"
     inkscape:window-x="0"
     inkscape:window-y="0"
     inkscape:window-maximized="1"
     inkscape:current-layer="svg1" />
  <defs
     id="defs1" />
  <path
     d="M 0,0 2,21 M 5.0000001,0 2,21 M 5.0000001,0 8,21 M 10,0 8,21"
     style="fill:none;stroke:none;stroke-width:2;stroke-linecap:round;stroke-linejoin:round"
     id="path1" />
</svg>
