<?xml version="1.0"?><!DOCTYPE svg PUBLIC "-//W3C//DTD SVG 1.1//EN" "http://www.w3.org/Graphics/SVG/1.1/DTD/svg11.dtd"><svg xmlns="http://www.w3.org/2000/svg" xmlns:xlink="http://www.w3.org/1999/xlink" width="350" height="1000" viewBox="0 0 14 40" >
            
                ['<path class="dot" d="M 2.7909438775510207,-0.22280612244898207 L 2.79094387755102,-0.22280612244898207 C 2.3409438775510196,-0.6728061224489821 1.6434438775510198,-0.6728061224489822 1.19344387755102,-0.22280612244898207 L 0.6084438775510199,0.3621938775510183 C 0.15844387755101996,0.8121938775510182 0.15844387755101985,1.5096938775510182 0.6084438775510199,1.9596938775510184 L 1.2159438775510198,2.567193877551018 C 1.6659438775510198,3.0171938775510174 2.3634438775510196,3.0171938775510174 2.8134438775510198,2.567193877551018 L 3.3984438775510206,1.9596938775510184 C 3.84844387755102,1.5096938775510182 3.84844387755102,0.8121938775510182 3.3984438775510206,0.36219387755101806 L 2.7909438775510207,-0.2228061224489819" stroke-linejoin="round"/>', '<path class="dot" d="M 2.7909438775510207,20.777193877551017 L 2.79094387755102,20.777193877551017 C 2.3409438775510196,20.327193877551018 1.6434438775510198,20.327193877551018 1.19344387755102,20.777193877551017 L 0.6084438775510199,21.362193877551018 C 0.15844387755101996,21.812193877551017 0.15844387755101985,22.50969387755102 0.6084438775510199,22.959693877551018 L 1.2159438775510198,23.56719387755102 C 1.6659438775510198,24.01719387755102 2.3634438775510196,24.01719387755102 2.8134438775510198,23.56719387755102 L 3.3984438775510206,22.959693877551018 C 3.84844387755102,22.50969387755102 3.84844387755102,21.812193877551017 3.3984438775510206,21.362193877551018 L 2.7909438775510207,20.777193877551017" stroke-linejoin="round"/>']
            
                ['<path class="dot" d="M 2.7909438775510207,-0.22283173661898287 L 2.79094387755102,-0.22283173661898287 C 2.3409438775510196,-0.6728317366189829 1.6434438775510198,-0.672831736618983 1.19344387755102,-0.22283173661898287 L 0.6084438775510199,0.3621682633810175 C 0.15844387755101996,0.8121682633810174 0.15844387755101985,1.5096682633810175 0.6084438775510199,1.9596682633810176 L 1.2159438775510198,2.567168263381017 C 1.6659438775510198,3.017168263381017 2.3634438775510196,3.017168263381017 2.8134438775510198,2.567168263381017 L 3.3984438775510206,1.9596682633810176 C 3.84844387755102,1.5096682633810175 3.84844387755102,0.8121682633810174 3.3984438775510206,0.36216826338101726 L 2.7909438775510207,-0.2228317366189827" stroke-linejoin="round"/>', '<path class="dot" d="M 8.790943977551022,-0.22294512244898285 L 8.79094397755102,-0.22294512244898285 C 8.34094397755102,-0.6729451224489829 7.643443977551021,-0.672945122448983 7.193443977551022,-0.22294512244898285 L 6.608443977551022,0.3620548775510175 C 6.158443977551022,0.8120548775510175 6.158443977551022,1.5095548775510175 6.608443977551022,1.9595548775510176 L 7.215943977551021,2.5670548775510174 C 7.665943977551021,3.0170548775510166 8.363443977551022,3.0170548775510166 8.813443977551021,2.5670548775510174 L 9.398443977551022,1.9595548775510176 C 9.848443977551021,1.5095548775510175 9.848443977551021,0.8120548775510175 9.398443977551022,0.3620548775510173 L 8.790943977551022,-0.22294512244898268" stroke-linejoin="round"/>', '<path class="dot" d="M 10.79091877755102,0.7770800775510172 L 10.790918777551019,0.7770800775510172 C 10.34091877755102,0.3270800775510172 9.64341877755102,0.3270800775510171 9.193418777551019,0.7770800775510172 L 8.60841877755102,1.3620800775510176 C 8.158418777551018,1.8120800775510175 8.158418777551018,2.5095800775510178 8.60841877755102,2.959580077551018 L 9.21591877755102,3.567080077551017 C 9.665918777551019,4.017080077551017 10.363418777551018,4.017080077551017 10.813418777551018,3.567080077551017 L 11.398418777551019,2.959580077551018 C 11.84841877755102,2.5095800775510178 11.84841877755102,1.8120800775510175 11.398418777551019,1.3620800775510173 L 10.79091877755102,0.7770800775510174" stroke-linejoin="round"/>', '<path class="dot" d="M 11.79094397755102,1.777067477551017 L 11.790943977551018,1.777067477551017 C 11.340943977551019,1.327067477551017 10.64344397755102,1.327067477551017 10.193443977551018,1.777067477551017 L 9.608443977551019,2.362067477551017 C 9.158443977551018,2.8120674775510173 9.158443977551018,3.509567477551017 9.608443977551019,3.9595674775510172 L 10.215943977551019,4.567067477551017 C 10.665943977551018,5.0170674775510165 11.363443977551018,5.0170674775510165 11.813443977551017,4.567067477551017 L 12.398443977551018,3.9595674775510172 C 12.84844397755102,3.509567477551017 12.84844397755102,2.8120674775510173 12.398443977551018,2.362067477551017 L 11.79094397755102,1.7770674775510171" stroke-linejoin="round"/>', '<path class="dot" d="M 12.790931377551018,3.7770800775510165 L 12.790931377551018,3.7770800775510165 C 12.34093137755102,3.3270800775510168 11.64343137755102,3.3270800775510163 11.193431377551018,3.7770800775510165 L 10.60843137755102,4.362080077551017 C 10.158431377551018,4.812080077551017 10.158431377551018,5.509580077551017 10.60843137755102,5.959580077551017 L 11.21593137755102,6.567080077551017 C 11.665931377551018,7.017080077551016 12.363431377551018,7.017080077551016 12.81343137755102,6.567080077551017 L 13.39843137755102,5.959580077551017 C 13.84843137755102,5.509580077551017 13.84843137755102,4.812080077551017 13.39843137755102,4.362080077551017 L 12.790931377551018,3.777080077551017" stroke-linejoin="round"/>', '<path class="dot" d="M 12.790931377551018,5.777054977551018 L 12.790931377551018,5.777054977551018 C 12.34093137755102,5.327054977551017 11.64343137755102,5.327054977551017 11.193431377551018,5.777054977551018 L 10.60843137755102,6.362054977551018 C 10.158431377551018,6.812054977551018 10.158431377551018,7.5095549775510175 10.60843137755102,7.959554977551018 L 11.21593137755102,8.567054977551017 C 11.665931377551018,9.017054977551016 12.363431377551018,9.017054977551016 12.81343137755102,8.567054977551017 L 13.39843137755102,7.959554977551018 C 13.84843137755102,7.5095549775510175 13.84843137755102,6.812054977551018 13.39843137755102,6.362054977551018 L 12.790931377551018,5.777054977551018" stroke-linejoin="round"/>', '<path class="dot" d="M 11.79094397755102,7.7770675775510165 L 11.790943977551018,7.7770675775510165 C 11.340943977551019,7.327067577551016 10.64344397755102,7.327067577551016 10.193443977551018,7.7770675775510165 L 9.608443977551019,8.362067577551016 C 9.158443977551018,8.812067577551016 9.158443977551018,9.509567577551017 9.608443977551019,9.959567577551017 L 10.215943977551019,10.567067577551017 C 10.665943977551018,11.017067577551016 11.363443977551018,11.017067577551016 11.813443977551017,10.567067577551017 L 12.398443977551018,9.959567577551017 C 12.84844397755102,9.509567577551017 12.84844397755102,8.812067577551016 12.398443977551018,8.362067577551016 L 11.79094397755102,7.7770675775510165" stroke-linejoin="round"/>', '<path class="dot" d="M 10.79091877755102,8.777054977551018 L 10.790918777551019,8.777054977551018 C 10.34091877755102,8.327054977551017 9.64341877755102,8.327054977551017 9.193418777551019,8.777054977551018 L 8.60841877755102,9.362054977551018 C 8.158418777551018,9.812054977551018 8.158418777551018,10.509554977551018 8.60841877755102,10.959554977551019 L 9.21591877755102,11.567054977551017 C 9.665918777551019,12.017054977551016 10.363418777551018,12.017054977551016 10.813418777551018,11.567054977551017 L 11.398418777551019,10.959554977551019 C 11.84841877755102,10.509554977551018 11.84841877755102,9.812054977551018 11.398418777551019,9.362054977551017 L 10.79091877755102,8.777054977551018" stroke-linejoin="round"/>', '<path class="dot" d="M 8.790943977551022,9.777079877551019 L 8.79094397755102,9.777079877551019 C 8.34094397755102,9.327079877551018 7.643443977551021,9.327079877551018 7.193443977551022,9.777079877551019 L 6.608443977551022,10.362079877551018 C 6.158443977551022,10.81207987755102 6.158443977551022,11.509579877551019 6.608443977551022,11.959579877551018 L 7.215943977551021,12.567079877551018 C 7.665943977551021,13.01707987755102 8.363443977551022,13.01707987755102 8.813443977551021,12.567079877551018 L 9.398443977551022,11.959579877551018 C 9.848443977551021,11.509579877551019 9.848443977551021,10.81207987755102 9.398443977551022,10.362079877551018 L 8.790943977551022,9.777079877551019" stroke-linejoin="round"/>', '<path class="dot" d="M 2.7909438775510207,9.777193877551019 L 2.79094387755102,9.777193877551019 C 2.3409438775510196,9.327193877551018 1.6434438775510198,9.327193877551018 1.19344387755102,9.777193877551019 L 0.6084438775510199,10.362193877551018 C 0.15844387755101996,10.81219387755102 0.15844387755101985,11.509693877551019 0.6084438775510199,11.959693877551018 L 1.2159438775510198,12.567193877551018 C 1.6659438775510198,13.01719387755102 2.3634438775510196,13.01719387755102 2.8134438775510198,12.567193877551018 L 3.3984438775510206,11.959693877551018 C 3.84844387755102,11.509693877551019 3.84844387755102,10.81219387755102 3.3984438775510206,10.362193877551018 L 2.7909438775510207,9.777193877551019" stroke-linejoin="round"/>']
            
                ['<path class="dot" d="M 7.790943877551021,9.77710587755102 L 7.79094387755102,9.77710587755102 C 7.34094387755102,9.327105877551018 6.64344387755102,9.327105877551018 6.1934438775510205,9.77710587755102 L 5.608443877551021,10.36210587755102 C 5.15844387755102,10.81210587755102 5.15844387755102,11.509605877551019 5.608443877551021,11.95960587755102 L 6.21594387755102,12.567105877551018 C 6.66594387755102,13.017105877551018 7.3634438775510205,13.017105877551018 7.81344387755102,12.567105877551018 L 8.39844387755102,11.95960587755102 C 8.84844387755102,11.509605877551019 8.84844387755102,10.81210587755102 8.39844387755102,10.362105877551018 L 7.790943877551021,9.77710587755102" stroke-linejoin="round"/>', '<path class="dot" d="M 12.790956277551018,20.777193877551017 L 12.790956277551018,20.777193877551017 C 12.340956277551019,20.327193877551018 11.643456277551019,20.327193877551018 11.193456277551018,20.777193877551017 L 10.608456277551019,21.362193877551018 C 10.158456277551018,21.812193877551017 10.158456277551018,22.50969387755102 10.608456277551019,22.959693877551018 L 11.215956277551019,23.56719387755102 C 11.665956277551018,24.01719387755102 12.363456277551018,24.01719387755102 12.813456277551019,23.56719387755102 L 13.39845627755102,22.959693877551018 C 13.84845627755102,22.50969387755102 13.84845627755102,21.812193877551017 13.39845627755102,21.362193877551018 L 12.790956277551018,20.777193877551017" stroke-linejoin="round"/>']
            
            
            <path d="M 2.0,1.0 L 2.0,22.0" fill="none"
            stroke="black"
            stroke-width="2.5"
            stroke-linecap="round"
            stroke-linejoin="round"
            />
            
            <path d="M 2.0,0.9999743858299992 L 8.000000100000001,0.9998609999999992 L 9.9999749,1.9998861999999993 L 11.0000001,2.999873599999999 L 11.9999875,4.999886199999999 L 11.9999875,6.9998610999999995 L 11.0000001,8.999873699999998 L 9.9999749,9.999861099999999 L 8.000000100000001,10.999886 L 2.0,11.0" fill="none"
            stroke="black"
            stroke-width="2.5"
            stroke-linecap="round"
            stroke-linejoin="round"
            />
            
            <path d="M 7.0,10.999912 L 12.0000124,22.0" fill="none"
            stroke="black"
            stroke-width="2.5"
            stroke-linecap="round"
            stroke-linejoin="round"
            />
            
            
        </svg>