<?xml version="1.0"?><!DOCTYPE svg PUBLIC "-//W3C//DTD SVG 1.1//EN" "http://www.w3.org/Graphics/SVG/1.1/DTD/svg11.dtd"><svg xmlns="http://www.w3.org/2000/svg" xmlns:xlink="http://www.w3.org/1999/xlink" width="350" height="1000" viewBox="0 0 10 26" >
            
                ['<path class="dot" d="M 5.519583333333333,14.140270833333332 L 5.519583333333333,14.140270833333332 C 5.229583333333333,13.850270833333333 4.780083333333333,13.850270833333333 4.490083333333333,14.140270833333332 L 4.113083333333333,14.517270833333333 C 3.823083333333333,14.807270833333334 3.823083333333333,15.256770833333333 4.113083333333333,15.546770833333333 L 4.504583333333333,15.938270833333332 C 4.794583333333333,16.228270833333333 5.244083333333333,16.228270833333333 5.534083333333333,15.938270833333332 L 5.911083333333334,15.546770833333333 C 6.201083333333333,15.256770833333333 6.201083333333333,14.807270833333334 5.911083333333334,14.517270833333333 L 5.519583333333333,14.140270833333332" stroke-linejoin="round"/>', '<path class="dot" d="M 5.519583333333333,15.140270833333332 L 5.519583333333333,15.140270833333332 C 5.229583333333333,14.850270833333333 4.780083333333333,14.850270833333333 4.490083333333333,15.140270833333332 L 4.113083333333333,15.517270833333333 C 3.823083333333333,15.807270833333334 3.823083333333333,16.256770833333334 4.113083333333333,16.546770833333333 L 4.504583333333333,16.938270833333334 C 4.794583333333333,17.228270833333333 5.244083333333333,17.228270833333333 5.534083333333333,16.938270833333334 L 5.911083333333334,16.546770833333333 C 6.201083333333333,16.256770833333334 6.201083333333333,15.807270833333334 5.911083333333334,15.517270833333333 L 5.519583333333333,15.140270833333332" stroke-linejoin="round"/>', '<path class="dot" d="M 6.519583333333333,16.140270833333332 L 6.519583333333332,16.140270833333332 C 6.229583333333332,15.850270833333333 5.780083333333333,15.850270833333333 5.490083333333333,16.140270833333332 L 5.113083333333333,16.517270833333335 C 4.823083333333333,16.807270833333334 4.823083333333333,17.256770833333334 5.113083333333333,17.546770833333333 L 5.504583333333333,17.938270833333334 C 5.794583333333333,18.228270833333333 6.244083333333332,18.228270833333333 6.534083333333332,17.938270833333334 L 6.911083333333333,17.546770833333333 C 7.201083333333333,17.256770833333334 7.201083333333333,16.807270833333334 6.911083333333333,16.517270833333335 L 6.519583333333333,16.140270833333332" stroke-linejoin="round"/>', '<path class="dot" d="M 5.519583333333333,17.140270833333336 L 5.519583333333333,17.140270833333336 C 5.229583333333333,16.850270833333333 4.780083333333333,16.850270833333333 4.490083333333333,17.140270833333336 L 4.113083333333333,17.517270833333335 C 3.823083333333333,17.807270833333334 3.823083333333333,18.256770833333334 4.113083333333333,18.546770833333333 L 4.504583333333333,18.938270833333334 C 4.794583333333333,19.228270833333333 5.244083333333333,19.228270833333333 5.534083333333333,18.938270833333334 L 5.911083333333334,18.546770833333333 C 6.201083333333333,18.256770833333334 6.201083333333333,17.807270833333334 5.911083333333334,17.517270833333335 L 5.519583333333333,17.140270833333336" stroke-linejoin="round"/>']
            
            
            <path d="M 5.0,15.0 L 5.0,16.0 L 6.0,17.0 L 5.0,18.0" fill="none"
            stroke="black"
            stroke-width="1.5"
            stroke-linecap="round"
            stroke-linejoin="round"
            />
            
            
        </svg>