<?xml version="1.0"?><!DOCTYPE svg PUBLIC "-//W3C//DTD SVG 1.1//EN" "http://www.w3.org/Graphics/SVG/1.1/DTD/svg11.dtd"><svg xmlns="http://www.w3.org/2000/svg" xmlns:xlink="http://www.w3.org/1999/xlink" width="350" height="1000" viewBox="0 0 14 40" >
            
                ['<path class="dot" d="M 4.790943877551021,-0.22280612244898207 L 4.79094387755102,-0.22280612244898207 C 4.34094387755102,-0.6728061224489821 3.64344387755102,-0.6728061224489822 3.19344387755102,-0.22280612244898207 L 2.60844387755102,0.3621938775510183 C 2.1584438775510204,0.8121938775510182 2.15844387755102,1.5096938775510182 2.60844387755102,1.9596938775510184 L 3.21594387755102,2.567193877551018 C 3.66594387755102,3.0171938775510174 4.3634438775510205,3.0171938775510174 4.81344387755102,2.567193877551018 L 5.398443877551021,1.9596938775510184 C 5.84844387755102,1.5096938775510182 5.84844387755102,0.8121938775510182 5.398443877551021,0.36219387755101806 L 4.790943877551021,-0.2228061224489819" stroke-linejoin="round"/>', '<path class="dot" d="M 4.790943877551021,27.777193877551017 L 4.79094387755102,27.777193877551017 C 4.34094387755102,27.327193877551018 3.64344387755102,27.327193877551018 3.19344387755102,27.777193877551017 L 2.60844387755102,28.362193877551018 C 2.1584438775510204,28.812193877551017 2.15844387755102,29.50969387755102 2.60844387755102,29.959693877551018 L 3.21594387755102,30.56719387755102 C 3.66594387755102,31.01719387755102 4.3634438775510205,31.01719387755102 4.81344387755102,30.56719387755102 L 5.398443877551021,29.959693877551018 C 5.84844387755102,29.50969387755102 5.84844387755102,28.812193877551017 5.398443877551021,28.362193877551018 L 4.790943877551021,27.777193877551017" stroke-linejoin="round"/>']
            
                ['<path class="dot" d="M 4.790943877551021,27.777193877551017 L 4.79094387755102,27.777193877551017 C 4.34094387755102,27.327193877551018 3.64344387755102,27.327193877551018 3.19344387755102,27.777193877551017 L 2.60844387755102,28.362193877551018 C 2.1584438775510204,28.812193877551017 2.15844387755102,29.50969387755102 2.60844387755102,29.959693877551018 L 3.21594387755102,30.56719387755102 C 3.66594387755102,31.01719387755102 4.3634438775510205,31.01719387755102 4.81344387755102,30.56719387755102 L 5.398443877551021,29.959693877551018 C 5.84844387755102,29.50969387755102 5.84844387755102,28.812193877551017 5.398443877551021,28.362193877551018 L 4.790943877551021,27.777193877551017" stroke-linejoin="round"/>', '<path class="dot" d="M 11.790943877551019,27.777193877551017 L 11.790943877551019,27.777193877551017 C 11.34094387755102,27.327193877551018 10.64344387755102,27.327193877551018 10.193443877551019,27.777193877551017 L 9.60844387755102,28.362193877551018 C 9.158443877551019,28.812193877551017 9.158443877551019,29.50969387755102 9.60844387755102,29.959693877551018 L 10.21594387755102,30.56719387755102 C 10.665943877551019,31.01719387755102 11.363443877551019,31.01719387755102 11.81344387755102,30.56719387755102 L 12.39844387755102,29.959693877551018 C 12.84844387755102,29.50969387755102 12.84844387755102,28.812193877551017 12.39844387755102,28.362193877551018 L 11.790943877551019,27.777193877551017" stroke-linejoin="round"/>']
            
                ['<path class="dot" d="M 4.790943877551021,-0.22280612244898207 L 4.79094387755102,-0.22280612244898207 C 4.34094387755102,-0.6728061224489821 3.64344387755102,-0.6728061224489822 3.19344387755102,-0.22280612244898207 L 2.60844387755102,0.3621938775510183 C 2.1584438775510204,0.8121938775510182 2.15844387755102,1.5096938775510182 2.60844387755102,1.9596938775510184 L 3.21594387755102,2.567193877551018 C 3.66594387755102,3.0171938775510174 4.3634438775510205,3.0171938775510174 4.81344387755102,2.567193877551018 L 5.398443877551021,1.9596938775510184 C 5.84844387755102,1.5096938775510182 5.84844387755102,0.8121938775510182 5.398443877551021,0.36219387755101806 L 4.790943877551021,-0.2228061224489819" stroke-linejoin="round"/>', '<path class="dot" d="M 11.790943877551019,-0.22280612244898207 L 11.790943877551019,-0.22280612244898207 C 11.34094387755102,-0.6728061224489821 10.64344387755102,-0.6728061224489822 10.193443877551019,-0.22280612244898207 L 9.60844387755102,0.3621938775510183 C 9.158443877551019,0.8121938775510182 9.158443877551019,1.5096938775510182 9.60844387755102,1.9596938775510184 L 10.21594387755102,2.567193877551018 C 10.665943877551019,3.0171938775510174 11.363443877551019,3.0171938775510174 11.81344387755102,2.567193877551018 L 12.39844387755102,1.9596938775510184 C 12.84844387755102,1.5096938775510182 12.84844387755102,0.8121938775510182 12.39844387755102,0.36219387755101806 L 11.790943877551019,-0.2228061224489819" stroke-linejoin="round"/>']
            
            
            <path d="M 4.0,1.0 L 4.0,29.0" fill="none"
            stroke="black"
            stroke-width="2.5"
            stroke-linecap="round"
            stroke-linejoin="round"
            />
            
            <path d="M 4.0,29.0 L 11.0,29.0" fill="none"
            stroke="black"
            stroke-width="2.5"
            stroke-linecap="round"
            stroke-linejoin="round"
            />
            
            <path d="M 4.0,1.0 L 11.0,1.0" fill="none"
            stroke="black"
            stroke-width="2.5"
            stroke-linecap="round"
            stroke-linejoin="round"
            />
            
            
        </svg>