<?xml version="1.0" encoding="UTF-8" standalone="no"?>
<svg
   data-dec="38"
   width="12"
   height="21"
   version="1.1"
   id="svg1"
   sodipodi:docname="esperluette.svg"
   inkscape:version="1.3.2 (091e20ef0f, 2023-11-25, custom)"
   xmlns:inkscape="http://www.inkscape.org/namespaces/inkscape"
   xmlns:sodipodi="http://sodipodi.sourceforge.net/DTD/sodipodi-0.dtd"
   xmlns="http://www.w3.org/2000/svg"
   xmlns:svg="http://www.w3.org/2000/svg">
  <sodipodi:namedview
     id="namedview1"
     pagecolor="#ffffff"
     bordercolor="#666666"
     borderopacity="1.0"
     inkscape:showpageshadow="2"
     inkscape:pageopacity="0.0"
     inkscape:pagecheckerboard="0"
     inkscape:deskcolor="#d1d1d1"
     inkscape:zoom="56.666667"
     inkscape:cx="6"
     inkscape:cy="10.5"
     inkscape:window-width="2560"
     inkscape:window-height="1403"
     inkscape:window-x="0"
     inkscape:window-y="0"
     inkscape:window-maximized="1"
     inkscape:current-layer="svg1" />
  <defs
     id="defs1" />
  <path
     d="m 12,19 v 1 l -1,1 H 10 L 9,20 8,18 2,5 V 3 L 3,1 4,0 H 5 L 6,1 7,3 V 5 L 6,7 5,8 1,12 0,15 v 2 l 1,3 1,1 H 5 L 6,20 7,17 9,8 10,7 h 1 l 1,1 v 1"
     style="fill:none;stroke:none;stroke-width:2;stroke-linecap:round;stroke-linejoin:round;stroke-dasharray:none"
     id="path1" />
</svg>
