<?xml version="1.0"?><!DOCTYPE svg PUBLIC "-//W3C//DTD SVG 1.1//EN" "http://www.w3.org/Graphics/SVG/1.1/DTD/svg11.dtd"><svg xmlns="http://www.w3.org/2000/svg" xmlns:xlink="http://www.w3.org/1999/xlink" width="350" height="1000" viewBox="0 0 10 26" >
            
                ['<path class="dot" d="M 7.519582733333333,0.14027069441279647 L 7.5195827333333325,0.14027069441279647 C 7.2295827333333325,-0.14972930558720357 6.780082733333333,-0.14972930558720363 6.490082733333333,0.14027069441279647 L 6.113082733333333,0.5172706944127966 C 5.823082733333333,0.8072706944127965 5.823082733333333,1.2567706944127965 6.113082733333333,1.5467706944127966 L 6.504582733333333,1.9382706944127963 C 6.794582733333333,2.2282706944127963 7.244082733333332,2.2282706944127963 7.5340827333333324,1.9382706944127963 L 7.911082733333333,1.5467706944127966 C 8.201082733333333,1.2567706944127965 8.201082733333333,0.8072706944127966 7.911082733333333,0.5172706944127965 L 7.519582733333333,0.1402706944127965" stroke-linejoin="round"/>', '<path class="dot" d="M 4.519583133333334,0.14027069441279647 L 4.519583133333334,0.14027069441279647 C 4.229583133333334,-0.14972930558720357 3.7800831333333336,-0.14972930558720363 3.4900831333333335,0.14027069441279647 L 3.1130831333333333,0.5172706944127966 C 2.8230831333333333,0.8072706944127965 2.8230831333333333,1.2567706944127965 3.1130831333333333,1.5467706944127966 L 3.5045831333333335,1.9382706944127963 C 3.794583133333333,2.2282706944127963 4.2440831333333335,2.2282706944127963 4.534083133333334,1.9382706944127963 L 4.911083133333333,1.5467706944127966 C 5.201083133333334,1.2567706944127965 5.201083133333334,0.8072706944127966 4.911083133333333,0.5172706944127965 L 4.519583133333334,0.1402706944127965" stroke-linejoin="round"/>', '<path class="dot" d="M 3.519583203333333,6.140270663873064 L 3.519583203333333,6.140270663873064 C 3.229583203333333,5.850270663873064 2.780083203333333,5.850270663873064 2.490083203333333,6.140270663873064 L 2.113083203333333,6.517270663873064 C 1.823083203333333,6.807270663873064 1.823083203333333,7.2567706638730645 2.113083203333333,7.546770663873064 L 2.504583203333333,7.938270663873064 C 2.7945832033333327,8.228270663873063 3.244083203333333,8.228270663873063 3.534083203333333,7.938270663873064 L 3.9110832033333334,7.546770663873064 C 4.201083203333333,7.2567706638730645 4.201083203333333,6.807270663873064 3.9110832033333334,6.517270663873064 L 3.519583203333333,6.140270663873064" stroke-linejoin="round"/>', '<path class="dot" d="M 4.519583133333333,5.140270663873064 L 4.519583133333333,5.140270663873064 C 4.229583133333334,4.850270663873064 3.780083133333333,4.850270663873064 3.490083133333333,5.140270663873064 L 3.113083133333333,5.517270663873064 C 2.823083133333333,5.807270663873064 2.823083133333333,6.2567706638730645 3.113083133333333,6.546770663873064 L 3.504583133333333,6.938270663873064 C 3.794583133333333,7.228270663873063 4.2440831333333335,7.228270663873063 4.534083133333333,6.938270663873064 L 4.911083133333333,6.546770663873064 C 5.201083133333333,6.2567706638730645 5.201083133333333,5.807270663873064 4.911083133333333,5.517270663873064 L 4.519583133333334,5.140270663873064" stroke-linejoin="round"/>', '<path class="dot" d="M 6.519582833333333,5.140270663873064 L 6.519582833333332,5.140270663873064 C 6.229582833333332,4.850270663873064 5.780082833333332,4.850270663873064 5.490082833333332,5.140270663873064 L 5.1130828333333325,5.517270663873064 C 4.823082833333332,5.807270663873064 4.823082833333332,6.2567706638730645 5.1130828333333325,6.546770663873064 L 5.504582833333332,6.938270663873064 C 5.794582833333332,7.228270663873063 6.244082833333332,7.228270663873063 6.534082833333332,6.938270663873064 L 6.9110828333333325,6.546770663873064 C 7.2010828333333325,6.2567706638730645 7.2010828333333325,5.807270663873064 6.9110828333333325,5.517270663873064 L 6.519582833333333,5.140270663873064" stroke-linejoin="round"/>', '<path class="dot" d="M 7.519582733333333,6.140270663873064 L 7.5195827333333325,6.140270663873064 C 7.2295827333333325,5.850270663873064 6.780082733333333,5.850270663873064 6.490082733333333,6.140270663873064 L 6.113082733333333,6.517270663873064 C 5.823082733333333,6.807270663873064 5.823082733333333,7.2567706638730645 6.113082733333333,7.546770663873064 L 6.504582733333333,7.938270663873064 C 6.794582733333333,8.228270663873063 7.244082733333332,8.228270663873063 7.5340827333333324,7.938270663873064 L 7.911082733333333,7.546770663873064 C 8.201082733333333,7.2567706638730645 8.201082733333333,6.807270663873064 7.911082733333333,6.517270663873064 L 7.519582733333333,6.140270663873064" stroke-linejoin="round"/>', '<path class="dot" d="M 8.519582633333334,8.140270663873064 L 8.519582633333334,8.140270663873064 C 8.229582633333333,7.850270663873065 7.7800826333333335,7.850270663873065 7.4900826333333335,8.140270663873064 L 7.113082633333334,8.517270663873065 C 6.823082633333334,8.807270663873066 6.823082633333334,9.256770663873064 7.113082633333334,9.546770663873065 L 7.504582633333333,9.938270663873064 C 7.7945826333333335,10.228270663873065 8.244082633333333,10.228270663873065 8.534082633333334,9.938270663873064 L 8.911082633333333,9.546770663873065 C 9.201082633333334,9.256770663873064 9.201082633333334,8.807270663873066 8.911082633333333,8.517270663873065 L 8.519582633333334,8.140270663873064" stroke-linejoin="round"/>', '<path class="dot" d="M 8.519583333333333,10.140270663873062 L 8.519583333333333,10.140270663873062 C 8.229583333333332,9.850270663873063 7.780083333333333,9.850270663873063 7.490083333333333,10.140270663873062 L 7.113083333333333,10.517270663873063 C 6.823083333333333,10.807270663873062 6.823083333333333,11.256770663873063 7.113083333333333,11.546770663873064 L 7.504583333333333,11.938270663873062 C 7.794583333333333,12.228270663873063 8.244083333333332,12.228270663873063 8.534083333333333,11.938270663873062 L 8.911083333333334,11.546770663873064 C 9.201083333333333,11.256770663873063 9.201083333333333,10.807270663873064 8.911083333333334,10.517270663873063 L 8.519583333333333,10.140270663873062" stroke-linejoin="round"/>', '<path class="dot" d="M 7.519582733333333,13.140270763873064 L 7.5195827333333325,13.140270763873064 C 7.2295827333333325,12.850270763873064 6.780082733333333,12.850270763873064 6.490082733333333,13.140270763873064 L 6.113082733333333,13.517270763873064 C 5.823082733333333,13.807270763873063 5.823082733333333,14.256770763873064 6.113082733333333,14.546770763873065 L 6.504582733333333,14.938270763873064 C 6.794582733333333,15.228270763873065 7.244082733333332,15.228270763873065 7.5340827333333324,14.938270763873064 L 7.911082733333333,14.546770763873065 C 8.201082733333333,14.256770763873064 8.201082733333333,13.807270763873065 7.911082733333333,13.517270763873064 L 7.519582733333333,13.140270763873064" stroke-linejoin="round"/>', '<path class="dot" d="M 6.519582833333333,14.140270763873064 L 6.519582833333332,14.140270763873064 C 6.229582833333332,13.850270763873064 5.780082833333332,13.850270763873064 5.490082833333332,14.140270763873064 L 5.1130828333333325,14.517270763873064 C 4.823082833333332,14.807270763873063 4.823082833333332,15.256770763873064 5.1130828333333325,15.546770763873065 L 5.504582833333332,15.938270763873064 C 5.794582833333332,16.228270763873063 6.244082833333332,16.228270763873063 6.534082833333332,15.938270763873064 L 6.9110828333333325,15.546770763873065 C 7.2010828333333325,15.256770763873064 7.2010828333333325,14.807270763873065 6.9110828333333325,14.517270763873064 L 6.519582833333333,14.140270763873064" stroke-linejoin="round"/>', '<path class="dot" d="M 4.519583133333334,14.140270763873064 L 4.519583133333334,14.140270763873064 C 4.229583133333334,13.850270763873064 3.7800831333333336,13.850270763873064 3.4900831333333335,14.140270763873064 L 3.1130831333333333,14.517270763873064 C 2.8230831333333333,14.807270763873063 2.8230831333333333,15.256770763873064 3.1130831333333333,15.546770763873065 L 3.5045831333333335,15.938270763873064 C 3.794583133333333,16.228270763873063 4.2440831333333335,16.228270763873063 4.534083133333334,15.938270763873064 L 4.911083133333333,15.546770763873065 C 5.201083133333334,15.256770763873064 5.201083133333334,14.807270763873065 4.911083133333333,14.517270763873064 L 4.519583133333334,14.140270763873064" stroke-linejoin="round"/>', '<path class="dot" d="M 3.519583203333333,13.140270763873064 L 3.519583203333333,13.140270763873064 C 3.229583203333333,12.850270763873064 2.780083203333333,12.850270763873064 2.490083203333333,13.140270763873064 L 2.113083203333333,13.517270763873064 C 1.823083203333333,13.807270763873063 1.823083203333333,14.256770763873064 2.113083203333333,14.546770763873065 L 2.504583203333333,14.938270763873064 C 2.7945832033333327,15.228270763873065 3.244083203333333,15.228270763873065 3.534083203333333,14.938270763873064 L 3.9110832033333334,14.546770763873065 C 4.201083203333333,14.256770763873064 4.201083203333333,13.807270763873065 3.9110832033333334,13.517270763873064 L 3.519583203333333,13.140270763873064" stroke-linejoin="round"/>', '<path class="dot" d="M 2.5195833333333333,11.140270763873064 L 2.5195833333333333,11.140270763873064 C 2.2295833333333333,10.850270763873064 1.7800833333333332,10.850270763873064 1.4900833333333332,11.140270763873064 L 1.1130833333333332,11.517270763873064 C 0.8230833333333332,11.807270763873063 0.8230833333333331,12.256770763873064 1.1130833333333332,12.546770763873065 L 1.5045833333333332,12.938270763873064 C 1.794583333333333,13.228270763873065 2.244083333333333,13.228270763873065 2.5340833333333332,12.938270763873064 L 2.9110833333333335,12.546770763873065 C 3.2010833333333335,12.256770763873064 3.2010833333333335,11.807270763873065 2.9110833333333335,11.517270763873064 L 2.5195833333333333,11.140270763873064" stroke-linejoin="round"/>']
            
            
            <path d="M 6.9999994,0.9999998610794634 L 3.9999998000000003,0.9999998610794634 L 2.99999987,6.999999830539731 L 3.9999998,5.999999830539731 L 5.9999994999999995,5.999999830539731 L 6.9999994,6.999999830539731 L 7.9999993,8.999999830539732 L 8.0,10.99999983053973 L 6.9999994,13.999999930539731 L 5.9999994999999995,14.999999930539731 L 3.9999998000000003,14.999999930539731 L 2.99999987,13.999999930539731 L 2.0,11.999999930539731" fill="none"
            stroke="black"
            stroke-width="1.5"
            stroke-linecap="round"
            stroke-linejoin="round"
            />
            
            
        </svg>