<?xml version="1.0"?><!DOCTYPE svg PUBLIC "-//W3C//DTD SVG 1.1//EN" "http://www.w3.org/Graphics/SVG/1.1/DTD/svg11.dtd"><svg xmlns="http://www.w3.org/2000/svg" xmlns:xlink="http://www.w3.org/1999/xlink" width="350" height="1000" viewBox="0 0 7 17" >
            
                ['<path class="dot" d="M 3.385,0.31800000000000006 L 3.385,0.31800000000000006 C 3.1649999999999996,0.09799999999999998 2.824,0.09799999999999995 2.6039999999999996,0.31800000000000006 L 2.3179999999999996,0.6040000000000002 C 2.0979999999999994,0.8240000000000002 2.0979999999999994,1.1650000000000003 2.3179999999999996,1.3850000000000002 L 2.6149999999999993,1.682 C 2.8349999999999995,1.902 3.1759999999999997,1.902 3.3959999999999995,1.682 L 3.682,1.3850000000000002 C 3.902,1.165 3.902,0.8240000000000002 3.682,0.6040000000000001 L 3.385,0.31800000000000006" stroke-linejoin="round"/>', '<path class="dot" d="M 2.385,3.318 L 2.385,3.318 C 2.165,3.098 1.8239999999999998,3.098 1.6039999999999999,3.318 L 1.3179999999999998,3.604 C 1.0979999999999999,3.8240000000000003 1.0979999999999996,4.165 1.3179999999999998,4.385 L 1.6149999999999998,4.682 C 1.8349999999999997,4.902 2.176,4.902 2.396,4.682 L 2.6820000000000004,4.385 C 2.902,4.165 2.902,3.8240000000000003 2.6820000000000004,3.604 L 2.385,3.318" stroke-linejoin="round"/>', '<path class="dot" d="M 2.385,7.3180000000000005 L 2.385,7.3180000000000005 C 2.165,7.098000000000001 1.8239999999999998,7.098000000000001 1.6039999999999999,7.3180000000000005 L 1.3179999999999998,7.604000000000001 C 1.0979999999999999,7.824000000000001 1.0979999999999996,8.165000000000001 1.3179999999999998,8.385000000000002 L 1.6149999999999998,8.682 C 1.8349999999999997,8.902000000000001 2.176,8.902000000000001 2.396,8.682 L 2.6820000000000004,8.385000000000002 C 2.902,8.165000000000001 2.902,7.824000000000001 2.6820000000000004,7.604000000000001 L 2.385,7.3180000000000005" stroke-linejoin="round"/>', '<path class="dot" d="M 3.385,10.318 L 3.385,10.318 C 3.1649999999999996,10.098 2.824,10.098 2.6039999999999996,10.318 L 2.3179999999999996,10.604000000000001 C 2.0979999999999994,10.824 2.0979999999999994,11.165000000000001 2.3179999999999996,11.385000000000002 L 2.6149999999999993,11.682 C 2.8349999999999995,11.902000000000001 3.1759999999999997,11.902000000000001 3.3959999999999995,11.682 L 3.682,11.385000000000002 C 3.902,11.165000000000001 3.902,10.824 3.682,10.604000000000001 L 3.385,10.318000000000001" stroke-linejoin="round"/>', '<path class="dot" d="M 5.385,10.318 L 5.385,10.318 C 5.164999999999999,10.098 4.824,10.098 4.603999999999999,10.318 L 4.318,10.604000000000001 C 4.098,10.824 4.098,11.165000000000001 4.318,11.385000000000002 L 4.614999999999999,11.682 C 4.834999999999999,11.902000000000001 5.176,11.902000000000001 5.395999999999999,11.682 L 5.682,11.385000000000002 C 5.902,11.165000000000001 5.902,10.824 5.682,10.604000000000001 L 5.385,10.318000000000001" stroke-linejoin="round"/>', '<path class="dot" d="M 6.385,7.3180000000000005 L 6.385,7.3180000000000005 C 6.164999999999999,7.098000000000001 5.824,7.098000000000001 5.603999999999999,7.3180000000000005 L 5.318,7.604000000000001 C 5.098,7.824000000000001 5.098,8.165000000000001 5.318,8.385000000000002 L 5.614999999999999,8.682 C 5.834999999999999,8.902000000000001 6.176,8.902000000000001 6.395999999999999,8.682 L 6.682,8.385000000000002 C 6.902,8.165000000000001 6.902,7.824000000000001 6.682,7.604000000000001 L 6.385,7.3180000000000005" stroke-linejoin="round"/>', '<path class="dot" d="M 6.385,3.318 L 6.385,3.318 C 6.164999999999999,3.098 5.824,3.098 5.603999999999999,3.318 L 5.318,3.604 C 5.098,3.8240000000000003 5.098,4.165 5.318,4.385 L 5.614999999999999,4.682 C 5.834999999999999,4.902 6.176,4.902 6.395999999999999,4.682 L 6.682,4.385 C 6.902,4.165 6.902,3.8240000000000003 6.682,3.604 L 6.385,3.318" stroke-linejoin="round"/>', '<path class="dot" d="M 5.385,0.31800000000000006 L 5.385,0.31800000000000006 C 5.164999999999999,0.09799999999999998 4.824,0.09799999999999995 4.603999999999999,0.31800000000000006 L 4.318,0.6040000000000002 C 4.098,0.8240000000000002 4.098,1.1650000000000003 4.318,1.3850000000000002 L 4.614999999999999,1.682 C 4.834999999999999,1.902 5.176,1.902 5.395999999999999,1.682 L 5.682,1.3850000000000002 C 5.902,1.165 5.902,0.8240000000000002 5.682,0.6040000000000001 L 5.385,0.31800000000000006" stroke-linejoin="round"/>', '<path class="dot" d="M 3.385,0.31800000000000006 L 3.385,0.31800000000000006 C 3.1649999999999996,0.09799999999999998 2.824,0.09799999999999995 2.6039999999999996,0.31800000000000006 L 2.3179999999999996,0.6040000000000002 C 2.0979999999999994,0.8240000000000002 2.0979999999999994,1.1650000000000003 2.3179999999999996,1.3850000000000002 L 2.6149999999999993,1.682 C 2.8349999999999995,1.902 3.1759999999999997,1.902 3.3959999999999995,1.682 L 3.682,1.3850000000000002 C 3.902,1.165 3.902,0.8240000000000002 3.682,0.6040000000000001 L 3.385,0.31800000000000006" stroke-linejoin="round"/>']
            
            
            <path d="M 3.0,1.0 L 2.0,4.0 L 2.0,8.0 L 3.0,11.0 L 5.0,11.0 L 6.0,8.0 L 6.0,4.0 L 5.0,1.0 L 3.0,1.0" fill="none"
            stroke="black"
            stroke-width="1"
            stroke-linecap="round"
            stroke-linejoin="round"
            />
            
            
        </svg>