<?xml version="1.0"?><!DOCTYPE svg PUBLIC "-//W3C//DTD SVG 1.1//EN" "http://www.w3.org/Graphics/SVG/1.1/DTD/svg11.dtd"><svg xmlns="http://www.w3.org/2000/svg" xmlns:xlink="http://www.w3.org/1999/xlink" width="350" height="1000" viewBox="0 0 7 17" >
            
                ['<path class="dot" d="M 4.385,8.318 L 4.385,8.318 C 4.164999999999999,8.098 3.824,8.098 3.6039999999999996,8.318 L 3.3179999999999996,8.604000000000001 C 3.0979999999999994,8.824 3.0979999999999994,9.165000000000001 3.3179999999999996,9.385000000000002 L 3.6149999999999993,9.682 C 3.8349999999999995,9.902000000000001 4.176,9.902000000000001 4.395999999999999,9.682 L 4.682,9.385000000000002 C 4.902,9.165000000000001 4.902,8.824 4.682,8.604000000000001 L 4.385,8.318000000000001" stroke-linejoin="round"/>', '<path class="dot" d="M 2.385,10.318 L 2.385,10.318 C 2.165,10.098 1.8239999999999998,10.098 1.6039999999999999,10.318 L 1.3179999999999998,10.604000000000001 C 1.0979999999999999,10.824 1.0979999999999996,11.165000000000001 1.3179999999999998,11.385000000000002 L 1.6149999999999998,11.682 C 1.8349999999999997,11.902000000000001 2.176,11.902000000000001 2.396,11.682 L 2.6820000000000004,11.385000000000002 C 2.902,11.165000000000001 2.902,10.824 2.6820000000000004,10.604000000000001 L 2.385,10.318000000000001" stroke-linejoin="round"/>', '<path class="dot" d="M 0.385,8.318 L 0.3849999999999998,8.318 C 0.1649999999999998,8.098 -0.17600000000000016,8.098 -0.3960000000000002,8.318 L -0.6820000000000002,8.604000000000001 C -0.9020000000000002,8.824 -0.9020000000000002,9.165000000000001 -0.6820000000000002,9.385000000000002 L -0.38500000000000023,9.682 C -0.16500000000000026,9.902000000000001 0.17599999999999993,9.902000000000001 0.3959999999999997,9.682 L 0.6820000000000002,9.385000000000002 C 0.9020000000000001,9.165000000000001 0.9020000000000001,8.824 0.6820000000000002,8.604000000000001 L 0.385,8.318000000000001" stroke-linejoin="round"/>', '<path class="dot" d="M 0.385,5.3180000000000005 L 0.3849999999999998,5.3180000000000005 C 0.1649999999999998,5.098000000000001 -0.17600000000000016,5.098000000000001 -0.3960000000000002,5.3180000000000005 L -0.6820000000000002,5.604000000000001 C -0.9020000000000002,5.824000000000001 -0.9020000000000002,6.165000000000001 -0.6820000000000002,6.385000000000001 L -0.38500000000000023,6.682 C -0.16500000000000026,6.902 0.17599999999999993,6.902 0.3959999999999997,6.682 L 0.6820000000000002,6.385000000000001 C 0.9020000000000001,6.165000000000001 0.9020000000000001,5.824000000000001 0.6820000000000002,5.604000000000001 L 0.385,5.3180000000000005" stroke-linejoin="round"/>', '<path class="dot" d="M 2.385,3.318 L 2.385,3.318 C 2.165,3.098 1.8239999999999998,3.098 1.6039999999999999,3.318 L 1.3179999999999998,3.604 C 1.0979999999999999,3.8240000000000003 1.0979999999999996,4.165 1.3179999999999998,4.385 L 1.6149999999999998,4.682 C 1.8349999999999997,4.902 2.176,4.902 2.396,4.682 L 2.6820000000000004,4.385 C 2.902,4.165 2.902,3.8240000000000003 2.6820000000000004,3.604 L 2.385,3.318" stroke-linejoin="round"/>', '<path class="dot" d="M 4.385,5.3180000000000005 L 4.385,5.3180000000000005 C 4.164999999999999,5.098000000000001 3.824,5.098000000000001 3.6039999999999996,5.3180000000000005 L 3.3179999999999996,5.604000000000001 C 3.0979999999999994,5.824000000000001 3.0979999999999994,6.165000000000001 3.3179999999999996,6.385000000000001 L 3.6149999999999993,6.682 C 3.8349999999999995,6.902 4.176,6.902 4.395999999999999,6.682 L 4.682,6.385000000000001 C 4.902,6.165000000000001 4.902,5.824000000000001 4.682,5.604000000000001 L 4.385,5.3180000000000005" stroke-linejoin="round"/>']
            
                ['<path class="dot" d="M 4.385,3.318 L 4.385,3.318 C 4.164999999999999,3.098 3.824,3.098 3.6039999999999996,3.318 L 3.3179999999999996,3.604 C 3.0979999999999994,3.8240000000000003 3.0979999999999994,4.165 3.3179999999999996,4.385 L 3.6149999999999993,4.682 C 3.8349999999999995,4.902 4.176,4.902 4.395999999999999,4.682 L 4.682,4.385 C 4.902,4.165 4.902,3.8240000000000003 4.682,3.604 L 4.385,3.318" stroke-linejoin="round"/>', '<path class="dot" d="M 4.385,10.318 L 4.385,10.318 C 4.164999999999999,10.098 3.824,10.098 3.6039999999999996,10.318 L 3.3179999999999996,10.604000000000001 C 3.0979999999999994,10.824 3.0979999999999994,11.165000000000001 3.3179999999999996,11.385000000000002 L 3.6149999999999993,11.682 C 3.8349999999999995,11.902000000000001 4.176,11.902000000000001 4.395999999999999,11.682 L 4.682,11.385000000000002 C 4.902,11.165000000000001 4.902,10.824 4.682,10.604000000000001 L 4.385,10.318000000000001" stroke-linejoin="round"/>']
            
                ['<path class="dot" d="M 8.385,5.3180000000000005 L 8.385,5.3180000000000005 C 8.165,5.098000000000001 7.824,5.098000000000001 7.603999999999999,5.3180000000000005 L 7.318,5.604000000000001 C 7.098,5.824000000000001 7.098,6.165000000000001 7.318,6.385000000000001 L 7.614999999999999,6.682 C 7.834999999999999,6.902 8.176,6.902 8.395999999999999,6.682 L 8.682,6.385000000000001 C 8.902,6.165000000000001 8.902,5.824000000000001 8.682,5.604000000000001 L 8.385,5.3180000000000005" stroke-linejoin="round"/>', '<path class="dot" d="M 6.385,3.318 L 6.385,3.318 C 6.164999999999999,3.098 5.824,3.098 5.603999999999999,3.318 L 5.318,3.604 C 5.098,3.8240000000000003 5.098,4.165 5.318,4.385 L 5.614999999999999,4.682 C 5.834999999999999,4.902 6.176,4.902 6.395999999999999,4.682 L 6.682,4.385 C 6.902,4.165 6.902,3.8240000000000003 6.682,3.604 L 6.385,3.318" stroke-linejoin="round"/>', '<path class="dot" d="M 4.385,5.3180000000000005 L 4.385,5.3180000000000005 C 4.164999999999999,5.098000000000001 3.824,5.098000000000001 3.6039999999999996,5.3180000000000005 L 3.3179999999999996,5.604000000000001 C 3.0979999999999994,5.824000000000001 3.0979999999999994,6.165000000000001 3.3179999999999996,6.385000000000001 L 3.6149999999999993,6.682 C 3.8349999999999995,6.902 4.176,6.902 4.395999999999999,6.682 L 4.682,6.385000000000001 C 4.902,6.165000000000001 4.902,5.824000000000001 4.682,5.604000000000001 L 4.385,5.3180000000000005" stroke-linejoin="round"/>', '<path class="dot" d="M 4.385,8.318 L 4.385,8.318 C 4.164999999999999,8.098 3.824,8.098 3.6039999999999996,8.318 L 3.3179999999999996,8.604000000000001 C 3.0979999999999994,8.824 3.0979999999999994,9.165000000000001 3.3179999999999996,9.385000000000002 L 3.6149999999999993,9.682 C 3.8349999999999995,9.902000000000001 4.176,9.902000000000001 4.395999999999999,9.682 L 4.682,9.385000000000002 C 4.902,9.165000000000001 4.902,8.824 4.682,8.604000000000001 L 4.385,8.318000000000001" stroke-linejoin="round"/>', '<path class="dot" d="M 6.385,10.318 L 6.385,10.318 C 6.164999999999999,10.098 5.824,10.098 5.603999999999999,10.318 L 5.318,10.604000000000001 C 5.098,10.824 5.098,11.165000000000001 5.318,11.385000000000002 L 5.614999999999999,11.682 C 5.834999999999999,11.902000000000001 6.176,11.902000000000001 6.395999999999999,11.682 L 6.682,11.385000000000002 C 6.902,11.165000000000001 6.902,10.824 6.682,10.604000000000001 L 6.385,10.318000000000001" stroke-linejoin="round"/>', '<path class="dot" d="M 8.385,8.318 L 8.385,8.318 C 8.165,8.098 7.824,8.098 7.603999999999999,8.318 L 7.318,8.604000000000001 C 7.098,8.824 7.098,9.165000000000001 7.318,9.385000000000002 L 7.614999999999999,9.682 C 7.834999999999999,9.902000000000001 8.176,9.902000000000001 8.395999999999999,9.682 L 8.682,9.385000000000002 C 8.902,9.165000000000001 8.902,8.824 8.682,8.604000000000001 L 8.385,8.318000000000001" stroke-linejoin="round"/>']
            
                ['<path class="dot" d="M 4.385,6.3180000000000005 L 4.385,6.3180000000000005 C 4.164999999999999,6.098000000000001 3.824,6.098000000000001 3.6039999999999996,6.3180000000000005 L 3.3179999999999996,6.604000000000001 C 3.0979999999999994,6.824000000000001 3.0979999999999994,7.165000000000001 3.3179999999999996,7.385000000000001 L 3.6149999999999993,7.682 C 3.8349999999999995,7.902 4.176,7.902 4.395999999999999,7.682 L 4.682,7.385000000000001 C 4.902,7.165000000000001 4.902,6.824000000000001 4.682,6.604000000000001 L 4.385,6.3180000000000005" stroke-linejoin="round"/>', '<path class="dot" d="M 8.385,6.3180000000000005 L 8.385,6.3180000000000005 C 8.165,6.098000000000001 7.824,6.098000000000001 7.603999999999999,6.3180000000000005 L 7.318,6.604000000000001 C 7.098,6.824000000000001 7.098,7.165000000000001 7.318,7.385000000000001 L 7.614999999999999,7.682 C 7.834999999999999,7.902 8.176,7.902 8.395999999999999,7.682 L 8.682,7.385000000000001 C 8.902,7.165000000000001 8.902,6.824000000000001 8.682,6.604000000000001 L 8.385,6.3180000000000005" stroke-linejoin="round"/>', '<path class="dot" d="M 8.385,5.3180000000000005 L 8.385,5.3180000000000005 C 8.165,5.098000000000001 7.824,5.098000000000001 7.603999999999999,5.3180000000000005 L 7.318,5.604000000000001 C 7.098,5.824000000000001 7.098,6.165000000000001 7.318,6.385000000000001 L 7.614999999999999,6.682 C 7.834999999999999,6.902 8.176,6.902 8.395999999999999,6.682 L 8.682,6.385000000000001 C 8.902,6.165000000000001 8.902,5.824000000000001 8.682,5.604000000000001 L 8.385,5.3180000000000005" stroke-linejoin="round"/>']
            
            
            <path d="M 4.0,9.0 L 2.0,11.0 L 0.0,9.0 L 0.0,6.0 L 2.0,4.0 L 4.0,6.0" fill="none"
            stroke="black"
            stroke-width="1"
            stroke-linecap="round"
            stroke-linejoin="round"
            />
            
            <path d="M 4.0,4.0 L 4.0,11.0" fill="none"
            stroke="black"
            stroke-width="1"
            stroke-linecap="round"
            stroke-linejoin="round"
            />
            
            <path d="M 8.0,6.0 L 6.0,4.0 L 4.0,6.0 L 4.0,9.0 L 6.0,11.0 L 8.0,9.0" fill="none"
            stroke="black"
            stroke-width="1"
            stroke-linecap="round"
            stroke-linejoin="round"
            />
            
            <path d="M 4.0,7.0 L 8.0,7.0 L 8.0,6.0" fill="none"
            stroke="black"
            stroke-width="1"
            stroke-linecap="round"
            stroke-linejoin="round"
            />
            
            
        </svg>