<?xml version="1.0" encoding="UTF-8" standalone="no"?>
<svg
   width="2.9934621"
   height="8.000001"
   viewBox="0 0 0.11973848 0.32000004"
   version="1.1"
   id="svg25"
   xmlns="http://www.w3.org/2000/svg"
   xmlns:svg="http://www.w3.org/2000/svg"><defs
   id="defs25" />

            
                ['', '']
            
                ['', '', '', '', '', '', '', '', '', '']
            
                ['', '', '', '', '', '', '', '', '', '']
            
            
            <g
   id="g29"
   transform="matrix(0.03,0,0,0.02857143,-0.0039,0.11400001)"
   style="stroke-width:34.1565">
  <g
     id="g28"
     style="stroke-width:34.1565">
    <g
       id="g32"
       style="stroke:none;stroke-width:1350.16"
       transform="matrix(0.024,0,0,0.02666667,0.21487991,-2.5116004)">
      <g
         id="g33"
         style="stroke:none;stroke-width:53441.4"
         transform="matrix(0.02393569,0,0,0.02666667,-5.5608276,-1.1116285)">
        <g
           id="g34"
           style="stroke:none;stroke-width:2.11247e+06"
           transform="matrix(0.02399997,0,0,0.02666664,-21284.883,51.222335)">
          <path
             d="M 890394.85,-78320.16 1179892.2,512305.31"
             fill="none"
             stroke="#000000"
             stroke-width="5.28113e+06"
             stroke-linecap="round"
             stroke-linejoin="round"
             id="path35"
             style="stroke:none" />
        </g>
      </g>
    </g>
  </g>
</g>
</svg>
