<?xml version="1.0" encoding="UTF-8" standalone="no"?>
<svg
   data-dec="67"
   width="14"
   height="40"
   version="1.1"
   id="svg1"
   sodipodi:docname="C-jsp.svg"
   inkscape:version="1.3.2 (091e20ef0f, 2023-11-25, custom)"
   xmlns:inkscape="http://www.inkscape.org/namespaces/inkscape"
   xmlns:sodipodi="http://sodipodi.sourceforge.net/DTD/sodipodi-0.dtd"
   xmlns="http://www.w3.org/2000/svg"
   xmlns:svg="http://www.w3.org/2000/svg">
  <defs
     id="defs1" />
  <sodipodi:namedview
     id="namedview1"
     pagecolor="#ffffff"
     bordercolor="#666666"
     borderopacity="1.0"
     inkscape:showpageshadow="2"
     inkscape:pageopacity="0.0"
     inkscape:pagecheckerboard="0"
     inkscape:deskcolor="#d1d1d1"
     showgrid="true"
     inkscape:zoom="10.375"
     inkscape:cx="-14.457831"
     inkscape:cy="23.518072"
     inkscape:window-width="1920"
     inkscape:window-height="1043"
     inkscape:window-x="0"
     inkscape:window-y="0"
     inkscape:window-maximized="1"
     inkscape:current-layer="svg1">
    <inkscape:grid
       id="grid1"
       units="px"
       originx="0"
       originy="0"
       spacingx="1"
       spacingy="1"
       empcolor="#0099e5"
       empopacity="0.30196078"
       color="#0099e5"
       opacity="0.14901961"
       empspacing="5"
       dotted="false"
       gridanglex="30"
       gridanglez="30"
       visible="true" />
  </sodipodi:namedview>
  <path
     d="M 25.545455,6 24.909091,4 23.636364,2 22.363636,1 H 19.818182 L 18.545455,2 17.272727,4 16.636364,6 16,9 v 5 l 0.636364,3 0.636363,2 1.272728,2 1.272727,1 h 2.545454 l 1.272728,-1 1.272727,-2 0.636364,-2"
     style="fill:none;stroke:#000000;stroke-width:2;stroke-linecap:round;stroke-linejoin:round"
     id="path1" />
  <path
     d="M 12,4 11,2 9,1 H 6 L 4,2 3,4 2,9 v 5 l 1,5 1,2 2,1 h 3 l 2,-1 1,-2"
     style="fill:none;stroke:none;stroke-width:2;stroke-linecap:round;stroke-linejoin:round"
     id="path1-2"
     sodipodi:nodetypes="cccccccccccccc" />
  <path
     d="m -6,1 -2,1 -1,2 -1,5 v 5 l 1,5 1,2 2,1 h 2 l 2,-1 1,-2 M -1,4 -2,2 -4,1 h -2"
     style="fill:none;stroke:none;stroke-width:2;stroke-linecap:round;stroke-linejoin:round"
     id="path1-2-8"
     sodipodi:nodetypes="ccccccccccccccc" />
  <path
     d="m -30,1 -2,1 -1,2 -1,5 v 5 l 1,5 1,2 2,1 h 2 l 2,-1 1,-2 1,-3 m 0,-9 -1,-3 -1,-2 -2,-1 h -2"
     style="fill:none;stroke:none;stroke-width:2;stroke-linecap:round;stroke-linejoin:round"
     id="path1-2-4"
     sodipodi:nodetypes="ccccccccccccccccc" />
  <path
     d="m -18,1 -2,1 -1,2 -1,5 v 5 l 1,5 1,2 2,1 h 2 l 2,-1 1,-1 1,-3 m 0,-11 -1,-3 -1,-1 -2,-1 h -2"
     style="fill:none;stroke:none;stroke-width:2;stroke-linecap:round;stroke-linejoin:round"
     id="path1-2-5"
     sodipodi:nodetypes="ccccccccccccccccc" />
</svg>
