<?xml version="1.0"?><!DOCTYPE svg PUBLIC "-//W3C//DTD SVG 1.1//EN" "http://www.w3.org/Graphics/SVG/1.1/DTD/svg11.dtd"><svg xmlns="http://www.w3.org/2000/svg" xmlns:xlink="http://www.w3.org/1999/xlink" width="350" height="1000" viewBox="0 0 7 17" >
            
                ['<path class="dot" d="M 1.3849999,3.3180002599999994 L 1.3849998999999997,3.3180002599999994 C 1.1649998999999998,3.098000259999999 0.8239998999999998,3.098000259999999 0.6039998999999998,3.3180002599999994 L 0.3179998999999998,3.6040002599999994 C 0.0979998999999997,3.8240002599999996 0.09799989999999967,4.165000259999999 0.3179998999999998,4.38500026 L 0.6149998999999997,4.682000259999999 C 0.8349998999999997,4.902000259999999 1.1759998999999999,4.902000259999999 1.3959998999999996,4.682000259999999 L 1.6819999,4.38500026 C 1.9019999,4.165000259999999 1.9019999,3.8240002599999996 1.6819999,3.6040002599999994 L 1.3849999,3.3180002599999994" stroke-linejoin="round"/>', '<path class="dot" d="M 7.3849997,3.3180002599999994 L 7.3849997,3.3180002599999994 C 7.164999699999999,3.098000259999999 6.8239997,3.098000259999999 6.603999699999999,3.3180002599999994 L 6.3179997,3.6040002599999994 C 6.0979997,3.8240002599999996 6.0979997,4.165000259999999 6.3179997,4.38500026 L 6.614999699999999,4.682000259999999 C 6.834999699999999,4.902000259999999 7.1759997,4.902000259999999 7.395999699999999,4.682000259999999 L 7.6819997,4.38500026 C 7.9019997,4.165000259999999 7.9019997,3.8240002599999996 7.6819997,3.6040002599999994 L 7.3849997,3.3180002599999994" stroke-linejoin="round"/>', '<path class="dot" d="M 7.3849997,3.3180002600000003 L 7.3849997,3.3180002600000003 C 7.164999699999999,3.09800026 6.8239997,3.09800026 6.603999699999999,3.3180002600000003 L 6.3179997,3.6040002600000003 C 6.0979997,3.8240002600000005 6.0979997,4.16500026 6.3179997,4.38500026 L 6.614999699999999,4.682000260000001 C 6.834999699999999,4.90200026 7.1759997,4.90200026 7.395999699999999,4.682000260000001 L 7.6819997,4.38500026 C 7.9019997,4.16500026 7.9019997,3.8240002600000005 7.6819997,3.6040002600000003 L 7.3849997,3.3180002600000003" stroke-linejoin="round"/>', '<path class="dot" d="M 0.3849999700000002,10.318000029999999 L 0.38499996999999997,10.318000029999999 C 0.16499997,10.09800003 -0.17600002999999997,10.09800003 -0.39600003,10.318000029999999 L -0.68200003,10.60400003 C -0.9020000300000001,10.824000029999999 -0.9020000300000001,11.16500003 -0.68200003,11.38500003 L -0.38500003000000005,11.68200003 C -0.16500003000000008,11.90200003 0.17599997000000012,11.90200003 0.39599996999999987,11.68200003 L 0.6819999700000003,11.38500003 C 0.9019999700000003,11.16500003 0.9019999700000003,10.824000029999999 0.6819999700000003,10.60400003 L 0.3849999700000002,10.31800003" stroke-linejoin="round"/>']
            
            
            <path d="M 0.9999998999999999,4.000000259999999 L 6.9999997,4.000000259999999 L 6.9999997,10.000000029999999 M 6.9999997,4.00000026 L -2.999999981767587e-08,11.000000029999999" fill="none"
            stroke="black"
            stroke-width="1"
            stroke-linecap="round"
            stroke-linejoin="round"
            />
            
            
        </svg>