<?xml version="1.0"?><!DOCTYPE svg PUBLIC "-//W3C//DTD SVG 1.1//EN" "http://www.w3.org/Graphics/SVG/1.1/DTD/svg11.dtd"><svg xmlns="http://www.w3.org/2000/svg" xmlns:xlink="http://www.w3.org/1999/xlink" width="350" height="1000" viewBox="0 0 10 26" >
            
                ['<path class="dot" d="M 4.519583333333333,13.167291733333332 L 4.519583333333333,13.167291733333332 C 4.229583333333333,12.877291733333333 3.7800833333333332,12.877291733333333 3.490083333333333,13.167291733333332 L 3.113083333333333,13.544291733333333 C 2.823083333333333,13.834291733333334 2.823083333333333,14.283791733333333 3.113083333333333,14.573791733333334 L 3.504583333333333,14.965291733333332 C 3.7945833333333328,15.255291733333333 4.244083333333333,15.255291733333333 4.534083333333333,14.965291733333332 L 4.911083333333334,14.573791733333334 C 5.201083333333333,14.283791733333333 5.201083333333333,13.834291733333334 4.911083333333334,13.544291733333333 L 4.519583333333333,13.167291733333332" stroke-linejoin="round"/>', '<path class="dot" d="M 5.519583333333333,14.140270833333332 L 5.519583333333333,14.140270833333332 C 5.229583333333333,13.850270833333333 4.780083333333333,13.850270833333333 4.490083333333333,14.140270833333332 L 4.113083333333333,14.517270833333333 C 3.823083333333333,14.807270833333334 3.823083333333333,15.256770833333333 4.113083333333333,15.546770833333333 L 4.504583333333333,15.938270833333332 C 4.794583333333333,16.228270833333333 5.244083333333333,16.228270833333333 5.534083333333333,15.938270833333332 L 5.911083333333334,15.546770833333333 C 6.201083333333333,15.256770833333333 6.201083333333333,14.807270833333334 5.911083333333334,14.517270833333333 L 5.519583333333333,14.140270833333332" stroke-linejoin="round"/>', '<path class="dot" d="M 6.519583333333333,13.140270833333332 L 6.519583333333332,13.140270833333332 C 6.229583333333332,12.850270833333333 5.780083333333333,12.850270833333333 5.490083333333333,13.140270833333332 L 5.113083333333333,13.517270833333333 C 4.823083333333333,13.807270833333334 4.823083333333333,14.256770833333333 5.113083333333333,14.546770833333333 L 5.504583333333333,14.938270833333332 C 5.794583333333333,15.228270833333333 6.244083333333332,15.228270833333333 6.534083333333332,14.938270833333332 L 6.911083333333333,14.546770833333333 C 7.201083333333333,14.256770833333333 7.201083333333333,13.807270833333334 6.911083333333333,13.517270833333333 L 6.519583333333333,13.140270833333332" stroke-linejoin="round"/>', '<path class="dot" d="M 5.519583333333333,12.140270833333332 L 5.519583333333333,12.140270833333332 C 5.229583333333333,11.850270833333333 4.780083333333333,11.850270833333333 4.490083333333333,12.140270833333332 L 4.113083333333333,12.517270833333333 C 3.823083333333333,12.807270833333334 3.823083333333333,13.256770833333333 4.113083333333333,13.546770833333333 L 4.504583333333333,13.938270833333332 C 4.794583333333333,14.228270833333333 5.244083333333333,14.228270833333333 5.534083333333333,13.938270833333332 L 5.911083333333334,13.546770833333333 C 6.201083333333333,13.256770833333333 6.201083333333333,12.807270833333334 5.911083333333334,12.517270833333333 L 5.519583333333333,12.140270833333332" stroke-linejoin="round"/>', '<path class="dot" d="M 4.519583333333333,13.167291733333332 L 4.519583333333333,13.167291733333332 C 4.229583333333333,12.877291733333333 3.7800833333333332,12.877291733333333 3.490083333333333,13.167291733333332 L 3.113083333333333,13.544291733333333 C 2.823083333333333,13.834291733333334 2.823083333333333,14.283791733333333 3.113083333333333,14.573791733333334 L 3.504583333333333,14.965291733333332 C 3.7945833333333328,15.255291733333333 4.244083333333333,15.255291733333333 4.534083333333333,14.965291733333332 L 4.911083333333334,14.573791733333334 C 5.201083333333333,14.283791733333333 5.201083333333333,13.834291733333334 4.911083333333334,13.544291733333333 L 4.519583333333333,13.167291733333332" stroke-linejoin="round"/>']
            
                ['<path class="dot" d="M 2.5195833333333333,4.140270833333333 L 2.5195833333333333,4.140270833333333 C 2.2295833333333333,3.8502708333333326 1.7800833333333332,3.8502708333333326 1.4900833333333332,4.140270833333333 L 1.1130833333333332,4.517270833333333 C 0.8230833333333332,4.807270833333333 0.8230833333333331,5.2567708333333325 1.1130833333333332,5.546770833333333 L 1.5045833333333332,5.938270833333332 C 1.794583333333333,6.228270833333333 2.244083333333333,6.228270833333333 2.5340833333333332,5.938270833333332 L 2.9110833333333335,5.546770833333333 C 3.2010833333333335,5.2567708333333325 3.2010833333333335,4.807270833333333 2.9110833333333335,4.517270833333333 L 2.5195833333333333,4.140270833333333" stroke-linejoin="round"/>', '<path class="dot" d="M 2.5195833333333333,3.1402708333333327 L 2.5195833333333333,3.1402708333333327 C 2.2295833333333333,2.8502708333333326 1.7800833333333332,2.8502708333333326 1.4900833333333332,3.1402708333333327 L 1.1130833333333332,3.517270833333333 C 0.8230833333333332,3.807270833333333 0.8230833333333331,4.2567708333333325 1.1130833333333332,4.546770833333333 L 1.5045833333333332,4.938270833333332 C 1.794583333333333,5.228270833333333 2.244083333333333,5.228270833333333 2.5340833333333332,4.938270833333332 L 2.9110833333333335,4.546770833333333 C 3.2010833333333335,4.2567708333333325 3.2010833333333335,3.807270833333333 2.9110833333333335,3.517270833333333 L 2.5195833333333333,3.140270833333333" stroke-linejoin="round"/>', '<path class="dot" d="M 3.5195833333333333,1.1402708333333331 L 3.5195833333333333,1.1402708333333331 C 3.2295833333333333,0.8502708333333331 2.7800833333333332,0.850270833333333 2.490083333333333,1.1402708333333331 L 2.113083333333333,1.5172708333333333 C 1.8230833333333332,1.8072708333333332 1.8230833333333332,2.2567708333333334 2.113083333333333,2.5467708333333334 L 2.504583333333333,2.938270833333333 C 2.7945833333333328,3.228270833333333 3.244083333333333,3.228270833333333 3.5340833333333332,2.938270833333333 L 3.9110833333333335,2.5467708333333334 C 4.201083333333333,2.2567708333333334 4.201083333333333,1.8072708333333334 3.9110833333333335,1.5172708333333331 L 3.5195833333333333,1.1402708333333331" stroke-linejoin="round"/>', '<path class="dot" d="M 4.519583333333333,0.1402708333333331 L 4.519583333333333,0.1402708333333331 C 4.229583333333333,-0.14972916666666694 3.7800833333333332,-0.149729166666667 3.490083333333333,0.1402708333333331 L 3.113083333333333,0.5172708333333332 C 2.823083333333333,0.8072708333333332 2.823083333333333,1.2567708333333332 3.113083333333333,1.5467708333333332 L 3.504583333333333,1.938270833333333 C 3.7945833333333328,2.228270833333333 4.244083333333333,2.228270833333333 4.534083333333333,1.938270833333333 L 4.911083333333334,1.5467708333333332 C 5.201083333333333,1.2567708333333332 5.201083333333333,0.8072708333333333 4.911083333333334,0.5172708333333331 L 4.519583333333333,0.14027083333333312" stroke-linejoin="round"/>', '<path class="dot" d="M 6.519583333333333,0.1402708333333331 L 6.519583333333332,0.1402708333333331 C 6.229583333333332,-0.14972916666666694 5.780083333333333,-0.149729166666667 5.490083333333333,0.1402708333333331 L 5.113083333333333,0.5172708333333332 C 4.823083333333333,0.8072708333333332 4.823083333333333,1.2567708333333332 5.113083333333333,1.5467708333333332 L 5.504583333333333,1.938270833333333 C 5.794583333333333,2.228270833333333 6.244083333333332,2.228270833333333 6.534083333333332,1.938270833333333 L 6.911083333333333,1.5467708333333332 C 7.201083333333333,1.2567708333333332 7.201083333333333,0.8072708333333333 6.911083333333333,0.5172708333333331 L 6.519583333333333,0.14027083333333312" stroke-linejoin="round"/>', '<path class="dot" d="M 7.519583333333333,1.1402708333333331 L 7.519583333333332,1.1402708333333331 C 7.229583333333332,0.8502708333333331 6.780083333333333,0.850270833333333 6.490083333333333,1.1402708333333331 L 6.113083333333333,1.5172708333333333 C 5.823083333333333,1.8072708333333332 5.823083333333333,2.2567708333333334 6.113083333333333,2.5467708333333334 L 6.504583333333333,2.938270833333333 C 6.794583333333333,3.228270833333333 7.244083333333332,3.228270833333333 7.534083333333332,2.938270833333333 L 7.911083333333333,2.5467708333333334 C 8.201083333333333,2.2567708333333334 8.201083333333333,1.8072708333333334 7.911083333333333,1.5172708333333331 L 7.519583333333333,1.1402708333333331" stroke-linejoin="round"/>', '<path class="dot" d="M 8.519583333333333,3.1402708333333327 L 8.519583333333333,3.1402708333333327 C 8.229583333333332,2.8502708333333326 7.780083333333333,2.8502708333333326 7.490083333333333,3.1402708333333327 L 7.113083333333333,3.517270833333333 C 6.823083333333333,3.807270833333333 6.823083333333333,4.2567708333333325 7.113083333333333,4.546770833333333 L 7.504583333333333,4.938270833333332 C 7.794583333333333,5.228270833333333 8.244083333333332,5.228270833333333 8.534083333333333,4.938270833333332 L 8.911083333333334,4.546770833333333 C 9.201083333333333,4.2567708333333325 9.201083333333333,3.807270833333333 8.911083333333334,3.517270833333333 L 8.519583333333333,3.140270833333333" stroke-linejoin="round"/>', '<path class="dot" d="M 8.519583333333333,5.140270833333333 L 8.519583333333333,5.140270833333333 C 8.229583333333332,4.850270833333333 7.780083333333333,4.850270833333333 7.490083333333333,5.140270833333333 L 7.113083333333333,5.517270833333333 C 6.823083333333333,5.807270833333333 6.823083333333333,6.2567708333333325 7.113083333333333,6.546770833333333 L 7.504583333333333,6.938270833333332 C 7.794583333333333,7.228270833333333 8.244083333333332,7.228270833333333 8.534083333333333,6.938270833333332 L 8.911083333333334,6.546770833333333 C 9.201083333333333,6.2567708333333325 9.201083333333333,5.807270833333333 8.911083333333334,5.517270833333333 L 8.519583333333333,5.140270833333333" stroke-linejoin="round"/>', '<path class="dot" d="M 7.519583333333333,7.140270833333333 L 7.519583333333332,7.140270833333333 C 7.229583333333332,6.850270833333333 6.780083333333333,6.850270833333333 6.490083333333333,7.140270833333333 L 6.113083333333333,7.517270833333333 C 5.823083333333333,7.807270833333333 5.823083333333333,8.256770833333333 6.113083333333333,8.546770833333333 L 6.504583333333333,8.938270833333332 C 6.794583333333333,9.228270833333333 7.244083333333332,9.228270833333333 7.534083333333332,8.938270833333332 L 7.911083333333333,8.546770833333333 C 8.201083333333333,8.256770833333333 8.201083333333333,7.807270833333333 7.911083333333333,7.517270833333333 L 7.519583333333333,7.140270833333333" stroke-linejoin="round"/>', '<path class="dot" d="M 5.519583333333333,8.140270833333332 L 5.519583333333333,8.140270833333332 C 5.229583333333333,7.850270833333333 4.780083333333333,7.850270833333333 4.490083333333333,8.140270833333332 L 4.113083333333333,8.517270833333333 C 3.823083333333333,8.807270833333334 3.823083333333333,9.256770833333333 4.113083333333333,9.546770833333333 L 4.504583333333333,9.938270833333332 C 4.794583333333333,10.228270833333333 5.244083333333333,10.228270833333333 5.534083333333333,9.938270833333332 L 5.911083333333334,9.546770833333333 C 6.201083333333333,9.256770833333333 6.201083333333333,8.807270833333334 5.911083333333334,8.517270833333333 L 5.519583333333333,8.140270833333332" stroke-linejoin="round"/>', '<path class="dot" d="M 5.519583333333333,10.140270833333332 L 5.519583333333333,10.140270833333332 C 5.229583333333333,9.850270833333333 4.780083333333333,9.850270833333333 4.490083333333333,10.140270833333332 L 4.113083333333333,10.517270833333333 C 3.823083333333333,10.807270833333334 3.823083333333333,11.256770833333333 4.113083333333333,11.546770833333333 L 4.504583333333333,11.938270833333332 C 4.794583333333333,12.228270833333333 5.244083333333333,12.228270833333333 5.534083333333333,11.938270833333332 L 5.911083333333334,11.546770833333333 C 6.201083333333333,11.256770833333333 6.201083333333333,10.807270833333334 5.911083333333334,10.517270833333333 L 5.519583333333333,10.140270833333332" stroke-linejoin="round"/>']
            
            
            <path d="M 4.0,14.0270209 L 5.0,15.0 L 6.0,14.0 L 5.0,13.0 L 4.0,14.0270209" fill="none"
            stroke="black"
            stroke-width="1.5"
            stroke-linecap="round"
            stroke-linejoin="round"
            />
            
            <path d="M 2.0,5.0 L 2.0,4.0 L 3.0,2.0 L 4.0,1.0 L 6.0,1.0 L 7.0,2.0 L 8.0,4.0 L 8.0,6.0 L 7.0,8.0 L 5.0,9.0 L 5.0,11.0" fill="none"
            stroke="black"
            stroke-width="1.5"
            stroke-linecap="round"
            stroke-linejoin="round"
            />
            
            
        </svg>