<?xml version="1.0"?><!DOCTYPE svg PUBLIC "-//W3C//DTD SVG 1.1//EN" "http://www.w3.org/Graphics/SVG/1.1/DTD/svg11.dtd"><svg xmlns="http://www.w3.org/2000/svg" xmlns:xlink="http://www.w3.org/1999/xlink" width="350" height="1000" viewBox="0 0 7 17" >
            
                ['<path class="dot" d="M 3.385,1.318 L 3.385,1.318 C 3.1649999999999996,1.0979999999999999 2.824,1.0979999999999999 2.6039999999999996,1.318 L 2.3179999999999996,1.604 C 2.0979999999999994,1.8240000000000003 2.0979999999999994,2.165 2.3179999999999996,2.3850000000000002 L 2.6149999999999993,2.682 C 2.8349999999999995,2.902 3.1759999999999997,2.902 3.3959999999999995,2.682 L 3.682,2.3850000000000002 C 3.902,2.165 3.902,1.8240000000000003 3.682,1.604 L 3.385,1.318" stroke-linejoin="round"/>', '<path class="dot" d="M 5.385,0.31800000000000006 L 5.385,0.31800000000000006 C 5.164999999999999,0.09799999999999998 4.824,0.09799999999999995 4.603999999999999,0.31800000000000006 L 4.318,0.6040000000000002 C 4.098,0.8240000000000002 4.098,1.1650000000000003 4.318,1.3850000000000002 L 4.614999999999999,1.682 C 4.834999999999999,1.902 5.176,1.902 5.395999999999999,1.682 L 5.682,1.3850000000000002 C 5.902,1.165 5.902,0.8240000000000002 5.682,0.6040000000000001 L 5.385,0.31800000000000006" stroke-linejoin="round"/>']
            
            
            <path d="M 3.0,2.0 L 5.0,1.0" fill="none"
            stroke="black"
            stroke-width="1"
            stroke-linecap="round"
            stroke-linejoin="round"
            />
            
            
        </svg>