<?xml version="1.0"?><!DOCTYPE svg PUBLIC "-//W3C//DTD SVG 1.1//EN" "http://www.w3.org/Graphics/SVG/1.1/DTD/svg11.dtd"><svg xmlns="http://www.w3.org/2000/svg" xmlns:xlink="http://www.w3.org/1999/xlink" width="350" height="1000" viewBox="0 0 7 17" >
            
                ['<path class="dot" d="M 4.3849998999999995,4.31800014 L 4.3849998999999995,4.31800014 C 4.1649999,4.09800014 3.8239998999999996,4.09800014 3.6039998999999994,4.31800014 L 3.3179998999999993,4.60400014 C 3.097999899999999,4.82400014 3.097999899999999,5.16500014 3.3179998999999993,5.38500014 L 3.614999899999999,5.6820001399999995 C 3.8349998999999992,5.902000139999999 4.175999899999999,5.902000139999999 4.3959999,5.6820001399999995 L 4.681999899999999,5.38500014 C 4.9019999,5.16500014 4.9019999,4.82400014 4.681999899999999,4.60400014 L 4.3849998999999995,4.31800014" stroke-linejoin="round"/>', '<path class="dot" d="M 7.3849997,6.318000070000001 L 7.3849997,6.318000070000001 C 7.164999699999999,6.098000070000001 6.8239997,6.098000070000001 6.603999699999999,6.318000070000001 L 6.3179997,6.604000070000001 C 6.0979997,6.824000070000001 6.0979997,7.165000070000001 6.3179997,7.385000070000001 L 6.614999699999999,7.682000070000001 C 6.834999699999999,7.902000070000001 7.1759997,7.902000070000001 7.395999699999999,7.682000070000001 L 7.6819997,7.385000070000001 C 7.9019997,7.165000070000001 7.9019997,6.824000070000001 7.6819997,6.604000070000001 L 7.3849997,6.318000070000001" stroke-linejoin="round"/>', '<path class="dot" d="M 7.3849997,6.318000070000001 L 7.3849997,6.318000070000001 C 7.164999699999999,6.098000070000001 6.8239997,6.098000070000001 6.603999699999999,6.318000070000001 L 6.3179997,6.604000070000001 C 6.0979997,6.824000070000001 6.0979997,7.165000070000001 6.3179997,7.385000070000001 L 6.614999699999999,7.682000070000001 C 6.834999699999999,7.902000070000001 7.1759997,7.902000070000001 7.395999699999999,7.682000070000001 L 7.6819997,7.385000070000001 C 7.9019997,7.165000070000001 7.9019997,6.824000070000001 7.6819997,6.604000070000001 L 7.3849997,6.318000070000001" stroke-linejoin="round"/>', '<path class="dot" d="M 1.385,6.31800017 L 1.3849999999999998,6.31800017 C 1.1649999999999998,6.098000170000001 0.8239999999999998,6.098000170000001 0.6039999999999999,6.31800017 L 0.31799999999999984,6.604000170000001 C 0.09799999999999975,6.824000170000001 0.09799999999999973,7.165000170000001 0.31799999999999984,7.3850001700000005 L 0.6149999999999998,7.68200017 C 0.8349999999999997,7.90200017 1.176,7.90200017 1.3959999999999997,7.68200017 L 1.6820000000000002,7.3850001700000005 C 1.9020000000000001,7.165000170000001 1.9020000000000001,6.824000170000001 1.6820000000000002,6.604000170000001 L 1.385,6.31800017" stroke-linejoin="round"/>']
            
            
            <path d="M 3.9999998999999997,5.00000014 L 6.9999997,7.0000000700000005 L 3.9999998999999997,8.999999970000001 M 6.9999997,7.0000000700000005 L 1.0,7.00000017" fill="none"
            stroke="black"
            stroke-width="1"
            stroke-linecap="round"
            stroke-linejoin="round"
            />
            
            
        </svg>