<?xml version="1.0"?><!DOCTYPE svg PUBLIC "-//W3C//DTD SVG 1.1//EN" "http://www.w3.org/Graphics/SVG/1.1/DTD/svg11.dtd"><svg xmlns="http://www.w3.org/2000/svg" xmlns:xlink="http://www.w3.org/1999/xlink" width="350" height="1000" viewBox="0 0 14 40" >
            
                ['<path class="dot" d="M 2.7775030542495696,20.770782933696907 L 2.7775030542495687,20.770782933696907 C 2.3275030542495685,20.320782933696908 1.6300030542495687,20.320782933696908 1.180003054249569,20.770782933696907 L 0.5950030542495688,21.355782933696908 C 0.14500305424956883,21.805782933696907 0.14500305424956872,22.50328293369691 0.5950030542495688,22.953282933696908 L 1.2025030542495687,23.56078293369691 C 1.6525030542495687,24.01078293369691 2.3500030542495685,24.01078293369691 2.8000030542495686,23.56078293369691 L 3.3850030542495695,22.953282933696908 C 3.8350030542495688,22.50328293369691 3.8350030542495688,21.805782933696907 3.3850030542495695,21.355782933696908 L 2.7775030542495696,20.770782933696907" stroke-linejoin="round"/>', '<path class="dot" d="M 12.80437220085247,-0.21639517859487184 L 12.80437220085247,-0.21639517859487184 C 12.35437220085247,-0.6663951785948719 11.65687220085247,-0.666395178594872 11.20687220085247,-0.21639517859487184 L 10.62187220085247,0.3686048214051285 C 10.17187220085247,0.8186048214051285 10.17187220085247,1.5161048214051285 10.62187220085247,1.9661048214051287 L 11.22937220085247,2.5736048214051284 C 11.67937220085247,3.0236048214051277 12.37687220085247,3.0236048214051277 12.82687220085247,2.5736048214051284 L 13.411872200852471,1.9661048214051287 C 13.86187220085247,1.5161048214051285 13.86187220085247,0.8186048214051285 13.411872200852471,0.3686048214051283 L 12.80437220085247,-0.21639517859487167" stroke-linejoin="round"/>']
            
                ['<path class="dot" d="M 4.790943877551021,-0.22280612244898207 L 4.79094387755102,-0.22280612244898207 C 4.34094387755102,-0.6728061224489821 3.64344387755102,-0.6728061224489822 3.19344387755102,-0.22280612244898207 L 2.60844387755102,0.3621938775510183 C 2.1584438775510204,0.8121938775510182 2.15844387755102,1.5096938775510182 2.60844387755102,1.9596938775510184 L 3.21594387755102,2.567193877551018 C 3.66594387755102,3.0171938775510174 4.3634438775510205,3.0171938775510174 4.81344387755102,2.567193877551018 L 5.398443877551021,1.9596938775510184 C 5.84844387755102,1.5096938775510182 5.84844387755102,0.8121938775510182 5.398443877551021,0.36219387755101806 L 4.790943877551021,-0.2228061224489819" stroke-linejoin="round"/>', '<path class="dot" d="M 3.7909438775510207,0.7771938775510179 L 3.79094387755102,0.7771938775510179 C 3.3409438775510196,0.3271938775510179 2.64344387755102,0.3271938775510178 2.19344387755102,0.7771938775510179 L 1.60844387755102,1.3621938775510183 C 1.15844387755102,1.8121938775510182 1.15844387755102,2.509693877551018 1.60844387755102,2.959693877551018 L 2.2159438775510196,3.567193877551018 C 2.66594387755102,4.017193877551017 3.3634438775510196,4.017193877551017 3.8134438775510198,3.567193877551018 L 4.398443877551021,2.959693877551018 C 4.84844387755102,2.509693877551018 4.84844387755102,1.8121938775510182 4.398443877551021,1.362193877551018 L 3.7909438775510207,0.7771938775510181" stroke-linejoin="round"/>', '<path class="dot" d="M 2.7909438775510207,2.7771938775510177 L 2.79094387755102,2.7771938775510177 C 2.3409438775510196,2.327193877551018 1.6434438775510198,2.3271938775510175 1.19344387755102,2.7771938775510177 L 0.6084438775510199,3.362193877551018 C 0.15844387755101996,3.8121938775510182 0.15844387755101985,4.509693877551018 0.6084438775510199,4.959693877551018 L 1.2159438775510198,5.567193877551018 C 1.6659438775510198,6.017193877551017 2.3634438775510196,6.017193877551017 2.8134438775510198,5.567193877551018 L 3.3984438775510206,4.959693877551018 C 3.84844387755102,4.509693877551018 3.84844387755102,3.8121938775510182 3.3984438775510206,3.362193877551018 L 2.7909438775510207,2.777193877551018" stroke-linejoin="round"/>', '<path class="dot" d="M 2.7909438775510207,4.777193877551018 L 2.79094387755102,4.777193877551018 C 2.3409438775510196,4.327193877551018 1.6434438775510198,4.327193877551018 1.19344387755102,4.777193877551018 L 0.6084438775510199,5.362193877551018 C 0.15844387755101996,5.812193877551018 0.15844387755101985,6.509693877551018 0.6084438775510199,6.959693877551018 L 1.2159438775510198,7.567193877551018 C 1.6659438775510198,8.017193877551017 2.3634438775510196,8.017193877551017 2.8134438775510198,7.567193877551018 L 3.3984438775510206,6.959693877551018 C 3.84844387755102,6.509693877551018 3.84844387755102,5.812193877551018 3.3984438775510206,5.362193877551018 L 2.7909438775510207,4.777193877551018" stroke-linejoin="round"/>', '<path class="dot" d="M 3.7909438775510207,6.777193877551018 L 3.79094387755102,6.777193877551018 C 3.3409438775510196,6.327193877551018 2.64344387755102,6.327193877551018 2.19344387755102,6.777193877551018 L 1.60844387755102,7.362193877551018 C 1.15844387755102,7.812193877551018 1.15844387755102,8.509693877551019 1.60844387755102,8.959693877551018 L 2.2159438775510196,9.567193877551018 C 2.66594387755102,10.017193877551017 3.3634438775510196,10.017193877551017 3.8134438775510198,9.567193877551018 L 4.398443877551021,8.959693877551018 C 4.84844387755102,8.509693877551019 4.84844387755102,7.812193877551018 4.398443877551021,7.362193877551018 L 3.7909438775510207,6.777193877551018" stroke-linejoin="round"/>', '<path class="dot" d="M 4.790943877551021,6.777193877551018 L 4.79094387755102,6.777193877551018 C 4.34094387755102,6.327193877551018 3.64344387755102,6.327193877551018 3.19344387755102,6.777193877551018 L 2.60844387755102,7.362193877551018 C 2.1584438775510204,7.812193877551018 2.15844387755102,8.509693877551019 2.60844387755102,8.959693877551018 L 3.21594387755102,9.567193877551018 C 3.66594387755102,10.017193877551017 4.3634438775510205,10.017193877551017 4.81344387755102,9.567193877551018 L 5.398443877551021,8.959693877551018 C 5.84844387755102,8.509693877551019 5.84844387755102,7.812193877551018 5.398443877551021,7.362193877551018 L 4.790943877551021,6.777193877551018" stroke-linejoin="round"/>', '<path class="dot" d="M 5.790943877551021,5.777193877551018 L 5.79094387755102,5.777193877551018 C 5.34094387755102,5.327193877551018 4.64344387755102,5.327193877551018 4.1934438775510205,5.777193877551018 L 3.60844387755102,6.362193877551018 C 3.1584438775510204,6.812193877551018 3.15844387755102,7.509693877551018 3.60844387755102,7.959693877551018 L 4.21594387755102,8.567193877551018 C 4.66594387755102,9.017193877551017 5.3634438775510205,9.017193877551017 5.81344387755102,8.567193877551018 L 6.398443877551021,7.959693877551018 C 6.84844387755102,7.509693877551018 6.84844387755102,6.812193877551018 6.398443877551021,6.362193877551018 L 5.790943877551021,5.777193877551018" stroke-linejoin="round"/>', '<path class="dot" d="M 6.790943877551021,3.7771938775510177 L 6.79094387755102,3.7771938775510177 C 6.34094387755102,3.327193877551018 5.64344387755102,3.3271938775510175 5.1934438775510205,3.7771938775510177 L 4.608443877551021,4.362193877551018 C 4.15844387755102,4.812193877551018 4.15844387755102,5.509693877551018 4.608443877551021,5.959693877551018 L 5.21594387755102,6.567193877551018 C 5.66594387755102,7.017193877551017 6.3634438775510205,7.017193877551017 6.81344387755102,6.567193877551018 L 7.398443877551021,5.959693877551018 C 7.84844387755102,5.509693877551018 7.84844387755102,4.812193877551018 7.398443877551021,4.362193877551018 L 6.790943877551021,3.777193877551018" stroke-linejoin="round"/>', '<path class="dot" d="M 6.790943877551021,1.7771938775510179 L 6.79094387755102,1.7771938775510179 C 6.34094387755102,1.327193877551018 5.64344387755102,1.327193877551018 5.1934438775510205,1.7771938775510179 L 4.608443877551021,2.362193877551018 C 4.15844387755102,2.8121938775510182 4.15844387755102,3.509693877551018 4.608443877551021,3.959693877551018 L 5.21594387755102,4.567193877551018 C 5.66594387755102,5.017193877551017 6.3634438775510205,5.017193877551017 6.81344387755102,4.567193877551018 L 7.398443877551021,3.959693877551018 C 7.84844387755102,3.509693877551018 7.84844387755102,2.8121938775510182 7.398443877551021,2.362193877551018 L 6.790943877551021,1.777193877551018" stroke-linejoin="round"/>', '<path class="dot" d="M 5.790943877551021,-0.22280612244898207 L 5.79094387755102,-0.22280612244898207 C 5.34094387755102,-0.6728061224489821 4.64344387755102,-0.6728061224489822 4.1934438775510205,-0.22280612244898207 L 3.60844387755102,0.3621938775510183 C 3.1584438775510204,0.8121938775510182 3.15844387755102,1.5096938775510182 3.60844387755102,1.9596938775510184 L 4.21594387755102,2.567193877551018 C 4.66594387755102,3.0171938775510174 5.3634438775510205,3.0171938775510174 5.81344387755102,2.567193877551018 L 6.398443877551021,1.9596938775510184 C 6.84844387755102,1.5096938775510182 6.84844387755102,0.8121938775510182 6.398443877551021,0.36219387755101806 L 5.790943877551021,-0.2228061224489819" stroke-linejoin="round"/>', '<path class="dot" d="M 5.790943877551021,-0.22280612244898207 L 5.79094387755102,-0.22280612244898207 C 5.34094387755102,-0.6728061224489821 4.64344387755102,-0.6728061224489822 4.1934438775510205,-0.22280612244898207 L 3.60844387755102,0.3621938775510183 C 3.1584438775510204,0.8121938775510182 3.15844387755102,1.5096938775510182 3.60844387755102,1.9596938775510184 L 4.21594387755102,2.567193877551018 C 4.66594387755102,3.0171938775510174 5.3634438775510205,3.0171938775510174 5.81344387755102,2.567193877551018 L 6.398443877551021,1.9596938775510184 C 6.84844387755102,1.5096938775510182 6.84844387755102,0.8121938775510182 6.398443877551021,0.36219387755101806 L 5.790943877551021,-0.2228061224489819" stroke-linejoin="round"/>', '<path class="dot" d="M 6.790943877551021,0.7771938775510179 L 6.79094387755102,0.7771938775510179 C 6.34094387755102,0.3271938775510179 5.64344387755102,0.3271938775510178 5.1934438775510205,0.7771938775510179 L 4.608443877551021,1.3621938775510183 C 4.15844387755102,1.8121938775510182 4.15844387755102,2.509693877551018 4.608443877551021,2.959693877551018 L 5.21594387755102,3.567193877551018 C 5.66594387755102,4.017193877551017 6.3634438775510205,4.017193877551017 6.81344387755102,3.567193877551018 L 7.398443877551021,2.959693877551018 C 7.84844387755102,2.509693877551018 7.84844387755102,1.8121938775510182 7.398443877551021,1.362193877551018 L 6.790943877551021,0.7771938775510181" stroke-linejoin="round"/>', '<path class="dot" d="M 8.79094387755102,1.7771938775510179 L 8.790943877551019,1.7771938775510179 C 8.34094387755102,1.327193877551018 7.64344387755102,1.327193877551018 7.1934438775510205,1.7771938775510179 L 6.608443877551021,2.362193877551018 C 6.15844387755102,2.8121938775510182 6.15844387755102,3.509693877551018 6.608443877551021,3.959693877551018 L 7.21594387755102,4.567193877551018 C 7.66594387755102,5.017193877551017 8.36344387755102,5.017193877551017 8.81344387755102,4.567193877551018 L 9.39844387755102,3.959693877551018 C 9.84844387755102,3.509693877551018 9.84844387755102,2.8121938775510182 9.39844387755102,2.362193877551018 L 8.79094387755102,1.777193877551018" stroke-linejoin="round"/>', '<path class="dot" d="M 9.79094387755102,1.7771938775510179 L 9.790943877551019,1.7771938775510179 C 9.34094387755102,1.327193877551018 8.64344387755102,1.327193877551018 8.19344387755102,1.7771938775510179 L 7.608443877551021,2.362193877551018 C 7.15844387755102,2.8121938775510182 7.15844387755102,3.509693877551018 7.608443877551021,3.959693877551018 L 8.21594387755102,4.567193877551018 C 8.66594387755102,5.017193877551017 9.36344387755102,5.017193877551017 9.81344387755102,4.567193877551018 L 10.39844387755102,3.959693877551018 C 10.84844387755102,3.509693877551018 10.84844387755102,2.8121938775510182 10.39844387755102,2.362193877551018 L 9.79094387755102,1.777193877551018" stroke-linejoin="round"/>', '<path class="dot" d="M 11.790943877551019,0.7771938775510179 L 11.790943877551019,0.7771938775510179 C 11.34094387755102,0.3271938775510179 10.64344387755102,0.3271938775510178 10.193443877551019,0.7771938775510179 L 9.60844387755102,1.3621938775510183 C 9.158443877551019,1.8121938775510182 9.158443877551019,2.509693877551018 9.60844387755102,2.959693877551018 L 10.21594387755102,3.567193877551018 C 10.665943877551019,4.017193877551017 11.363443877551019,4.017193877551017 11.81344387755102,3.567193877551018 L 12.39844387755102,2.959693877551018 C 12.84844387755102,2.509693877551018 12.84844387755102,1.8121938775510182 12.39844387755102,1.362193877551018 L 11.790943877551019,0.7771938775510181" stroke-linejoin="round"/>', '<path class="dot" d="M 10.790943877551019,13.777193877551019 L 10.790943877551019,13.777193877551019 C 10.34094387755102,13.327193877551018 9.64344387755102,13.327193877551018 9.193443877551019,13.777193877551019 L 8.60844387755102,14.362193877551018 C 8.158443877551019,14.81219387755102 8.158443877551019,15.509693877551019 8.60844387755102,15.959693877551018 L 9.21594387755102,16.56719387755102 C 9.665943877551019,17.01719387755102 10.363443877551019,17.01719387755102 10.81344387755102,16.56719387755102 L 11.39844387755102,15.959693877551018 C 11.84844387755102,15.509693877551019 11.84844387755102,14.81219387755102 11.39844387755102,14.362193877551018 L 10.790943877551019,13.777193877551019" stroke-linejoin="round"/>', '<path class="dot" d="M 9.79094387755102,14.777193877551019 L 9.790943877551019,14.777193877551019 C 9.34094387755102,14.327193877551018 8.64344387755102,14.327193877551018 8.19344387755102,14.777193877551019 L 7.608443877551021,15.362193877551018 C 7.15844387755102,15.81219387755102 7.15844387755102,16.50969387755102 7.608443877551021,16.959693877551018 L 8.21594387755102,17.56719387755102 C 8.66594387755102,18.01719387755102 9.36344387755102,18.01719387755102 9.81344387755102,17.56719387755102 L 10.39844387755102,16.959693877551018 C 10.84844387755102,16.50969387755102 10.84844387755102,15.81219387755102 10.39844387755102,15.362193877551018 L 9.79094387755102,14.777193877551019" stroke-linejoin="round"/>', '<path class="dot" d="M 8.79094387755102,16.777193877551017 L 8.790943877551019,16.777193877551017 C 8.34094387755102,16.327193877551018 7.64344387755102,16.327193877551018 7.1934438775510205,16.777193877551017 L 6.608443877551021,17.362193877551018 C 6.15844387755102,17.812193877551017 6.15844387755102,18.50969387755102 6.608443877551021,18.959693877551018 L 7.21594387755102,19.56719387755102 C 7.66594387755102,20.01719387755102 8.36344387755102,20.01719387755102 8.81344387755102,19.56719387755102 L 9.39844387755102,18.959693877551018 C 9.84844387755102,18.50969387755102 9.84844387755102,17.812193877551017 9.39844387755102,17.362193877551018 L 8.79094387755102,16.777193877551017" stroke-linejoin="round"/>', '<path class="dot" d="M 8.79094387755102,18.777193877551017 L 8.790943877551019,18.777193877551017 C 8.34094387755102,18.327193877551018 7.64344387755102,18.327193877551018 7.1934438775510205,18.777193877551017 L 6.608443877551021,19.362193877551018 C 6.15844387755102,19.812193877551017 6.15844387755102,20.50969387755102 6.608443877551021,20.959693877551018 L 7.21594387755102,21.56719387755102 C 7.66594387755102,22.01719387755102 8.36344387755102,22.01719387755102 8.81344387755102,21.56719387755102 L 9.39844387755102,20.959693877551018 C 9.84844387755102,20.50969387755102 9.84844387755102,19.812193877551017 9.39844387755102,19.362193877551018 L 8.79094387755102,18.777193877551017" stroke-linejoin="round"/>', '<path class="dot" d="M 9.79094387755102,20.777193877551017 L 9.790943877551019,20.777193877551017 C 9.34094387755102,20.327193877551018 8.64344387755102,20.327193877551018 8.19344387755102,20.777193877551017 L 7.608443877551021,21.362193877551018 C 7.15844387755102,21.812193877551017 7.15844387755102,22.50969387755102 7.608443877551021,22.959693877551018 L 8.21594387755102,23.56719387755102 C 8.66594387755102,24.01719387755102 9.36344387755102,24.01719387755102 9.81344387755102,23.56719387755102 L 10.39844387755102,22.959693877551018 C 10.84844387755102,22.50969387755102 10.84844387755102,21.812193877551017 10.39844387755102,21.362193877551018 L 9.79094387755102,20.777193877551017" stroke-linejoin="round"/>', '<path class="dot" d="M 10.790943877551019,20.777193877551017 L 10.790943877551019,20.777193877551017 C 10.34094387755102,20.327193877551018 9.64344387755102,20.327193877551018 9.193443877551019,20.777193877551017 L 8.60844387755102,21.362193877551018 C 8.158443877551019,21.812193877551017 8.158443877551019,22.50969387755102 8.60844387755102,22.959693877551018 L 9.21594387755102,23.56719387755102 C 9.665943877551019,24.01719387755102 10.363443877551019,24.01719387755102 10.81344387755102,23.56719387755102 L 11.39844387755102,22.959693877551018 C 11.84844387755102,22.50969387755102 11.84844387755102,21.812193877551017 11.39844387755102,21.362193877551018 L 10.790943877551019,20.777193877551017" stroke-linejoin="round"/>', '<path class="dot" d="M 11.790943877551019,19.777193877551017 L 11.790943877551019,19.777193877551017 C 11.34094387755102,19.327193877551018 10.64344387755102,19.327193877551018 10.193443877551019,19.777193877551017 L 9.60844387755102,20.362193877551018 C 9.158443877551019,20.812193877551017 9.158443877551019,21.50969387755102 9.60844387755102,21.959693877551018 L 10.21594387755102,22.56719387755102 C 10.665943877551019,23.01719387755102 11.363443877551019,23.01719387755102 11.81344387755102,22.56719387755102 L 12.39844387755102,21.959693877551018 C 12.84844387755102,21.50969387755102 12.84844387755102,20.812193877551017 12.39844387755102,20.362193877551018 L 11.790943877551019,19.777193877551017" stroke-linejoin="round"/>', '<path class="dot" d="M 12.790943877551019,17.777193877551017 L 12.790943877551019,17.777193877551017 C 12.34094387755102,17.327193877551018 11.64344387755102,17.327193877551018 11.193443877551019,17.777193877551017 L 10.60844387755102,18.362193877551018 C 10.158443877551019,18.812193877551017 10.158443877551019,19.50969387755102 10.60844387755102,19.959693877551018 L 11.21594387755102,20.56719387755102 C 11.665943877551019,21.01719387755102 12.363443877551019,21.01719387755102 12.81344387755102,20.56719387755102 L 13.39844387755102,19.959693877551018 C 13.84844387755102,19.50969387755102 13.84844387755102,18.812193877551017 13.39844387755102,18.362193877551018 L 12.790943877551019,17.777193877551017" stroke-linejoin="round"/>', '<path class="dot" d="M 12.790943877551019,15.777193877551019 L 12.790943877551019,15.777193877551019 C 12.34094387755102,15.327193877551018 11.64344387755102,15.327193877551018 11.193443877551019,15.777193877551019 L 10.60844387755102,16.362193877551018 C 10.158443877551019,16.812193877551017 10.158443877551019,17.50969387755102 10.60844387755102,17.959693877551018 L 11.21594387755102,18.56719387755102 C 11.665943877551019,19.01719387755102 12.363443877551019,19.01719387755102 12.81344387755102,18.56719387755102 L 13.39844387755102,17.959693877551018 C 13.84844387755102,17.50969387755102 13.84844387755102,16.812193877551017 13.39844387755102,16.362193877551018 L 12.790943877551019,15.777193877551019" stroke-linejoin="round"/>', '<path class="dot" d="M 11.706959877551022,13.777193877551019 L 11.70695987755102,13.777193877551019 C 11.25695987755102,13.327193877551018 10.55945987755102,13.327193877551018 10.10945987755102,13.777193877551019 L 9.52445987755102,14.362193877551018 C 9.07445987755102,14.81219387755102 9.07445987755102,15.509693877551019 9.52445987755102,15.959693877551018 L 10.13195987755102,16.56719387755102 C 10.58195987755102,17.01719387755102 11.27945987755102,17.01719387755102 11.729459877551019,16.56719387755102 L 12.31445987755102,15.959693877551018 C 12.76445987755102,15.509693877551019 12.76445987755102,14.81219387755102 12.31445987755102,14.362193877551018 L 11.706959877551022,13.777193877551019" stroke-linejoin="round"/>', '<path class="dot" d="M 10.790943877551019,13.777193877551019 L 10.790943877551019,13.777193877551019 C 10.34094387755102,13.327193877551018 9.64344387755102,13.327193877551018 9.193443877551019,13.777193877551019 L 8.60844387755102,14.362193877551018 C 8.158443877551019,14.81219387755102 8.158443877551019,15.509693877551019 8.60844387755102,15.959693877551018 L 9.21594387755102,16.56719387755102 C 9.665943877551019,17.01719387755102 10.363443877551019,17.01719387755102 10.81344387755102,16.56719387755102 L 11.39844387755102,15.959693877551018 C 11.84844387755102,15.509693877551019 11.84844387755102,14.81219387755102 11.39844387755102,14.362193877551018 L 10.790943877551019,13.777193877551019" stroke-linejoin="round"/>']
            
            
            <path d="M 1.9865591766985489,21.99358905614589 L 12.01342832330145,1.0064109438541102" fill="none"
            stroke="black"
            stroke-width="2.5"
            stroke-linecap="round"
            stroke-linejoin="round"
            />
            
            <path d="M 4.0,1.0 L 3.0,2.0 L 2.0,4.0 L 2.0,6.0 L 3.0,8.0 L 4.0,8.0 L 5.0,7.0 L 6.0,5.0 L 6.0,3.0 L 5.0,1.0 L 4.0,1.0 M 5.0,1.0 L 6.0,2.0 L 8.0,3.0 L 9.0,3.0 L 11.0,2.0 L 12.0,1.0 M 10.0,15.0 L 9.0,16.0 L 8.0,18.0 L 8.0,20.0 L 9.0,22.0 L 10.0,22.0 L 11.0,21.0 L 12.0,19.0 L 12.0,17.0 L 10.916016,15.0 L 10.0,15.0" fill="none"
            stroke="black"
            stroke-width="2.5"
            stroke-linecap="round"
            stroke-linejoin="round"
            />
            
            
        </svg>