<?xml version="1.0"?><!DOCTYPE svg PUBLIC "-//W3C//DTD SVG 1.1//EN" "http://www.w3.org/Graphics/SVG/1.1/DTD/svg11.dtd"><svg xmlns="http://www.w3.org/2000/svg" xmlns:xlink="http://www.w3.org/1999/xlink" width="350" height="1000" viewBox="0 0 7 17" >
            
                ['<path class="dot" d="M 3.885,0.32917079999999843 L 3.885,0.32917079999999843 C 3.6649999999999996,0.10917079999999835 3.324,0.10917079999999832 3.1039999999999996,0.32917079999999843 L 2.8179999999999996,0.6151707999999986 C 2.5979999999999994,0.8351707999999985 2.5979999999999994,1.1761707999999986 2.8179999999999996,1.3961707999999986 L 3.1149999999999993,1.6931707999999983 C 3.3349999999999995,1.9131707999999983 3.6759999999999997,1.9131707999999983 3.8959999999999995,1.6931707999999983 L 4.182,1.3961707999999986 C 4.402,1.1761707999999984 4.402,0.8351707999999985 4.182,0.6151707999999985 L 3.885,0.32917079999999843" stroke-linejoin="round"/>', '<path class="dot" d="M 2.885,1.3180003999999985 L 2.885,1.3180003999999985 C 2.665,1.0980003999999983 2.324,1.0980003999999983 2.1039999999999996,1.3180003999999985 L 1.8179999999999998,1.6040003999999985 C 1.5979999999999999,1.8240003999999987 1.5979999999999996,2.1650003999999985 1.8179999999999998,2.3850003999999987 L 2.1149999999999998,2.6820003999999984 C 2.335,2.9020003999999986 2.676,2.9020003999999986 2.896,2.6820003999999984 L 3.1820000000000004,2.3850003999999987 C 3.402,2.1650003999999985 3.402,1.8240003999999987 3.1820000000000004,1.6040003999999985 L 2.885,1.3180003999999985" stroke-linejoin="round"/>', '<path class="dot" d="M 1.885,3.3180003999999985 L 1.8849999999999998,3.3180003999999985 C 1.6649999999999998,3.0980003999999983 1.3239999999999998,3.0980003999999983 1.1039999999999999,3.3180003999999985 L 0.8179999999999998,3.6040003999999985 C 0.5979999999999998,3.8240003999999987 0.5979999999999998,4.1650003999999985 0.8179999999999998,4.385000399999999 L 1.1149999999999998,4.682000399999998 C 1.3349999999999997,4.902000399999999 1.676,4.902000399999999 1.8959999999999997,4.682000399999998 L 2.1820000000000004,4.385000399999999 C 2.402,4.1650003999999985 2.402,3.8240003999999987 2.1820000000000004,3.6040003999999985 L 1.885,3.3180003999999985" stroke-linejoin="round"/>', '<path class="dot" d="M 1.885,7.318000399999998 L 1.8849999999999998,7.318000399999998 C 1.6649999999999998,7.098000399999998 1.3239999999999998,7.098000399999998 1.1039999999999999,7.318000399999998 L 0.8179999999999998,7.6040003999999985 C 0.5979999999999998,7.824000399999998 0.5979999999999998,8.165000399999998 0.8179999999999998,8.3850004 L 1.1149999999999998,8.682000399999998 C 1.3349999999999997,8.902000399999999 1.676,8.902000399999999 1.8959999999999997,8.682000399999998 L 2.1820000000000004,8.3850004 C 2.402,8.165000399999998 2.402,7.824000399999998 2.1820000000000004,7.6040003999999985 L 1.885,7.318000399999998" stroke-linejoin="round"/>', '<path class="dot" d="M 2.885,9.318000399999999 L 2.885,9.318000399999999 C 2.665,9.0980004 2.324,9.0980004 2.1039999999999996,9.318000399999999 L 1.8179999999999998,9.6040004 C 1.5979999999999999,9.8240004 1.5979999999999996,10.1650004 1.8179999999999998,10.3850004 L 2.1149999999999998,10.6820004 C 2.335,10.9020004 2.676,10.9020004 2.896,10.6820004 L 3.1820000000000004,10.3850004 C 3.402,10.1650004 3.402,9.8240004 3.1820000000000004,9.6040004 L 2.885,9.318000399999999" stroke-linejoin="round"/>', '<path class="dot" d="M 3.885,10.318 L 3.885,10.318 C 3.6649999999999996,10.098 3.324,10.098 3.1039999999999996,10.318 L 2.8179999999999996,10.604000000000001 C 2.5979999999999994,10.824 2.5979999999999994,11.165000000000001 2.8179999999999996,11.385000000000002 L 3.1149999999999993,11.682 C 3.3349999999999995,11.902000000000001 3.6759999999999997,11.902000000000001 3.8959999999999995,11.682 L 4.182,11.385000000000002 C 4.402,11.165000000000001 4.402,10.824 4.182,10.604000000000001 L 3.885,10.318000000000001" stroke-linejoin="round"/>', '<path class="dot" d="M 4.885,9.318000399999999 L 4.885,9.318000399999999 C 4.664999999999999,9.0980004 4.324,9.0980004 4.103999999999999,9.318000399999999 L 3.8179999999999996,9.6040004 C 3.5979999999999994,9.8240004 3.5979999999999994,10.1650004 3.8179999999999996,10.3850004 L 4.114999999999999,10.6820004 C 4.334999999999999,10.9020004 4.676,10.9020004 4.895999999999999,10.6820004 L 5.182,10.3850004 C 5.402,10.1650004 5.402,9.8240004 5.182,9.6040004 L 4.885,9.318000399999999" stroke-linejoin="round"/>', '<path class="dot" d="M 5.885,7.3180004 L 5.885,7.3180004 C 5.664999999999999,7.0980004 5.324,7.0980004 5.103999999999999,7.3180004 L 4.818,7.6040004 C 4.598,7.8240004 4.598,8.1650004 4.818,8.3850004 L 5.114999999999999,8.6820004 C 5.334999999999999,8.9020004 5.676,8.9020004 5.895999999999999,8.6820004 L 6.182,8.3850004 C 6.402,8.1650004 6.402,7.8240004 6.182,7.6040004 L 5.885,7.3180004" stroke-linejoin="round"/>', '<path class="dot" d="M 5.885,3.3180003999999994 L 5.885,3.3180003999999994 C 5.664999999999999,3.098000399999999 5.324,3.098000399999999 5.103999999999999,3.3180003999999994 L 4.818,3.6040003999999994 C 4.598,3.8240003999999996 4.598,4.165000399999999 4.818,4.385000399999999 L 5.114999999999999,4.6820004 C 5.334999999999999,4.9020003999999995 5.676,4.9020003999999995 5.895999999999999,4.6820004 L 6.182,4.385000399999999 C 6.402,4.165000399999999 6.402,3.8240003999999996 6.182,3.6040003999999994 L 5.885,3.3180003999999994" stroke-linejoin="round"/>', '<path class="dot" d="M 4.885,1.3180003999999994 L 4.885,1.3180003999999994 C 4.664999999999999,1.0980003999999992 4.324,1.0980003999999992 4.103999999999999,1.3180003999999994 L 3.8179999999999996,1.6040003999999994 C 3.5979999999999994,1.8240003999999996 3.5979999999999994,2.1650003999999994 3.8179999999999996,2.3850003999999996 L 4.114999999999999,2.6820003999999993 C 4.334999999999999,2.9020003999999995 4.676,2.9020003999999995 4.895999999999999,2.6820003999999993 L 5.182,2.3850003999999996 C 5.402,2.1650003999999994 5.402,1.8240003999999996 5.182,1.6040003999999994 L 4.885,1.3180003999999994" stroke-linejoin="round"/>', '<path class="dot" d="M 3.885,0.3068299999999984 L 3.885,0.3068299999999984 C 3.6649999999999996,0.0868299999999983 3.324,0.08682999999999827 3.1039999999999996,0.3068299999999984 L 2.8179999999999996,0.5928299999999985 C 2.5979999999999994,0.8128299999999985 2.5979999999999994,1.1538299999999986 2.8179999999999996,1.3738299999999986 L 3.1149999999999993,1.6708299999999983 C 3.3349999999999995,1.8908299999999982 3.6759999999999997,1.8908299999999982 3.8959999999999995,1.6708299999999983 L 4.182,1.3738299999999986 C 4.402,1.1538299999999984 4.402,0.8128299999999985 4.182,0.5928299999999984 L 3.885,0.3068299999999984" stroke-linejoin="round"/>']
            
                ['<path class="dot" d="M 6.885,-2.682 L 6.885,-2.682 C 6.664999999999999,-2.902 6.324,-2.902 6.103999999999999,-2.682 L 5.818,-2.396 C 5.598,-2.1759999999999997 5.598,-1.8349999999999997 5.818,-1.6149999999999998 L 6.114999999999999,-1.318 C 6.334999999999999,-1.098 6.676,-1.098 6.895999999999999,-1.318 L 7.182,-1.6149999999999998 C 7.402,-1.835 7.402,-2.1759999999999997 7.182,-2.396 L 6.885,-2.682" stroke-linejoin="round"/>', '<path class="dot" d="M 5.885,-1.682 L 5.885,-1.682 C 5.664999999999999,-1.9020000000000001 5.324,-1.9020000000000001 5.103999999999999,-1.682 L 4.818,-1.396 C 4.598,-1.1759999999999997 4.598,-0.8349999999999997 4.818,-0.6149999999999998 L 5.114999999999999,-0.31800000000000006 C 5.334999999999999,-0.09800000000000009 5.676,-0.09800000000000009 5.895999999999999,-0.31800000000000006 L 6.182,-0.6149999999999998 C 6.402,-0.835 6.402,-1.1759999999999997 6.182,-1.396 L 5.885,-1.682" stroke-linejoin="round"/>', '<path class="dot" d="M 4.885,-2.682 L 4.885,-2.682 C 4.664999999999999,-2.902 4.324,-2.902 4.103999999999999,-2.682 L 3.8179999999999996,-2.396 C 3.5979999999999994,-2.1759999999999997 3.5979999999999994,-1.8349999999999997 3.8179999999999996,-1.6149999999999998 L 4.114999999999999,-1.318 C 4.334999999999999,-1.098 4.676,-1.098 4.895999999999999,-1.318 L 5.182,-1.6149999999999998 C 5.402,-1.835 5.402,-2.1759999999999997 5.182,-2.396 L 4.885,-2.682" stroke-linejoin="round"/>', '<path class="dot" d="M 5.885,-3.682 L 5.885,-3.682 C 5.664999999999999,-3.902 5.324,-3.902 5.103999999999999,-3.682 L 4.818,-3.396 C 4.598,-3.1759999999999997 4.598,-2.835 4.818,-2.6149999999999998 L 5.114999999999999,-2.318 C 5.334999999999999,-2.098 5.676,-2.098 5.895999999999999,-2.318 L 6.182,-2.6149999999999998 C 6.402,-2.835 6.402,-3.1759999999999997 6.182,-3.396 L 5.885,-3.682" stroke-linejoin="round"/>', '<path class="dot" d="M 2.885,-2.682 L 2.885,-2.682 C 2.665,-2.902 2.324,-2.902 2.1039999999999996,-2.682 L 1.8179999999999998,-2.396 C 1.5979999999999999,-2.1759999999999997 1.5979999999999996,-1.8349999999999997 1.8179999999999998,-1.6149999999999998 L 2.1149999999999998,-1.318 C 2.335,-1.098 2.676,-1.098 2.896,-1.318 L 3.1820000000000004,-1.6149999999999998 C 3.402,-1.835 3.402,-2.1759999999999997 3.1820000000000004,-2.396 L 2.885,-2.682" stroke-linejoin="round"/>', '<path class="dot" d="M 1.885,-1.682 L 1.8849999999999998,-1.682 C 1.6649999999999998,-1.9020000000000001 1.3239999999999998,-1.9020000000000001 1.1039999999999999,-1.682 L 0.8179999999999998,-1.396 C 0.5979999999999998,-1.1759999999999997 0.5979999999999998,-0.8349999999999997 0.8179999999999998,-0.6149999999999998 L 1.1149999999999998,-0.31800000000000006 C 1.3349999999999997,-0.09800000000000009 1.676,-0.09800000000000009 1.8959999999999997,-0.31800000000000006 L 2.1820000000000004,-0.6149999999999998 C 2.402,-0.835 2.402,-1.1759999999999997 2.1820000000000004,-1.396 L 1.885,-1.682" stroke-linejoin="round"/>', '<path class="dot" d="M 0.885,-2.6820002 L 0.8849999999999998,-2.6820002 C 0.6649999999999998,-2.9020002000000003 0.32399999999999984,-2.9020002000000003 0.10399999999999981,-2.6820002 L -0.1820000000000002,-2.3960002 C -0.40200000000000025,-2.1760002 -0.40200000000000025,-1.8350001999999999 -0.1820000000000002,-1.6150001999999999 L 0.11499999999999977,-1.3180002000000002 C 0.33499999999999974,-1.0980002000000002 0.6759999999999999,-1.0980002000000002 0.8959999999999997,-1.3180002000000002 L 1.1820000000000002,-1.6150001999999999 C 1.4020000000000001,-1.8350002 1.4020000000000001,-2.1760002 1.1820000000000002,-2.3960002 L 0.885,-2.6820002" stroke-linejoin="round"/>', '<path class="dot" d="M 1.885,-3.682 L 1.8849999999999998,-3.682 C 1.6649999999999998,-3.902 1.3239999999999998,-3.902 1.1039999999999999,-3.682 L 0.8179999999999998,-3.396 C 0.5979999999999998,-3.1759999999999997 0.5979999999999998,-2.835 0.8179999999999998,-2.6149999999999998 L 1.1149999999999998,-2.318 C 1.3349999999999997,-2.098 1.676,-2.098 1.8959999999999997,-2.318 L 2.1820000000000004,-2.6149999999999998 C 2.402,-2.835 2.402,-3.1759999999999997 2.1820000000000004,-3.396 L 1.885,-3.682" stroke-linejoin="round"/>', '<path class="dot" d="M 2.885,-2.682 L 2.885,-2.682 C 2.665,-2.902 2.324,-2.902 2.1039999999999996,-2.682 L 1.8179999999999998,-2.396 C 1.5979999999999999,-2.1759999999999997 1.5979999999999996,-1.8349999999999997 1.8179999999999998,-1.6149999999999998 L 2.1149999999999998,-1.318 C 2.335,-1.098 2.676,-1.098 2.896,-1.318 L 3.1820000000000004,-1.6149999999999998 C 3.402,-1.835 3.402,-2.1759999999999997 3.1820000000000004,-2.396 L 2.885,-2.682" stroke-linejoin="round"/>']
            
            
            <path d="M 3.5,1.0111707999999984 L 2.5,2.0000003999999985 L 1.5,4.0000003999999985 L 1.5,8.000000399999998 L 2.5,10.0000004 L 3.5,11.0 L 4.5,10.0000004 L 5.5,8.0000004 L 5.5,4.000000399999999 L 4.5,2.0000003999999993 L 3.5,0.9888299999999983" fill="none"
            stroke="black"
            stroke-width="1"
            stroke-linecap="round"
            stroke-linejoin="round"
            />
            
            <path d="M 6.5,-2.0 L 5.5,-1.0 L 4.5,-2.0 L 5.5,-3.0 L 6.5,-2.0 M 2.5,-2.0 L 1.5,-1.0 L 0.5,-2.0000002 L 1.5,-3.0 L 2.5,-2.0" fill="none"
            stroke="black"
            stroke-width="1"
            stroke-linecap="round"
            stroke-linejoin="round"
            />
            
            
        </svg>