<?xml version="1.0" encoding="UTF-8" standalone="no"?>
<svg
   data-dec="79"
   width="14"
   height="40"
   version="1.1"
   id="svg1"
   xmlns="http://www.w3.org/2000/svg"
   xmlns:svg="http://www.w3.org/2000/svg">
  <defs
     id="defs1" />
  <path
     d="m -20,1 -1,1 -2,4 -1,3 v 5 l 1,3 2,4 1,1 h 2 l 1,-1 2,-4 1,-3 V 9 l -1,-3 -2,-4 -1,-1 h -2"
     style="fill:none;stroke:none;stroke-width:2;stroke-linecap:round;stroke-linejoin:round"
     id="path1" />
  <path
     d="M 6,1 4,2 3,4 2,9 v 5 l 1,5 1,2 2,1 h 2 l 2,-1 1,-2 1,-5 V 9 L 11,4 10,2 8,1 H 6"
     style="fill:none;stroke:none;stroke-width:2;stroke-linecap:round;stroke-linejoin:round"
     id="path1-2" />
  <path
     d="M -8.6818181,1 -9.9545453,2 -11.227273,4 -11.863637,6 -12.5,9 v 5 l 0.636363,3 0.636364,2 1.2727277,2 1.2727272,1 h 2.5454545 l 1.2727273,-1 1.2727273,-2 0.636364,-2 0.636363,-3 V 9 L -2.954545,6 -3.590909,4 -4.8636363,2 -6.1363636,1 h -2.5454545"
     style="fill:none;stroke:#000000;stroke-width:2;stroke-linecap:round;stroke-linejoin:round"
     id="path1-7" />
</svg>
