<?xml version="1.0" encoding="UTF-8" standalone="no"?>
<svg
   data-dec="180"
   width="8"
   height="5"
   version="1.1"
   id="svg1"
   xmlns="http://www.w3.org/2000/svg"
   xmlns:svg="http://www.w3.org/2000/svg">
  <defs
     id="defs1" />
  <path
     d="M 7.9999999,0 0,5"
     style="fill:none;stroke:black;stroke-width:.5;stroke-linecap:round;stroke-linejoin:round"
     id="path1" />
</svg>
