<?xml version="1.0" encoding="UTF-8" standalone="no"?>
<svg
   width="10"
   height="26"
   viewBox="0 0 0.4 1.04"
   version="1.1"
   id="svg25"
   xmlns="http://www.w3.org/2000/svg"
   xmlns:svg="http://www.w3.org/2000/svg"><defs
   id="defs25" />

            
                ['', '']
            
                ['', '', '', '', '', '', '', '', '', '']
            
                ['', '', '', '', '', '', '', '', '', '']
            
            
            <path
   d="M 0.08,0.04 V 0.6001078"
   fill="none"
   stroke="black"
   stroke-width="2.5"
   stroke-linecap="round"
   stroke-linejoin="round"
   id="path23-5"
   style="stroke:none" />
<path
   d="M 0.08000001,0.27999681 0.2,0.28 0.28,0.32 0.32,0.4 V 0.48 L 0.28,0.56 0.2,0.6 0.08,0.60010674"
   fill="none"
   stroke="black"
   stroke-width="2.5"
   stroke-linecap="round"
   stroke-linejoin="round"
   id="path24-3"
   style="stroke:none" />
<path
   d="M 0.08,0.03999955 0.2,0.04 0.28,0.08 0.32,0.12 V 0.2 L 0.28,0.24 0.2,0.28 l -0.12000002,-1e-8"
   fill="none"
   stroke="black"
   stroke-width="2.5"
   stroke-linecap="round"
   stroke-linejoin="round"
   id="path25-5"
   style="stroke:none" />
</svg>
