<?xml version="1.0" encoding="UTF-8" standalone="no"?>
<svg
   data-dec="56"
   width="10"
   height="21"
   version="1.1"
   id="svg4"
   sodipodi:docname="huit.svg"
   inkscape:version="1.3.2 (091e20ef0f, 2023-11-25, custom)"
   xmlns:inkscape="http://www.inkscape.org/namespaces/inkscape"
   xmlns:sodipodi="http://sodipodi.sourceforge.net/DTD/sodipodi-0.dtd"
   xmlns="http://www.w3.org/2000/svg"
   xmlns:svg="http://www.w3.org/2000/svg"
   xmlns:rdf="http://www.w3.org/1999/02/22-rdf-syntax-ns#"
   xmlns:cc="http://creativecommons.org/ns#"
   xmlns:dc="http://purl.org/dc/elements/1.1/">
  <metadata
     id="metadata10">
    <rdf:RDF>
      <cc:Work
         rdf:about="">
        <dc:format>image/svg+xml</dc:format>
        <dc:type
           rdf:resource="http://purl.org/dc/dcmitype/StillImage" />
      </cc:Work>
    </rdf:RDF>
  </metadata>
  <defs
     id="defs8" />
  <sodipodi:namedview
     pagecolor="#ffffff"
     bordercolor="#666666"
     borderopacity="1"
     objecttolerance="10"
     gridtolerance="10"
     guidetolerance="10"
     inkscape:pageopacity="0"
     inkscape:pageshadow="2"
     inkscape:window-width="1920"
     inkscape:window-height="1080"
     id="namedview6"
     showgrid="true"
     inkscape:zoom="43.429029"
     inkscape:cx="4.2137714"
     inkscape:cy="12.295923"
     inkscape:window-x="0"
     inkscape:window-y="0"
     inkscape:window-maximized="0"
     inkscape:current-layer="svg4"
     inkscape:showpageshadow="2"
     inkscape:pagecheckerboard="0"
     inkscape:deskcolor="#d1d1d1">
    <inkscape:grid
       type="xygrid"
       id="grid817"
       originx="-2"
       originy="-1"
       spacingy="1"
       spacingx="1"
       units="px"
       visible="true" />
  </sodipodi:namedview>
  <path
     id="path2"
     style="fill:none;stroke:none;stroke-width:2.02031;stroke-linecap:round;stroke-linejoin:round"
     d="M 4 0 L 2 1 L 1 3 L 1 5 L 2 7 L 3 8 L 5 8.6660156 L 7 8 L 8 7 L 9 5 L 9 3 L 8 1 L 6 0 L 4 0 z M 5 8.6660156 L 4 9 L 2 10 L 1 11 L 0 14 L 0 17 L 1 19 L 2 20 L 4 21 L 6 21 L 8 20 L 9 19 L 10 17 L 10 14 L 9 11 L 8 10 L 6 9 L 5 8.6660156 z " />
</svg>
