<?xml version="1.0"?><!DOCTYPE svg PUBLIC "-//W3C//DTD SVG 1.1//EN" "http://www.w3.org/Graphics/SVG/1.1/DTD/svg11.dtd"><svg xmlns="http://www.w3.org/2000/svg" xmlns:xlink="http://www.w3.org/1999/xlink" width="350" height="1000" viewBox="0 0 10 26" >
            
                ['<path class="dot" d="M 0.5195833333333333,13.167291733333332 L 0.5195833333333331,13.167291733333332 C 0.22958333333333325,12.877291733333333 -0.21991666666666687,12.877291733333333 -0.5099166666666669,13.167291733333332 L -0.8869166666666668,13.544291733333333 C -1.1769166666666668,13.834291733333334 -1.1769166666666668,14.283791733333333 -0.8869166666666668,14.573791733333334 L -0.49541666666666695,14.965291733333332 C -0.20541666666666702,15.255291733333333 0.2440833333333332,15.255291733333333 0.534083333333333,14.965291733333332 L 0.9110833333333335,14.573791733333334 C 1.2010833333333335,14.283791733333333 1.2010833333333335,13.834291733333334 0.9110833333333335,13.544291733333333 L 0.5195833333333335,13.167291733333332" stroke-linejoin="round"/>', '<path class="dot" d="M 1.5195833333333333,14.140270833333332 L 1.519583333333333,14.140270833333332 C 1.2295833333333333,13.850270833333333 0.7800833333333331,13.850270833333333 0.4900833333333331,14.140270833333332 L 0.11308333333333317,14.517270833333333 C -0.17691666666666686,14.807270833333334 -0.17691666666666692,15.256770833333333 0.11308333333333317,15.546770833333333 L 0.504583333333333,15.938270833333332 C 0.794583333333333,16.228270833333333 1.2440833333333332,16.228270833333333 1.534083333333333,15.938270833333332 L 1.9110833333333335,15.546770833333333 C 2.2010833333333335,15.256770833333333 2.2010833333333335,14.807270833333334 1.9110833333333335,14.517270833333333 L 1.5195833333333335,14.140270833333332" stroke-linejoin="round"/>', '<path class="dot" d="M 2.5195833333333333,13.140270833333332 L 2.5195833333333333,13.140270833333332 C 2.2295833333333333,12.850270833333333 1.7800833333333332,12.850270833333333 1.4900833333333332,13.140270833333332 L 1.1130833333333332,13.517270833333333 C 0.8230833333333332,13.807270833333334 0.8230833333333331,14.256770833333333 1.1130833333333332,14.546770833333333 L 1.5045833333333332,14.938270833333332 C 1.794583333333333,15.228270833333333 2.244083333333333,15.228270833333333 2.5340833333333332,14.938270833333332 L 2.9110833333333335,14.546770833333333 C 3.2010833333333335,14.256770833333333 3.2010833333333335,13.807270833333334 2.9110833333333335,13.517270833333333 L 2.5195833333333333,13.140270833333332" stroke-linejoin="round"/>', '<path class="dot" d="M 1.5195833333333333,12.140270833333332 L 1.519583333333333,12.140270833333332 C 1.2295833333333333,11.850270833333333 0.7800833333333331,11.850270833333333 0.4900833333333331,12.140270833333332 L 0.11308333333333317,12.517270833333333 C -0.17691666666666686,12.807270833333334 -0.17691666666666692,13.256770833333333 0.11308333333333317,13.546770833333333 L 0.504583333333333,13.938270833333332 C 0.794583333333333,14.228270833333333 1.2440833333333332,14.228270833333333 1.534083333333333,13.938270833333332 L 1.9110833333333335,13.546770833333333 C 2.2010833333333335,13.256770833333333 2.2010833333333335,12.807270833333334 1.9110833333333335,12.517270833333333 L 1.5195833333333335,12.140270833333332" stroke-linejoin="round"/>', '<path class="dot" d="M 0.5195833333333333,13.167291733333332 L 0.5195833333333331,13.167291733333332 C 0.22958333333333325,12.877291733333333 -0.21991666666666687,12.877291733333333 -0.5099166666666669,13.167291733333332 L -0.8869166666666668,13.544291733333333 C -1.1769166666666668,13.834291733333334 -1.1769166666666668,14.283791733333333 -0.8869166666666668,14.573791733333334 L -0.49541666666666695,14.965291733333332 C -0.20541666666666702,15.255291733333333 0.2440833333333332,15.255291733333333 0.534083333333333,14.965291733333332 L 0.9110833333333335,14.573791733333334 C 1.2010833333333335,14.283791733333333 1.2010833333333335,13.834291733333334 0.9110833333333335,13.544291733333333 L 0.5195833333333335,13.167291733333332" stroke-linejoin="round"/>']
            
                ['<path class="dot" d="M 4.519583333333333,13.167291733333332 L 4.519583333333333,13.167291733333332 C 4.229583333333333,12.877291733333333 3.7800833333333332,12.877291733333333 3.490083333333333,13.167291733333332 L 3.113083333333333,13.544291733333333 C 2.823083333333333,13.834291733333334 2.823083333333333,14.283791733333333 3.113083333333333,14.573791733333334 L 3.504583333333333,14.965291733333332 C 3.7945833333333328,15.255291733333333 4.244083333333333,15.255291733333333 4.534083333333333,14.965291733333332 L 4.911083333333334,14.573791733333334 C 5.201083333333333,14.283791733333333 5.201083333333333,13.834291733333334 4.911083333333334,13.544291733333333 L 4.519583333333333,13.167291733333332" stroke-linejoin="round"/>', '<path class="dot" d="M 5.519583333333333,14.140270833333332 L 5.519583333333333,14.140270833333332 C 5.229583333333333,13.850270833333333 4.780083333333333,13.850270833333333 4.490083333333333,14.140270833333332 L 4.113083333333333,14.517270833333333 C 3.823083333333333,14.807270833333334 3.823083333333333,15.256770833333333 4.113083333333333,15.546770833333333 L 4.504583333333333,15.938270833333332 C 4.794583333333333,16.228270833333333 5.244083333333333,16.228270833333333 5.534083333333333,15.938270833333332 L 5.911083333333334,15.546770833333333 C 6.201083333333333,15.256770833333333 6.201083333333333,14.807270833333334 5.911083333333334,14.517270833333333 L 5.519583333333333,14.140270833333332" stroke-linejoin="round"/>', '<path class="dot" d="M 6.519583333333333,13.140270833333332 L 6.519583333333332,13.140270833333332 C 6.229583333333332,12.850270833333333 5.780083333333333,12.850270833333333 5.490083333333333,13.140270833333332 L 5.113083333333333,13.517270833333333 C 4.823083333333333,13.807270833333334 4.823083333333333,14.256770833333333 5.113083333333333,14.546770833333333 L 5.504583333333333,14.938270833333332 C 5.794583333333333,15.228270833333333 6.244083333333332,15.228270833333333 6.534083333333332,14.938270833333332 L 6.911083333333333,14.546770833333333 C 7.201083333333333,14.256770833333333 7.201083333333333,13.807270833333334 6.911083333333333,13.517270833333333 L 6.519583333333333,13.140270833333332" stroke-linejoin="round"/>', '<path class="dot" d="M 5.519583333333333,12.140270833333332 L 5.519583333333333,12.140270833333332 C 5.229583333333333,11.850270833333333 4.780083333333333,11.850270833333333 4.490083333333333,12.140270833333332 L 4.113083333333333,12.517270833333333 C 3.823083333333333,12.807270833333334 3.823083333333333,13.256770833333333 4.113083333333333,13.546770833333333 L 4.504583333333333,13.938270833333332 C 4.794583333333333,14.228270833333333 5.244083333333333,14.228270833333333 5.534083333333333,13.938270833333332 L 5.911083333333334,13.546770833333333 C 6.201083333333333,13.256770833333333 6.201083333333333,12.807270833333334 5.911083333333334,12.517270833333333 L 5.519583333333333,12.140270833333332" stroke-linejoin="round"/>', '<path class="dot" d="M 4.519583333333333,13.167291733333332 L 4.519583333333333,13.167291733333332 C 4.229583333333333,12.877291733333333 3.7800833333333332,12.877291733333333 3.490083333333333,13.167291733333332 L 3.113083333333333,13.544291733333333 C 2.823083333333333,13.834291733333334 2.823083333333333,14.283791733333333 3.113083333333333,14.573791733333334 L 3.504583333333333,14.965291733333332 C 3.7945833333333328,15.255291733333333 4.244083333333333,15.255291733333333 4.534083333333333,14.965291733333332 L 4.911083333333334,14.573791733333334 C 5.201083333333333,14.283791733333333 5.201083333333333,13.834291733333334 4.911083333333334,13.544291733333333 L 4.519583333333333,13.167291733333332" stroke-linejoin="round"/>']
            
                ['<path class="dot" d="M 8.519583333333333,13.167291733333332 L 8.519583333333333,13.167291733333332 C 8.229583333333332,12.877291733333333 7.780083333333333,12.877291733333333 7.490083333333333,13.167291733333332 L 7.113083333333333,13.544291733333333 C 6.823083333333333,13.834291733333334 6.823083333333333,14.283791733333333 7.113083333333333,14.573791733333334 L 7.504583333333333,14.965291733333332 C 7.794583333333333,15.255291733333333 8.244083333333332,15.255291733333333 8.534083333333333,14.965291733333332 L 8.911083333333334,14.573791733333334 C 9.201083333333333,14.283791733333333 9.201083333333333,13.834291733333334 8.911083333333334,13.544291733333333 L 8.519583333333333,13.167291733333332" stroke-linejoin="round"/>', '<path class="dot" d="M 9.519583333333333,14.140270833333332 L 9.519583333333333,14.140270833333332 C 9.229583333333332,13.850270833333333 8.780083333333332,13.850270833333333 8.490083333333333,14.140270833333332 L 8.113083333333332,14.517270833333333 C 7.823083333333333,14.807270833333334 7.823083333333333,15.256770833333333 8.113083333333332,15.546770833333333 L 8.504583333333333,15.938270833333332 C 8.794583333333332,16.228270833333333 9.244083333333332,16.228270833333333 9.534083333333333,15.938270833333332 L 9.911083333333334,15.546770833333333 C 10.201083333333333,15.256770833333333 10.201083333333333,14.807270833333334 9.911083333333334,14.517270833333333 L 9.519583333333333,14.140270833333332" stroke-linejoin="round"/>', '<path class="dot" d="M 10.519583333333333,13.140270833333332 L 10.519583333333333,13.140270833333332 C 10.229583333333332,12.850270833333333 9.780083333333332,12.850270833333333 9.490083333333333,13.140270833333332 L 9.113083333333332,13.517270833333333 C 8.823083333333333,13.807270833333334 8.823083333333333,14.256770833333333 9.113083333333332,14.546770833333333 L 9.504583333333333,14.938270833333332 C 9.794583333333332,15.228270833333333 10.244083333333332,15.228270833333333 10.534083333333333,14.938270833333332 L 10.911083333333334,14.546770833333333 C 11.201083333333333,14.256770833333333 11.201083333333333,13.807270833333334 10.911083333333334,13.517270833333333 L 10.519583333333333,13.140270833333332" stroke-linejoin="round"/>', '<path class="dot" d="M 9.519583333333333,12.140270833333332 L 9.519583333333333,12.140270833333332 C 9.229583333333332,11.850270833333333 8.780083333333332,11.850270833333333 8.490083333333333,12.140270833333332 L 8.113083333333332,12.517270833333333 C 7.823083333333333,12.807270833333334 7.823083333333333,13.256770833333333 8.113083333333332,13.546770833333333 L 8.504583333333333,13.938270833333332 C 8.794583333333332,14.228270833333333 9.244083333333332,14.228270833333333 9.534083333333333,13.938270833333332 L 9.911083333333334,13.546770833333333 C 10.201083333333333,13.256770833333333 10.201083333333333,12.807270833333334 9.911083333333334,12.517270833333333 L 9.519583333333333,12.140270833333332" stroke-linejoin="round"/>', '<path class="dot" d="M 8.519583333333333,13.167291733333332 L 8.519583333333333,13.167291733333332 C 8.229583333333332,12.877291733333333 7.780083333333333,12.877291733333333 7.490083333333333,13.167291733333332 L 7.113083333333333,13.544291733333333 C 6.823083333333333,13.834291733333334 6.823083333333333,14.283791733333333 7.113083333333333,14.573791733333334 L 7.504583333333333,14.965291733333332 C 7.794583333333333,15.255291733333333 8.244083333333332,15.255291733333333 8.534083333333333,14.965291733333332 L 8.911083333333334,14.573791733333334 C 9.201083333333333,14.283791733333333 9.201083333333333,13.834291733333334 8.911083333333334,13.544291733333333 L 8.519583333333333,13.167291733333332" stroke-linejoin="round"/>']
            
            
            <path d="M 0.0,14.0270209 L 1.0,15.0 L 2.0,14.0 L 1.0,13.0 L 0.0,14.0270209" fill="none"
            stroke="black"
            stroke-width="1.5"
            stroke-linecap="round"
            stroke-linejoin="round"
            />
            
            <path d="M 4.0,14.0270209 L 5.0,15.0 L 6.0,14.0 L 5.0,13.0 L 4.0,14.0270209" fill="none"
            stroke="black"
            stroke-width="1.5"
            stroke-linecap="round"
            stroke-linejoin="round"
            />
            
            <path d="M 8.0,14.0270209 L 9.0,15.0 L 10.0,14.0 L 9.0,13.0 L 8.0,14.0270209" fill="none"
            stroke="black"
            stroke-width="1.5"
            stroke-linecap="round"
            stroke-linejoin="round"
            />
            
            
        </svg>