<?xml version="1.0" encoding="UTF-8" standalone="no"?>
<svg
   width="5.9839153"
   height="14.000002"
   viewBox="0 0 0.23935661 0.56000008"
   version="1.1"
   id="svg25"
   xmlns="http://www.w3.org/2000/svg"
   xmlns:svg="http://www.w3.org/2000/svg"><defs
   id="defs25" />

            
                ['', '']
            
                ['', '', '', '', '', '', '', '', '', '']
            
                ['', '', '', '', '', '', '', '', '', '']
            
            
            <g
   id="g29"
   transform="matrix(0.03,0,0,0.02857143,0.1157783,0.35400006)"
   style="stroke-width:34.1565">
  <g
     id="g28"
     style="stroke-width:34.1565">
    <g
       id="g32"
       style="stroke:none;stroke-width:1350.16"
       transform="matrix(0.024,0,0,0.02666667,0.21487991,-2.5116004)">
      <g
         id="g33"
         style="stroke:none;stroke-width:53441.4"
         transform="matrix(0.02393569,0,0,0.02666667,-5.5608276,-1.1116285)">
        <path
           d="M -6859.8688,-13849.812 7029.0035,13712.684"
           fill="none"
           stroke="#000000"
           stroke-width="133603"
           stroke-linecap="round"
           stroke-linejoin="round"
           id="path5"
           style="stroke:none" />
      </g>
    </g>
  </g>
</g>
</svg>
