<?xml version="1.0"?><!DOCTYPE svg PUBLIC "-//W3C//DTD SVG 1.1//EN" "http://www.w3.org/Graphics/SVG/1.1/DTD/svg11.dtd"><svg xmlns="http://www.w3.org/2000/svg" xmlns:xlink="http://www.w3.org/1999/xlink" width="350" height="1000" viewBox="0 0 14 40" >
            
                ['<path class="dot" d="M 8.79094387755102,-0.22280612244898207 L 8.790943877551019,-0.22280612244898207 C 8.34094387755102,-0.6728061224489821 7.64344387755102,-0.6728061224489822 7.1934438775510205,-0.22280612244898207 L 6.608443877551021,0.3621938775510183 C 6.15844387755102,0.8121938775510182 6.15844387755102,1.5096938775510182 6.608443877551021,1.9596938775510184 L 7.21594387755102,2.567193877551018 C 7.66594387755102,3.0171938775510174 8.36344387755102,3.0171938775510174 8.81344387755102,2.567193877551018 L 9.39844387755102,1.9596938775510184 C 9.84844387755102,1.5096938775510182 9.84844387755102,0.8121938775510182 9.39844387755102,0.36219387755101806 L 8.79094387755102,-0.2228061224489819" stroke-linejoin="round"/>', '<path class="dot" d="M 1.7909438775510205,20.777193877551017 L 1.7909438775510196,20.777193877551017 C 1.3409438775510198,20.327193877551018 0.6434438775510198,20.327193877551018 0.19344387755102,20.777193877551017 L -0.39155612244898,21.362193877551018 C -0.84155612244898,21.812193877551017 -0.8415561224489801,22.50969387755102 -0.39155612244898,22.959693877551018 L 0.21594387755101985,23.56719387755102 C 0.6659438775510198,24.01719387755102 1.3634438775510198,24.01719387755102 1.8134438775510195,23.56719387755102 L 2.3984438775510206,22.959693877551018 C 2.84844387755102,22.50969387755102 2.84844387755102,21.812193877551017 2.3984438775510206,21.362193877551018 L 1.7909438775510205,20.777193877551017" stroke-linejoin="round"/>']
            
                ['<path class="dot" d="M 9.79094387755102,9.777203877551019 L 9.790943877551019,9.777203877551019 C 9.34094387755102,9.327203877551018 8.64344387755102,9.327203877551018 8.19344387755102,9.777203877551019 L 7.608443877551021,10.362203877551018 C 7.15844387755102,10.812203877551019 7.15844387755102,11.509703877551019 7.608443877551021,11.959703877551018 L 8.21594387755102,12.567203877551018 C 8.66594387755102,13.017203877551019 9.36344387755102,13.017203877551019 9.81344387755102,12.567203877551018 L 10.39844387755102,11.959703877551018 C 10.84844387755102,11.509703877551019 10.84844387755102,10.812203877551019 10.39844387755102,10.362203877551018 L 9.79094387755102,9.777203877551019" stroke-linejoin="round"/>', '<path class="dot" d="M 13.790943877551019,9.777203877551019 L 13.790943877551019,9.777203877551019 C 13.34094387755102,9.327203877551018 12.64344387755102,9.327203877551018 12.193443877551019,9.777203877551019 L 11.60844387755102,10.362203877551018 C 11.158443877551019,10.812203877551019 11.158443877551019,11.509703877551019 11.60844387755102,11.959703877551018 L 12.21594387755102,12.567203877551018 C 12.665943877551019,13.017203877551019 13.363443877551019,13.017203877551019 13.81344387755102,12.567203877551018 L 14.39844387755102,11.959703877551018 C 14.84844387755102,11.509703877551019 14.84844387755102,10.812203877551019 14.39844387755102,10.362203877551018 L 13.790943877551019,9.777203877551019" stroke-linejoin="round"/>']
            
                ['<path class="dot" d="M 9.79094387755102,-0.22280612244898207 L 9.790943877551019,-0.22280612244898207 C 9.34094387755102,-0.6728061224489821 8.64344387755102,-0.6728061224489822 8.19344387755102,-0.22280612244898207 L 7.608443877551021,0.3621938775510183 C 7.15844387755102,0.8121938775510182 7.15844387755102,1.5096938775510182 7.608443877551021,1.9596938775510184 L 8.21594387755102,2.567193877551018 C 8.66594387755102,3.0171938775510174 9.36344387755102,3.0171938775510174 9.81344387755102,2.567193877551018 L 10.39844387755102,1.9596938775510184 C 10.84844387755102,1.5096938775510182 10.84844387755102,0.8121938775510182 10.39844387755102,0.36219387755101806 L 9.79094387755102,-0.2228061224489819" stroke-linejoin="round"/>', '<path class="dot" d="M 9.79094387755102,20.777193877551017 L 9.790943877551019,20.777193877551017 C 9.34094387755102,20.327193877551018 8.64344387755102,20.327193877551018 8.19344387755102,20.777193877551017 L 7.608443877551021,21.362193877551018 C 7.15844387755102,21.812193877551017 7.15844387755102,22.50969387755102 7.608443877551021,22.959693877551018 L 8.21594387755102,23.56719387755102 C 8.66594387755102,24.01719387755102 9.36344387755102,24.01719387755102 9.81344387755102,23.56719387755102 L 10.39844387755102,22.959693877551018 C 10.84844387755102,22.50969387755102 10.84844387755102,21.812193877551017 10.39844387755102,21.362193877551018 L 9.79094387755102,20.777193877551017" stroke-linejoin="round"/>']
            
                ['<path class="dot" d="M 9.79094387755102,-0.222796122448982 L 9.790943877551019,-0.222796122448982 C 9.34094387755102,-0.672796122448982 8.64344387755102,-0.6727961224489821 8.19344387755102,-0.222796122448982 L 7.608443877551021,0.36220387755101835 C 7.15844387755102,0.8122038775510183 7.15844387755102,1.5097038775510183 7.608443877551021,1.9597038775510185 L 8.21594387755102,2.5672038775510178 C 8.66594387755102,3.017203877551018 9.36344387755102,3.017203877551018 9.81344387755102,2.5672038775510178 L 10.39844387755102,1.9597038775510185 C 10.84844387755102,1.5097038775510183 10.84844387755102,0.8122038775510183 10.39844387755102,0.3622038775510181 L 9.79094387755102,-0.22279612244898184" stroke-linejoin="round"/>', '<path class="dot" d="M 13.790943877551019,-0.222796122448982 L 13.790943877551019,-0.222796122448982 C 13.34094387755102,-0.672796122448982 12.64344387755102,-0.6727961224489821 12.193443877551019,-0.222796122448982 L 11.60844387755102,0.36220387755101835 C 11.158443877551019,0.8122038775510183 11.158443877551019,1.5097038775510183 11.60844387755102,1.9597038775510185 L 12.21594387755102,2.5672038775510178 C 12.665943877551019,3.017203877551018 13.363443877551019,3.017203877551018 13.81344387755102,2.5672038775510178 L 14.39844387755102,1.9597038775510185 C 14.84844387755102,1.5097038775510183 14.84844387755102,0.8122038775510183 14.39844387755102,0.3622038775510181 L 13.790943877551019,-0.22279612244898184" stroke-linejoin="round"/>']
            
                ['<path class="dot" d="M 5.790943877551021,9.777203877551019 L 5.79094387755102,9.777203877551019 C 5.34094387755102,9.327203877551018 4.64344387755102,9.327203877551018 4.1934438775510205,9.777203877551019 L 3.60844387755102,10.362203877551018 C 3.1584438775510204,10.812203877551019 3.15844387755102,11.509703877551019 3.60844387755102,11.959703877551018 L 4.21594387755102,12.567203877551018 C 4.66594387755102,13.017203877551019 5.3634438775510205,13.017203877551019 5.81344387755102,12.567203877551018 L 6.398443877551021,11.959703877551018 C 6.84844387755102,11.509703877551019 6.84844387755102,10.812203877551019 6.398443877551021,10.362203877551018 L 5.790943877551021,9.777203877551019" stroke-linejoin="round"/>', '<path class="dot" d="M 9.79094387755102,9.777203877551019 L 9.790943877551019,9.777203877551019 C 9.34094387755102,9.327203877551018 8.64344387755102,9.327203877551018 8.19344387755102,9.777203877551019 L 7.608443877551021,10.362203877551018 C 7.15844387755102,10.812203877551019 7.15844387755102,11.509703877551019 7.608443877551021,11.959703877551018 L 8.21594387755102,12.567203877551018 C 8.66594387755102,13.017203877551019 9.36344387755102,13.017203877551019 9.81344387755102,12.567203877551018 L 10.39844387755102,11.959703877551018 C 10.84844387755102,11.509703877551019 10.84844387755102,10.812203877551019 10.39844387755102,10.362203877551018 L 9.79094387755102,9.777203877551019" stroke-linejoin="round"/>']
            
                ['<path class="dot" d="M 9.79094387755102,20.777203877551017 L 9.790943877551019,20.777203877551017 C 9.34094387755102,20.327203877551018 8.64344387755102,20.327203877551018 8.19344387755102,20.777203877551017 L 7.608443877551021,21.362203877551018 C 7.15844387755102,21.812203877551017 7.15844387755102,22.50970387755102 7.608443877551021,22.959703877551018 L 8.21594387755102,23.56720387755102 C 8.66594387755102,24.01720387755102 9.36344387755102,24.01720387755102 9.81344387755102,23.56720387755102 L 10.39844387755102,22.959703877551018 C 10.84844387755102,22.50970387755102 10.84844387755102,21.812203877551017 10.39844387755102,21.362203877551018 L 9.79094387755102,20.777203877551017" stroke-linejoin="round"/>', '<path class="dot" d="M 13.790943877551019,20.777203877551017 L 13.790943877551019,20.777203877551017 C 13.34094387755102,20.327203877551018 12.64344387755102,20.327203877551018 12.193443877551019,20.777203877551017 L 11.60844387755102,21.362203877551018 C 11.158443877551019,21.812203877551017 11.158443877551019,22.50970387755102 11.60844387755102,22.959703877551018 L 12.21594387755102,23.56720387755102 C 12.665943877551019,24.01720387755102 13.363443877551019,24.01720387755102 13.81344387755102,23.56720387755102 L 14.39844387755102,22.959703877551018 C 14.84844387755102,22.50970387755102 14.84844387755102,21.812203877551017 14.39844387755102,21.362203877551018 L 13.790943877551019,20.777203877551017" stroke-linejoin="round"/>']
            
            
            <path d="M 8.0,1.0 L 1.0,22.0" fill="none"
            stroke="black"
            stroke-width="2.5"
            stroke-linecap="round"
            stroke-linejoin="round"
            />
            
            <path d="M 9.0,11.00001 L 13.0,11.00001" fill="none"
            stroke="black"
            stroke-width="2.5"
            stroke-linecap="round"
            stroke-linejoin="round"
            />
            
            <path d="M 9.0,1.0 L 9.0,22.0" fill="none"
            stroke="black"
            stroke-width="2.5"
            stroke-linecap="round"
            stroke-linejoin="round"
            />
            
            <path d="M 9.0,1.00001 L 13.0,1.00001" fill="none"
            stroke="black"
            stroke-width="2.5"
            stroke-linecap="round"
            stroke-linejoin="round"
            />
            
            <path d="M 5.0,11.00001 L 9.0,11.00001" fill="none"
            stroke="black"
            stroke-width="2.5"
            stroke-linecap="round"
            stroke-linejoin="round"
            />
            
            <path d="M 9.0,22.00001 L 13.0,22.00001" fill="none"
            stroke="black"
            stroke-width="2.5"
            stroke-linecap="round"
            stroke-linejoin="round"
            />
            
            
        </svg>