<?xml version="1.0"?><!DOCTYPE svg PUBLIC "-//W3C//DTD SVG 1.1//EN" "http://www.w3.org/Graphics/SVG/1.1/DTD/svg11.dtd"><svg xmlns="http://www.w3.org/2000/svg" xmlns:xlink="http://www.w3.org/1999/xlink" width="350" height="1000" viewBox="0 0 10 26" >
            
                ['<path class="dot" d="M 8.519583333333333,6.140270833333333 L 8.519583333333333,6.140270833333333 C 8.229583333333332,5.850270833333333 7.780083333333333,5.850270833333333 7.490083333333333,6.140270833333333 L 7.113083333333333,6.517270833333333 C 6.823083333333333,6.807270833333333 6.823083333333333,7.2567708333333325 7.113083333333333,7.546770833333333 L 7.504583333333333,7.938270833333332 C 7.794583333333333,8.228270833333333 8.244083333333332,8.228270833333333 8.534083333333333,7.938270833333332 L 8.911083333333334,7.546770833333333 C 9.201083333333333,7.2567708333333325 9.201083333333333,6.807270833333333 8.911083333333334,6.517270833333333 L 8.519583333333333,6.140270833333333" stroke-linejoin="round"/>', '<path class="dot" d="M 6.519583333333333,4.140270833333333 L 6.519583333333332,4.140270833333333 C 6.229583333333332,3.8502708333333326 5.780083333333333,3.8502708333333326 5.490083333333333,4.140270833333333 L 5.113083333333333,4.517270833333333 C 4.823083333333333,4.807270833333333 4.823083333333333,5.2567708333333325 5.113083333333333,5.546770833333333 L 5.504583333333333,5.938270833333332 C 5.794583333333333,6.228270833333333 6.244083333333332,6.228270833333333 6.534083333333332,5.938270833333332 L 6.911083333333333,5.546770833333333 C 7.201083333333333,5.2567708333333325 7.201083333333333,4.807270833333333 6.911083333333333,4.517270833333333 L 6.519583333333333,4.140270833333333" stroke-linejoin="round"/>', '<path class="dot" d="M 4.519583333333333,4.140270833333333 L 4.519583333333333,4.140270833333333 C 4.229583333333333,3.8502708333333326 3.7800833333333332,3.8502708333333326 3.490083333333333,4.140270833333333 L 3.113083333333333,4.517270833333333 C 2.823083333333333,4.807270833333333 2.823083333333333,5.2567708333333325 3.113083333333333,5.546770833333333 L 3.504583333333333,5.938270833333332 C 3.7945833333333328,6.228270833333333 4.244083333333333,6.228270833333333 4.534083333333333,5.938270833333332 L 4.911083333333334,5.546770833333333 C 5.201083333333333,5.2567708333333325 5.201083333333333,4.807270833333333 4.911083333333334,4.517270833333333 L 4.519583333333333,4.140270833333333" stroke-linejoin="round"/>', '<path class="dot" d="M 3.5195833333333333,5.140270833333333 L 3.5195833333333333,5.140270833333333 C 3.2295833333333333,4.850270833333333 2.7800833333333332,4.850270833333333 2.490083333333333,5.140270833333333 L 2.113083333333333,5.517270833333333 C 1.8230833333333332,5.807270833333333 1.8230833333333332,6.2567708333333325 2.113083333333333,6.546770833333333 L 2.504583333333333,6.938270833333332 C 2.7945833333333328,7.228270833333333 3.244083333333333,7.228270833333333 3.5340833333333332,6.938270833333332 L 3.9110833333333335,6.546770833333333 C 4.201083333333333,6.2567708333333325 4.201083333333333,5.807270833333333 3.9110833333333335,5.517270833333333 L 3.5195833333333333,5.140270833333333" stroke-linejoin="round"/>', '<path class="dot" d="M 2.5195833333333333,7.140270833333333 L 2.5195833333333333,7.140270833333333 C 2.2295833333333333,6.850270833333333 1.7800833333333332,6.850270833333333 1.4900833333333332,7.140270833333333 L 1.1130833333333332,7.517270833333333 C 0.8230833333333332,7.807270833333333 0.8230833333333331,8.256770833333333 1.1130833333333332,8.546770833333333 L 1.5045833333333332,8.938270833333332 C 1.794583333333333,9.228270833333333 2.244083333333333,9.228270833333333 2.5340833333333332,8.938270833333332 L 2.9110833333333335,8.546770833333333 C 3.2010833333333335,8.256770833333333 3.2010833333333335,7.807270833333333 2.9110833333333335,7.517270833333333 L 2.5195833333333333,7.140270833333333" stroke-linejoin="round"/>', '<path class="dot" d="M 2.5195833333333333,11.140270833333332 L 2.5195833333333333,11.140270833333332 C 2.2295833333333333,10.850270833333333 1.7800833333333332,10.850270833333333 1.4900833333333332,11.140270833333332 L 1.1130833333333332,11.517270833333333 C 0.8230833333333332,11.807270833333334 0.8230833333333331,12.256770833333333 1.1130833333333332,12.546770833333333 L 1.5045833333333332,12.938270833333332 C 1.794583333333333,13.228270833333333 2.244083333333333,13.228270833333333 2.5340833333333332,12.938270833333332 L 2.9110833333333335,12.546770833333333 C 3.2010833333333335,12.256770833333333 3.2010833333333335,11.807270833333334 2.9110833333333335,11.517270833333333 L 2.5195833333333333,11.140270833333332" stroke-linejoin="round"/>', '<path class="dot" d="M 3.5195833333333333,13.140270833333332 L 3.5195833333333333,13.140270833333332 C 3.2295833333333333,12.850270833333333 2.7800833333333332,12.850270833333333 2.490083333333333,13.140270833333332 L 2.113083333333333,13.517270833333333 C 1.8230833333333332,13.807270833333334 1.8230833333333332,14.256770833333333 2.113083333333333,14.546770833333333 L 2.504583333333333,14.938270833333332 C 2.7945833333333328,15.228270833333333 3.244083333333333,15.228270833333333 3.5340833333333332,14.938270833333332 L 3.9110833333333335,14.546770833333333 C 4.201083333333333,14.256770833333333 4.201083333333333,13.807270833333334 3.9110833333333335,13.517270833333333 L 3.5195833333333333,13.140270833333332" stroke-linejoin="round"/>', '<path class="dot" d="M 4.519583333333333,14.140270833333332 L 4.519583333333333,14.140270833333332 C 4.229583333333333,13.850270833333333 3.7800833333333332,13.850270833333333 3.490083333333333,14.140270833333332 L 3.113083333333333,14.517270833333333 C 2.823083333333333,14.807270833333334 2.823083333333333,15.256770833333333 3.113083333333333,15.546770833333333 L 3.504583333333333,15.938270833333332 C 3.7945833333333328,16.228270833333333 4.244083333333333,16.228270833333333 4.534083333333333,15.938270833333332 L 4.911083333333334,15.546770833333333 C 5.201083333333333,15.256770833333333 5.201083333333333,14.807270833333334 4.911083333333334,14.517270833333333 L 4.519583333333333,14.140270833333332" stroke-linejoin="round"/>', '<path class="dot" d="M 6.519583333333333,14.140270833333332 L 6.519583333333332,14.140270833333332 C 6.229583333333332,13.850270833333333 5.780083333333333,13.850270833333333 5.490083333333333,14.140270833333332 L 5.113083333333333,14.517270833333333 C 4.823083333333333,14.807270833333334 4.823083333333333,15.256770833333333 5.113083333333333,15.546770833333333 L 5.504583333333333,15.938270833333332 C 5.794583333333333,16.228270833333333 6.244083333333332,16.228270833333333 6.534083333333332,15.938270833333332 L 6.911083333333333,15.546770833333333 C 7.201083333333333,15.256770833333333 7.201083333333333,14.807270833333334 6.911083333333333,14.517270833333333 L 6.519583333333333,14.140270833333332" stroke-linejoin="round"/>', '<path class="dot" d="M 8.519583333333333,12.140270833333332 L 8.519583333333333,12.140270833333332 C 8.229583333333332,11.850270833333333 7.780083333333333,11.850270833333333 7.490083333333333,12.140270833333332 L 7.113083333333333,12.517270833333333 C 6.823083333333333,12.807270833333334 6.823083333333333,13.256770833333333 7.113083333333333,13.546770833333333 L 7.504583333333333,13.938270833333332 C 7.794583333333333,14.228270833333333 8.244083333333332,14.228270833333333 8.534083333333333,13.938270833333332 L 8.911083333333334,13.546770833333333 C 9.201083333333333,13.256770833333333 9.201083333333333,12.807270833333334 8.911083333333334,12.517270833333333 L 8.519583333333333,12.140270833333332" stroke-linejoin="round"/>']
            
                ['<path class="dot" d="M 5.519583333333333,14.140270833333332 L 5.519583333333333,14.140270833333332 C 5.229583333333333,13.850270833333333 4.780083333333333,13.850270833333333 4.490083333333333,14.140270833333332 L 4.113083333333333,14.517270833333333 C 3.823083333333333,14.807270833333334 3.823083333333333,15.256770833333333 4.113083333333333,15.546770833333333 L 4.504583333333333,15.938270833333332 C 4.794583333333333,16.228270833333333 5.244083333333333,16.228270833333333 5.534083333333333,15.938270833333332 L 5.911083333333334,15.546770833333333 C 6.201083333333333,15.256770833333333 6.201083333333333,14.807270833333334 5.911083333333334,14.517270833333333 L 5.519583333333333,14.140270833333332" stroke-linejoin="round"/>', '<path class="dot" d="M 5.519583333333333,15.140270833333332 L 5.519583333333333,15.140270833333332 C 5.229583333333333,14.850270833333333 4.780083333333333,14.850270833333333 4.490083333333333,15.140270833333332 L 4.113083333333333,15.517270833333333 C 3.823083333333333,15.807270833333334 3.823083333333333,16.256770833333334 4.113083333333333,16.546770833333333 L 4.504583333333333,16.938270833333334 C 4.794583333333333,17.228270833333333 5.244083333333333,17.228270833333333 5.534083333333333,16.938270833333334 L 5.911083333333334,16.546770833333333 C 6.201083333333333,16.256770833333334 6.201083333333333,15.807270833333334 5.911083333333334,15.517270833333333 L 5.519583333333333,15.140270833333332" stroke-linejoin="round"/>', '<path class="dot" d="M 6.519583333333333,16.140270833333332 L 6.519583333333332,16.140270833333332 C 6.229583333333332,15.850270833333333 5.780083333333333,15.850270833333333 5.490083333333333,16.140270833333332 L 5.113083333333333,16.517270833333335 C 4.823083333333333,16.807270833333334 4.823083333333333,17.256770833333334 5.113083333333333,17.546770833333333 L 5.504583333333333,17.938270833333334 C 5.794583333333333,18.228270833333333 6.244083333333332,18.228270833333333 6.534083333333332,17.938270833333334 L 6.911083333333333,17.546770833333333 C 7.201083333333333,17.256770833333334 7.201083333333333,16.807270833333334 6.911083333333333,16.517270833333335 L 6.519583333333333,16.140270833333332" stroke-linejoin="round"/>', '<path class="dot" d="M 5.519583333333333,17.140270833333336 L 5.519583333333333,17.140270833333336 C 5.229583333333333,16.850270833333333 4.780083333333333,16.850270833333333 4.490083333333333,17.140270833333336 L 4.113083333333333,17.517270833333335 C 3.823083333333333,17.807270833333334 3.823083333333333,18.256770833333334 4.113083333333333,18.546770833333333 L 4.504583333333333,18.938270833333334 C 4.794583333333333,19.228270833333333 5.244083333333333,19.228270833333333 5.534083333333333,18.938270833333334 L 5.911083333333334,18.546770833333333 C 6.201083333333333,18.256770833333334 6.201083333333333,17.807270833333334 5.911083333333334,17.517270833333335 L 5.519583333333333,17.140270833333336" stroke-linejoin="round"/>']
            
            
            <path d="M 8.0,7.0 L 6.0,5.0 L 4.0,5.0 L 3.0,6.0 L 2.0,8.0 L 2.0,12.0 L 3.0,14.0 L 4.0,15.0 L 6.0,15.0 L 8.0,13.0" fill="none"
            stroke="black"
            stroke-width="1.5"
            stroke-linecap="round"
            stroke-linejoin="round"
            />
            
            <path d="M 5.0,15.0 L 5.0,16.0 L 6.0,17.0 L 5.0,18.0" fill="none"
            stroke="black"
            stroke-width="1.5"
            stroke-linecap="round"
            stroke-linejoin="round"
            />
            
            
        </svg>