<?xml version="1.0"?><!DOCTYPE svg PUBLIC "-//W3C//DTD SVG 1.1//EN" "http://www.w3.org/Graphics/SVG/1.1/DTD/svg11.dtd"><svg xmlns="http://www.w3.org/2000/svg" xmlns:xlink="http://www.w3.org/1999/xlink" width="350" height="1000" viewBox="0 0 10 26" >
            
                ['<path class="dot" d="M 5.519583333333333,0.1402708333333331 L 5.519583333333333,0.1402708333333331 C 5.229583333333333,-0.14972916666666694 4.780083333333333,-0.149729166666667 4.490083333333333,0.1402708333333331 L 4.113083333333333,0.5172708333333332 C 3.823083333333333,0.8072708333333332 3.823083333333333,1.2567708333333332 4.113083333333333,1.5467708333333332 L 4.504583333333333,1.938270833333333 C 4.794583333333333,2.228270833333333 5.244083333333333,2.228270833333333 5.534083333333333,1.938270833333333 L 5.911083333333334,1.5467708333333332 C 6.201083333333333,1.2567708333333332 6.201083333333333,0.8072708333333333 5.911083333333334,0.5172708333333331 L 5.519583333333333,0.14027083333333312" stroke-linejoin="round"/>', '<path class="dot" d="M 5.519583333333333,18.140270833333336 L 5.519583333333333,18.140270833333336 C 5.229583333333333,17.850270833333333 4.780083333333333,17.850270833333333 4.490083333333333,18.140270833333336 L 4.113083333333333,18.517270833333335 C 3.823083333333333,18.807270833333334 3.823083333333333,19.256770833333334 4.113083333333333,19.546770833333333 L 4.504583333333333,19.938270833333334 C 4.794583333333333,20.228270833333333 5.244083333333333,20.228270833333333 5.534083333333333,19.938270833333334 L 5.911083333333334,19.546770833333333 C 6.201083333333333,19.256770833333334 6.201083333333333,18.807270833333334 5.911083333333334,18.517270833333335 L 5.519583333333333,18.140270833333336" stroke-linejoin="round"/>']
            
            
            <path d="M 5.0,1.0 L 5.0,19.0" fill="none"
            stroke="black"
            stroke-width="1.5"
            stroke-linecap="round"
            stroke-linejoin="round"
            />
            
            
        </svg>