<?xml version="1.0" encoding="UTF-8" standalone="no"?>
<svg
   data-dec="38"
   width="14"
   height="40"
   version="1.1"
   id="svg1"
   sodipodi:docname="38.svg"
   inkscape:version="1.3.2 (091e20ef0f, 2023-11-25, custom)"
   xmlns:inkscape="http://www.inkscape.org/namespaces/inkscape"
   xmlns:sodipodi="http://sodipodi.sourceforge.net/DTD/sodipodi-0.dtd"
   xmlns="http://www.w3.org/2000/svg"
   xmlns:svg="http://www.w3.org/2000/svg">
  <defs
     id="defs1" />
  <sodipodi:namedview
     id="namedview1"
     pagecolor="#ffffff"
     bordercolor="#666666"
     borderopacity="1.0"
     inkscape:showpageshadow="2"
     inkscape:pageopacity="0.0"
     inkscape:pagecheckerboard="0"
     inkscape:deskcolor="#d1d1d1"
     showgrid="true"
     inkscape:zoom="42.053645"
     inkscape:cx="4.5061492"
     inkscape:cy="13.078533"
     inkscape:window-width="2560"
     inkscape:window-height="1403"
     inkscape:window-x="0"
     inkscape:window-y="0"
     inkscape:window-maximized="1"
     inkscape:current-layer="svg1">
    <inkscape:grid
       id="grid1"
       units="px"
       originx="0"
       originy="0"
       spacingx="1"
       spacingy="1"
       empcolor="#0099e5"
       empopacity="0.30196078"
       color="#0099e5"
       opacity="0.14901961"
       empspacing="5"
       dotted="false"
       gridanglex="30"
       gridanglez="30"
       visible="true" />
  </sodipodi:namedview>
  <path
     d="M 13,10 V 9 L 12,8 H 11 L 10,9 8,18 7,21 6,22 H 3 L 2,21 1,18 V 16 L 2,13 6,9 7,8 8,6 V 4 L 7,2 6,1 H 5 L 4,2 3,4 v 2 l 6,13 1,2 1,1 h 1 l 1,-1 v -1"
     style="fill:none;stroke:none;stroke-width:2.00001;stroke-linecap:round;stroke-linejoin:round"
     id="path1"
     sodipodi:nodetypes="ccccccccccccccccccccccccccccc" />
</svg>
