<?xml version="1.0"?><!DOCTYPE svg PUBLIC "-//W3C//DTD SVG 1.1//EN" "http://www.w3.org/Graphics/SVG/1.1/DTD/svg11.dtd"><svg xmlns="http://www.w3.org/2000/svg" xmlns:xlink="http://www.w3.org/1999/xlink" width="350" height="1000" viewBox="0 0 14 40" >
            
                ['<path class="dot" d="M 2.7909438775510216,20.777193877551017 L 2.7909438775510207,20.777193877551017 C 2.3409438775510205,20.327193877551018 1.6434438775510207,20.327193877551018 1.193443877551021,20.777193877551017 L 0.6084438775510208,21.362193877551018 C 0.15844387755102085,21.812193877551017 0.15844387755102074,22.50969387755102 0.6084438775510208,22.959693877551018 L 1.2159438775510207,23.56719387755102 C 1.6659438775510207,24.01719387755102 2.3634438775510205,24.01719387755102 2.8134438775510207,23.56719387755102 L 3.3984438775510215,22.959693877551018 C 3.848443877551021,22.50969387755102 3.848443877551021,21.812193877551017 3.3984438775510215,21.362193877551018 L 2.7909438775510216,20.777193877551017" stroke-linejoin="round"/>', '<path class="dot" d="M 8.79094437755102,13.777194177551017 L 8.790944377551018,13.777194177551017 C 8.340944377551018,13.327194177551016 7.643444377551019,13.327194177551016 7.193444377551019,13.777194177551017 L 6.608444377551019,14.362194177551018 C 6.158444377551019,14.812194177551017 6.158444377551019,15.509694177551017 6.608444377551019,15.959694177551018 L 7.215944377551018,16.567194177551016 C 7.6659443775510185,17.017194177551016 8.36344437755102,17.017194177551016 8.813444377551019,16.567194177551016 L 9.39844437755102,15.959694177551018 C 9.848444377551019,15.509694177551017 9.848444377551019,14.812194177551017 9.39844437755102,14.362194177551016 L 8.79094437755102,13.777194177551017" stroke-linejoin="round"/>', '<path class="dot" d="M 7.790943877551022,20.777192877551016 L 7.790943877551021,20.777192877551016 C 7.340943877551021,20.327192877551017 6.643443877551021,20.327192877551017 6.193443877551021,20.777192877551016 L 5.6084438775510215,21.362192877551017 C 5.158443877551021,21.812192877551016 5.158443877551021,22.509692877551018 5.6084438775510215,22.959692877551017 L 6.215943877551021,23.56719287755102 C 6.665943877551021,24.017192877551018 7.3634438775510205,24.017192877551018 7.813443877551021,23.56719287755102 L 8.39844387755102,22.959692877551017 C 8.848443877551022,22.509692877551018 8.848443877551022,21.812192877551016 8.39844387755102,21.362192877551017 L 7.790943877551022,20.777192877551016" stroke-linejoin="round"/>', '<path class="dot" d="M 13.790943877551019,13.777193177551018 L 13.790943877551019,13.777193177551018 C 13.34094387755102,13.327193177551017 12.64344387755102,13.327193177551017 12.193443877551019,13.777193177551018 L 11.60844387755102,14.362193177551017 C 11.158443877551019,14.812193177551018 11.158443877551019,15.509693177551018 11.60844387755102,15.959693177551017 L 12.21594387755102,16.56719317755102 C 12.665943877551019,17.017193177551018 13.363443877551019,17.017193177551018 13.81344387755102,16.56719317755102 L 14.39844387755102,15.959693177551017 C 14.84844387755102,15.509693177551018 14.84844387755102,14.812193177551018 14.39844387755102,14.362193177551017 L 13.790943877551019,13.777193177551018" stroke-linejoin="round"/>', '<path class="dot" d="M 7.79094387755102,6.777191877551016 L 7.790943877551019,6.777191877551016 C 7.34094387755102,6.327191877551016 6.643443877551019,6.327191877551016 6.19344387755102,6.777191877551016 L 5.60844387755102,7.362191877551016 C 5.1584438775510195,7.812191877551016 5.1584438775510195,8.509691877551017 5.60844387755102,8.959691877551016 L 6.21594387755102,9.567191877551016 C 6.665943877551019,10.017191877551015 7.363443877551019,10.017191877551015 7.813443877551019,9.567191877551016 L 8.39844387755102,8.959691877551016 C 8.84844387755102,8.509691877551017 8.84844387755102,7.812191877551016 8.39844387755102,7.362191877551016 L 7.79094387755102,6.777191877551016" stroke-linejoin="round"/>']
            
            
            <path d="M 2.000000000000001,22.0 L 8.000000499999999,15.000000299999998 L 1.9999999999999991,7.999999 M 7.000000000000001,21.999999 L 13.0,14.999999299999999 L 6.999999999999999,7.999997999999998" fill="none"
            stroke="black"
            stroke-width="2.5"
            stroke-linecap="round"
            stroke-linejoin="round"
            />
            
            
        </svg>