<?xml version="1.0"?><!DOCTYPE svg PUBLIC "-//W3C//DTD SVG 1.1//EN" "http://www.w3.org/Graphics/SVG/1.1/DTD/svg11.dtd"><svg xmlns="http://www.w3.org/2000/svg" xmlns:xlink="http://www.w3.org/1999/xlink" width="350" height="1000" viewBox="0 0 10 26" >
            
                ['<path class="dot" d="M 2.5195833333333333,4.140271133333333 L 2.5195833333333333,4.140271133333333 C 2.2295833333333333,3.8502711333333326 1.7800833333333332,3.8502711333333326 1.4900833333333332,4.140271133333333 L 1.1130833333333332,4.517271133333333 C 0.8230833333333332,4.807271133333333 0.8230833333333331,5.2567711333333325 1.1130833333333332,5.546771133333333 L 1.5045833333333332,5.938271133333332 C 1.794583333333333,6.228271133333333 2.244083333333333,6.228271133333333 2.5340833333333332,5.938271133333332 L 2.9110833333333335,5.546771133333333 C 3.2010833333333335,5.2567711333333325 3.2010833333333335,4.807271133333333 2.9110833333333335,4.517271133333333 L 2.5195833333333333,4.140271133333333" stroke-linejoin="round"/>', '<path class="dot" d="M 2.5195833333333333,14.140270833333332 L 2.5195833333333333,14.140270833333332 C 2.2295833333333333,13.850270833333333 1.7800833333333332,13.850270833333333 1.4900833333333332,14.140270833333332 L 1.1130833333333332,14.517270833333333 C 0.8230833333333332,14.807270833333334 0.8230833333333331,15.256770833333333 1.1130833333333332,15.546770833333333 L 1.5045833333333332,15.938270833333332 C 1.794583333333333,16.228270833333333 2.244083333333333,16.228270833333333 2.5340833333333332,15.938270833333332 L 2.9110833333333335,15.546770833333333 C 3.2010833333333335,15.256770833333333 3.2010833333333335,14.807270833333334 2.9110833333333335,14.517270833333333 L 2.5195833333333333,14.140270833333332" stroke-linejoin="round"/>']
            
                ['<path class="dot" d="M 2.5195833333333333,7.1402709333333325 L 2.5195833333333333,7.1402709333333325 C 2.2295833333333333,6.8502709333333325 1.7800833333333332,6.8502709333333325 1.4900833333333332,7.1402709333333325 L 1.1130833333333332,7.517270933333332 C 0.8230833333333332,7.807270933333332 0.8230833333333331,8.256770933333332 1.1130833333333332,8.546770933333333 L 1.5045833333333332,8.938270933333332 C 1.794583333333333,9.228270933333333 2.244083333333333,9.228270933333333 2.5340833333333332,8.938270933333332 L 2.9110833333333335,8.546770933333333 C 3.2010833333333335,8.256770933333332 3.2010833333333335,7.807270933333332 2.9110833333333335,7.517270933333332 L 2.5195833333333333,7.1402709333333325" stroke-linejoin="round"/>', '<path class="dot" d="M 3.5195832933333335,5.140270793333333 L 3.5195832933333335,5.140270793333333 C 3.2295832933333335,4.850270793333333 2.7800832933333335,4.850270793333333 2.4900832933333334,5.140270793333333 L 2.1130832933333332,5.517270793333333 C 1.8230832933333334,5.807270793333333 1.8230832933333334,6.256770793333333 2.1130832933333332,6.546770793333334 L 2.5045832933333334,6.9382707933333325 C 2.794583293333333,7.228270793333333 3.2440832933333335,7.228270793333333 3.5340832933333335,6.9382707933333325 L 3.9110832933333337,6.546770793333334 C 4.201083293333333,6.256770793333333 4.201083293333333,5.807270793333333 3.9110832933333337,5.517270793333333 L 3.5195832933333335,5.140270793333333" stroke-linejoin="round"/>', '<path class="dot" d="M 4.519583233333333,4.140271083333323 L 4.519583233333333,4.140271083333323 C 4.229583233333333,3.8502710833333222 3.780083233333333,3.8502710833333222 3.490083233333333,4.140271083333323 L 3.1130832333333327,4.5172710833333225 C 2.8230832333333327,4.8072710833333225 2.8230832333333327,5.256771083333323 3.1130832333333327,5.546771083333322 L 3.504583233333333,5.938271083333323 C 3.7945832333333325,6.228271083333322 4.244083233333333,6.228271083333322 4.534083233333333,5.938271083333323 L 4.911083233333333,5.546771083333322 C 5.201083233333334,5.256771083333323 5.201083233333334,4.8072710833333225 4.911083233333333,4.5172710833333225 L 4.519583233333333,4.140271083333323" stroke-linejoin="round"/>', '<path class="dot" d="M 6.519583133333333,4.140270833333333 L 6.519583133333332,4.140270833333333 C 6.229583133333332,3.8502708333333326 5.780083133333332,3.8502708333333326 5.490083133333332,4.140270833333333 L 5.113083133333332,4.517270833333333 C 4.823083133333332,4.807270833333333 4.823083133333332,5.2567708333333325 5.113083133333332,5.546770833333333 L 5.504583133333332,5.938270833333332 C 5.794583133333332,6.228270833333333 6.244083133333332,6.228270833333333 6.534083133333332,5.938270833333332 L 6.9110831333333325,5.546770833333333 C 7.2010831333333325,5.2567708333333325 7.2010831333333325,4.807270833333333 6.9110831333333325,4.517270833333333 L 6.519583133333333,4.140270833333333" stroke-linejoin="round"/>', '<path class="dot" d="M 7.519583133333333,5.140270793333333 L 7.519583133333332,5.140270793333333 C 7.229583133333332,4.850270793333333 6.780083133333332,4.850270793333333 6.490083133333332,5.140270793333333 L 6.113083133333332,5.517270793333333 C 5.823083133333332,5.807270793333333 5.823083133333332,6.256770793333333 6.113083133333332,6.546770793333334 L 6.504583133333332,6.9382707933333325 C 6.794583133333332,7.228270793333333 7.244083133333332,7.228270793333333 7.534083133333332,6.9382707933333325 L 7.9110831333333325,6.546770793333334 C 8.201083133333332,6.256770793333333 8.201083133333332,5.807270793333333 7.9110831333333325,5.517270793333333 L 7.519583133333333,5.140270793333333" stroke-linejoin="round"/>', '<path class="dot" d="M 8.519583133333333,7.140270733333333 L 8.519583133333333,7.140270733333333 C 8.229583133333332,6.850270733333333 7.780083133333332,6.850270733333333 7.490083133333332,7.140270733333333 L 7.113083133333332,7.517270733333333 C 6.823083133333332,7.807270733333333 6.823083133333332,8.256770733333333 7.113083133333332,8.546770733333332 L 7.504583133333332,8.938270733333333 C 7.794583133333332,9.228270733333332 8.244083133333332,9.228270733333332 8.534083133333333,8.938270733333333 L 8.911083133333332,8.546770733333332 C 9.201083133333332,8.256770733333333 9.201083133333332,7.807270733333333 8.911083133333332,7.517270733333333 L 8.519583133333333,7.140270733333333" stroke-linejoin="round"/>', '<path class="dot" d="M 8.519583333333333,14.140270833333332 L 8.519583333333333,14.140270833333332 C 8.229583333333332,13.850270833333333 7.780083333333333,13.850270833333333 7.490083333333333,14.140270833333332 L 7.113083333333333,14.517270833333333 C 6.823083333333333,14.807270833333334 6.823083333333333,15.256770833333333 7.113083333333333,15.546770833333333 L 7.504583333333333,15.938270833333332 C 7.794583333333333,16.228270833333333 8.244083333333332,16.228270833333333 8.534083333333333,15.938270833333332 L 8.911083333333334,15.546770833333333 C 9.201083333333333,15.256770833333333 9.201083333333333,14.807270833333334 8.911083333333334,14.517270833333333 L 8.519583333333333,14.140270833333332" stroke-linejoin="round"/>']
            
            
            <path d="M 2.0,5.0000003 L 2.0,15.0" fill="none"
            stroke="black"
            stroke-width="1.5"
            stroke-linecap="round"
            stroke-linejoin="round"
            />
            
            <path d="M 2.0,8.0000001 L 2.9999999600000002,5.99999996 L 3.9999998999999997,5.00000024999999 L 5.999999799999999,5.0 L 6.999999799999999,5.99999996 L 7.999999799999999,7.9999999 L 8.0,15.0" fill="none"
            stroke="black"
            stroke-width="1.5"
            stroke-linecap="round"
            stroke-linejoin="round"
            />
            
            
        </svg>