<?xml version="1.0"?><!DOCTYPE svg PUBLIC "-//W3C//DTD SVG 1.1//EN" "http://www.w3.org/Graphics/SVG/1.1/DTD/svg11.dtd"><svg xmlns="http://www.w3.org/2000/svg" xmlns:xlink="http://www.w3.org/1999/xlink" width="350" height="1000" viewBox="0 0 10 26" >
            
                ['<path class="dot" d="M 9.519583333333333,7.140270833333333 L 9.519583333333333,7.140270833333333 C 9.229583333333332,6.850270833333333 8.780083333333332,6.850270833333333 8.490083333333333,7.140270833333333 L 8.113083333333332,7.517270833333333 C 7.823083333333333,7.807270833333333 7.823083333333333,8.256770833333333 8.113083333333332,8.546770833333333 L 8.504583333333333,8.938270833333332 C 8.794583333333332,9.228270833333333 9.244083333333332,9.228270833333333 9.534083333333333,8.938270833333332 L 9.911083333333334,8.546770833333333 C 10.201083333333333,8.256770833333333 10.201083333333333,7.807270833333333 9.911083333333334,7.517270833333333 L 9.519583333333333,7.140270833333333" stroke-linejoin="round"/>', '<path class="dot" d="M 9.519583333333333,6.140270833333333 L 9.519583333333333,6.140270833333333 C 9.229583333333332,5.850270833333333 8.780083333333332,5.850270833333333 8.490083333333333,6.140270833333333 L 8.113083333333332,6.517270833333333 C 7.823083333333333,6.807270833333333 7.823083333333333,7.2567708333333325 8.113083333333332,7.546770833333333 L 8.504583333333333,7.938270833333332 C 8.794583333333332,8.228270833333333 9.244083333333332,8.228270833333333 9.534083333333333,7.938270833333332 L 9.911083333333334,7.546770833333333 C 10.201083333333333,7.2567708333333325 10.201083333333333,6.807270833333333 9.911083333333334,6.517270833333333 L 9.519583333333333,6.140270833333333" stroke-linejoin="round"/>', '<path class="dot" d="M 8.519583333333333,5.140270833333333 L 8.519583333333333,5.140270833333333 C 8.229583333333332,4.850270833333333 7.780083333333333,4.850270833333333 7.490083333333333,5.140270833333333 L 7.113083333333333,5.517270833333333 C 6.823083333333333,5.807270833333333 6.823083333333333,6.2567708333333325 7.113083333333333,6.546770833333333 L 7.504583333333333,6.938270833333332 C 7.794583333333333,7.228270833333333 8.244083333333332,7.228270833333333 8.534083333333333,6.938270833333332 L 8.911083333333334,6.546770833333333 C 9.201083333333333,6.2567708333333325 9.201083333333333,5.807270833333333 8.911083333333334,5.517270833333333 L 8.519583333333333,5.140270833333333" stroke-linejoin="round"/>', '<path class="dot" d="M 7.519583333333333,5.140270833333333 L 7.519583333333332,5.140270833333333 C 7.229583333333332,4.850270833333333 6.780083333333333,4.850270833333333 6.490083333333333,5.140270833333333 L 6.113083333333333,5.517270833333333 C 5.823083333333333,5.807270833333333 5.823083333333333,6.2567708333333325 6.113083333333333,6.546770833333333 L 6.504583333333333,6.938270833333332 C 6.794583333333333,7.228270833333333 7.244083333333332,7.228270833333333 7.534083333333332,6.938270833333332 L 7.911083333333333,6.546770833333333 C 8.201083333333333,6.2567708333333325 8.201083333333333,5.807270833333333 7.911083333333333,5.517270833333333 L 7.519583333333333,5.140270833333333" stroke-linejoin="round"/>', '<path class="dot" d="M 5.519583333333333,13.140270833333332 L 5.519583333333333,13.140270833333332 C 5.229583333333333,12.850270833333333 4.780083333333333,12.850270833333333 4.490083333333333,13.140270833333332 L 4.113083333333333,13.517270833333333 C 3.823083333333333,13.807270833333334 3.823083333333333,14.256770833333333 4.113083333333333,14.546770833333333 L 4.504583333333333,14.938270833333332 C 4.794583333333333,15.228270833333333 5.244083333333333,15.228270833333333 5.534083333333333,14.938270833333332 L 5.911083333333334,14.546770833333333 C 6.201083333333333,14.256770833333333 6.201083333333333,13.807270833333334 5.911083333333334,13.517270833333333 L 5.519583333333333,13.140270833333332" stroke-linejoin="round"/>', '<path class="dot" d="M 4.519583333333333,14.140270833333332 L 4.519583333333333,14.140270833333332 C 4.229583333333333,13.850270833333333 3.7800833333333332,13.850270833333333 3.490083333333333,14.140270833333332 L 3.113083333333333,14.517270833333333 C 2.823083333333333,14.807270833333334 2.823083333333333,15.256770833333333 3.113083333333333,15.546770833333333 L 3.504583333333333,15.938270833333332 C 3.7945833333333328,16.228270833333333 4.244083333333333,16.228270833333333 4.534083333333333,15.938270833333332 L 4.911083333333334,15.546770833333333 C 5.201083333333333,15.256770833333333 5.201083333333333,14.807270833333334 4.911083333333334,14.517270833333333 L 4.519583333333333,14.140270833333332" stroke-linejoin="round"/>', '<path class="dot" d="M 2.5195833333333333,14.140270833333332 L 2.5195833333333333,14.140270833333332 C 2.2295833333333333,13.850270833333333 1.7800833333333332,13.850270833333333 1.4900833333333332,14.140270833333332 L 1.1130833333333332,14.517270833333333 C 0.8230833333333332,14.807270833333334 0.8230833333333331,15.256770833333333 1.1130833333333332,15.546770833333333 L 1.5045833333333332,15.938270833333332 C 1.794583333333333,16.228270833333333 2.244083333333333,16.228270833333333 2.5340833333333332,15.938270833333332 L 2.9110833333333335,15.546770833333333 C 3.2010833333333335,15.256770833333333 3.2010833333333335,14.807270833333334 2.9110833333333335,14.517270833333333 L 2.5195833333333333,14.140270833333332" stroke-linejoin="round"/>', '<path class="dot" d="M 1.5195833333333333,11.140270833333332 L 1.519583333333333,11.140270833333332 C 1.2295833333333333,10.850270833333333 0.7800833333333331,10.850270833333333 0.4900833333333331,11.140270833333332 L 0.11308333333333317,11.517270833333333 C -0.17691666666666686,11.807270833333334 -0.17691666666666692,12.256770833333333 0.11308333333333317,12.546770833333333 L 0.504583333333333,12.938270833333332 C 0.794583333333333,13.228270833333333 1.2440833333333332,13.228270833333333 1.534083333333333,12.938270833333332 L 1.9110833333333335,12.546770833333333 C 2.2010833333333335,12.256770833333333 2.2010833333333335,11.807270833333334 1.9110833333333335,11.517270833333333 L 1.5195833333333335,11.140270833333332" stroke-linejoin="round"/>', '<path class="dot" d="M 1.5195833333333333,9.108949033333332 L 1.519583333333333,9.108949033333332 C 1.2295833333333333,8.818949033333332 0.7800833333333331,8.818949033333332 0.4900833333333331,9.108949033333332 L 0.11308333333333317,9.485949033333332 C -0.17691666666666686,9.775949033333333 -0.17691666666666692,10.225449033333332 0.11308333333333317,10.515449033333333 L 0.504583333333333,10.906949033333332 C 0.794583333333333,11.196949033333333 1.2440833333333332,11.196949033333333 1.534083333333333,10.906949033333332 L 1.9110833333333335,10.515449033333333 C 2.2010833333333335,10.225449033333332 2.2010833333333335,9.775949033333333 1.9110833333333335,9.485949033333332 L 1.5195833333333335,9.108949033333332" stroke-linejoin="round"/>', '<path class="dot" d="M 2.5195833333333333,7.140270833333333 L 2.5195833333333333,7.140270833333333 C 2.2295833333333333,6.850270833333333 1.7800833333333332,6.850270833333333 1.4900833333333332,7.140270833333333 L 1.1130833333333332,7.517270833333333 C 0.8230833333333332,7.807270833333333 0.8230833333333331,8.256770833333333 1.1130833333333332,8.546770833333333 L 1.5045833333333332,8.938270833333332 C 1.794583333333333,9.228270833333333 2.244083333333333,9.228270833333333 2.5340833333333332,8.938270833333332 L 2.9110833333333335,8.546770833333333 C 3.2010833333333335,8.256770833333333 3.2010833333333335,7.807270833333333 2.9110833333333335,7.517270833333333 L 2.5195833333333333,7.140270833333333" stroke-linejoin="round"/>', '<path class="dot" d="M 5.519583333333333,4.140270833333333 L 5.519583333333333,4.140270833333333 C 5.229583333333333,3.8502708333333326 4.780083333333333,3.8502708333333326 4.490083333333333,4.140270833333333 L 4.113083333333333,4.517270833333333 C 3.823083333333333,4.807270833333333 3.823083333333333,5.2567708333333325 4.113083333333333,5.546770833333333 L 4.504583333333333,5.938270833333332 C 4.794583333333333,6.228270833333333 5.244083333333333,6.228270833333333 5.534083333333333,5.938270833333332 L 5.911083333333334,5.546770833333333 C 6.201083333333333,5.2567708333333325 6.201083333333333,4.807270833333333 5.911083333333334,4.517270833333333 L 5.519583333333333,4.140270833333333" stroke-linejoin="round"/>', '<path class="dot" d="M 5.519583333333333,2.140270833333333 L 5.519583333333333,2.140270833333333 C 5.229583333333333,1.850270833333333 4.780083333333333,1.850270833333333 4.490083333333333,2.140270833333333 L 4.113083333333333,2.5172708333333333 C 3.823083333333333,2.807270833333333 3.823083333333333,3.2567708333333334 4.113083333333333,3.5467708333333334 L 4.504583333333333,3.938270833333333 C 4.794583333333333,4.228270833333333 5.244083333333333,4.228270833333333 5.534083333333333,3.938270833333333 L 5.911083333333334,3.5467708333333334 C 6.201083333333333,3.2567708333333334 6.201083333333333,2.8072708333333334 5.911083333333334,2.517270833333333 L 5.519583333333333,2.140270833333333" stroke-linejoin="round"/>', '<path class="dot" d="M 4.519583333333333,0.1402708333333331 L 4.519583333333333,0.1402708333333331 C 4.229583333333333,-0.14972916666666694 3.7800833333333332,-0.149729166666667 3.490083333333333,0.1402708333333331 L 3.113083333333333,0.5172708333333332 C 2.823083333333333,0.8072708333333332 2.823083333333333,1.2567708333333332 3.113083333333333,1.5467708333333332 L 3.504583333333333,1.938270833333333 C 3.7945833333333328,2.228270833333333 4.244083333333333,2.228270833333333 4.534083333333333,1.938270833333333 L 4.911083333333334,1.5467708333333332 C 5.201083333333333,1.2567708333333332 5.201083333333333,0.8072708333333333 4.911083333333334,0.5172708333333331 L 4.519583333333333,0.14027083333333312" stroke-linejoin="round"/>', '<path class="dot" d="M 3.5195833333333333,0.1402708333333331 L 3.5195833333333333,0.1402708333333331 C 3.2295833333333333,-0.14972916666666694 2.7800833333333332,-0.149729166666667 2.490083333333333,0.1402708333333331 L 2.113083333333333,0.5172708333333332 C 1.8230833333333332,0.8072708333333332 1.8230833333333332,1.2567708333333332 2.113083333333333,1.5467708333333332 L 2.504583333333333,1.938270833333333 C 2.7945833333333328,2.228270833333333 3.244083333333333,2.228270833333333 3.5340833333333332,1.938270833333333 L 3.9110833333333335,1.5467708333333332 C 4.201083333333333,1.2567708333333332 4.201083333333333,0.8072708333333333 3.9110833333333335,0.5172708333333331 L 3.5195833333333333,0.14027083333333312" stroke-linejoin="round"/>', '<path class="dot" d="M 2.5195833333333333,2.140270833333333 L 2.5195833333333333,2.140270833333333 C 2.2295833333333333,1.850270833333333 1.7800833333333332,1.850270833333333 1.4900833333333332,2.140270833333333 L 1.1130833333333332,2.5172708333333333 C 0.8230833333333332,2.807270833333333 0.8230833333333331,3.2567708333333334 1.1130833333333332,3.5467708333333334 L 1.5045833333333332,3.938270833333333 C 1.794583333333333,4.228270833333333 2.244083333333333,4.228270833333333 2.5340833333333332,3.938270833333333 L 2.9110833333333335,3.5467708333333334 C 3.2010833333333335,3.2567708333333334 3.2010833333333335,2.8072708333333334 2.9110833333333335,2.517270833333333 L 2.5195833333333333,2.140270833333333" stroke-linejoin="round"/>', '<path class="dot" d="M 2.5195833333333333,3.1402708333333327 L 2.5195833333333333,3.1402708333333327 C 2.2295833333333333,2.8502708333333326 1.7800833333333332,2.8502708333333326 1.4900833333333332,3.1402708333333327 L 1.1130833333333332,3.517270833333333 C 0.8230833333333332,3.807270833333333 0.8230833333333331,4.2567708333333325 1.1130833333333332,4.546770833333333 L 1.5045833333333332,4.938270833333332 C 1.794583333333333,5.228270833333333 2.244083333333333,5.228270833333333 2.5340833333333332,4.938270833333332 L 2.9110833333333335,4.546770833333333 C 3.2010833333333335,4.2567708333333325 3.2010833333333335,3.807270833333333 2.9110833333333335,3.517270833333333 L 2.5195833333333333,3.140270833333333" stroke-linejoin="round"/>', '<path class="dot" d="M 7.519583333333333,14.140270833333332 L 7.519583333333332,14.140270833333332 C 7.229583333333332,13.850270833333333 6.780083333333333,13.850270833333333 6.490083333333333,14.140270833333332 L 6.113083333333333,14.517270833333333 C 5.823083333333333,14.807270833333334 5.823083333333333,15.256770833333333 6.113083333333333,15.546770833333333 L 6.504583333333333,15.938270833333332 C 6.794583333333333,16.228270833333333 7.244083333333332,16.228270833333333 7.534083333333332,15.938270833333332 L 7.911083333333333,15.546770833333333 C 8.201083333333333,15.256770833333333 8.201083333333333,14.807270833333334 7.911083333333333,14.517270833333333 L 7.519583333333333,14.140270833333332" stroke-linejoin="round"/>', '<path class="dot" d="M 8.519583333333333,14.140270833333332 L 8.519583333333333,14.140270833333332 C 8.229583333333332,13.850270833333333 7.780083333333333,13.850270833333333 7.490083333333333,14.140270833333332 L 7.113083333333333,14.517270833333333 C 6.823083333333333,14.807270833333334 6.823083333333333,15.256770833333333 7.113083333333333,15.546770833333333 L 7.504583333333333,15.938270833333332 C 7.794583333333333,16.228270833333333 8.244083333333332,16.228270833333333 8.534083333333333,15.938270833333332 L 8.911083333333334,15.546770833333333 C 9.201083333333333,15.256770833333333 9.201083333333333,14.807270833333334 8.911083333333334,14.517270833333333 L 8.519583333333333,14.140270833333332" stroke-linejoin="round"/>', '<path class="dot" d="M 9.519583333333333,13.140270833333332 L 9.519583333333333,13.140270833333332 C 9.229583333333332,12.850270833333333 8.780083333333332,12.850270833333333 8.490083333333333,13.140270833333332 L 8.113083333333332,13.517270833333333 C 7.823083333333333,13.807270833333334 7.823083333333333,14.256770833333333 8.113083333333332,14.546770833333333 L 8.504583333333333,14.938270833333332 C 8.794583333333332,15.228270833333333 9.244083333333332,15.228270833333333 9.534083333333333,14.938270833333332 L 9.911083333333334,14.546770833333333 C 10.201083333333333,14.256770833333333 10.201083333333333,13.807270833333334 9.911083333333334,13.517270833333333 L 9.519583333333333,13.140270833333332" stroke-linejoin="round"/>', '<path class="dot" d="M 9.519583333333333,12.140270833333332 L 9.519583333333333,12.140270833333332 C 9.229583333333332,11.850270833333333 8.780083333333332,11.850270833333333 8.490083333333333,12.140270833333332 L 8.113083333333332,12.517270833333333 C 7.823083333333333,12.807270833333334 7.823083333333333,13.256770833333333 8.113083333333332,13.546770833333333 L 8.504583333333333,13.938270833333332 C 8.794583333333332,14.228270833333333 9.244083333333332,14.228270833333333 9.534083333333333,13.938270833333332 L 9.911083333333334,13.546770833333333 C 10.201083333333333,13.256770833333333 10.201083333333333,12.807270833333334 9.911083333333334,12.517270833333333 L 9.519583333333333,12.140270833333332" stroke-linejoin="round"/>']
            
            
            <path d="M 9.0,8.0 L 9.0,7.0 L 8.0,6.0 L 7.0,6.0 L 5.0,14.0 L 4.0,15.0 L 2.0,15.0 L 1.0,12.0 L 1.0,9.9686782 L 2.0,8.0 L 5.0,5.0 L 5.0,3.0 L 4.0,1.0 L 3.0,1.0 L 2.0,3.0 L 2.0,4.0 L 7.0,15.0 L 8.0,15.0 L 9.0,14.0 L 9.0,13.0" fill="none"
            stroke="black"
            stroke-width="1.5"
            stroke-linecap="round"
            stroke-linejoin="round"
            />
            
            
        </svg>