<?xml version="1.0" encoding="UTF-8" standalone="no"?>
<svg
   data-dec="111"
   width="10"
   height="14"
   version="1.1"
   id="svg2561"
   sodipodi:docname="o.svg"
   inkscape:version="1.3.2 (091e20ef0f, 2023-11-25, custom)"
   xmlns:inkscape="http://www.inkscape.org/namespaces/inkscape"
   xmlns:sodipodi="http://sodipodi.sourceforge.net/DTD/sodipodi-0.dtd"
   xmlns="http://www.w3.org/2000/svg"
   xmlns:svg="http://www.w3.org/2000/svg"
   xmlns:rdf="http://www.w3.org/1999/02/22-rdf-syntax-ns#"
   xmlns:cc="http://creativecommons.org/ns#"
   xmlns:dc="http://purl.org/dc/elements/1.1/">
  <metadata
     id="metadata2567">
    <rdf:RDF>
      <cc:Work
         rdf:about="">
        <dc:format>image/svg+xml</dc:format>
        <dc:type
           rdf:resource="http://purl.org/dc/dcmitype/StillImage" />
      </cc:Work>
    </rdf:RDF>
  </metadata>
  <defs
     id="defs2565" />
  <sodipodi:namedview
     pagecolor="#ffffff"
     bordercolor="#666666"
     borderopacity="1"
     objecttolerance="10"
     gridtolerance="10"
     guidetolerance="10"
     inkscape:pageopacity="0"
     inkscape:pageshadow="2"
     inkscape:window-width="1706"
     inkscape:window-height="1221"
     id="namedview2563"
     showgrid="true"
     inkscape:zoom="23.6"
     inkscape:cx="8.4745763"
     inkscape:cy="15.042373"
     inkscape:window-x="26"
     inkscape:window-y="23"
     inkscape:window-maximized="0"
     inkscape:current-layer="svg2561"
     showguides="true"
     inkscape:guide-bbox="true"
     inkscape:showpageshadow="2"
     inkscape:pagecheckerboard="0"
     inkscape:deskcolor="#d1d1d1">
    <inkscape:grid
       type="xygrid"
       id="grid3112"
       originx="-2"
       originy="-8"
       spacingy="1"
       spacingx="1"
       units="px"
       visible="true" />
    <sodipodi:guide
       position="7,40"
       orientation="0,1"
       id="guide3208"
       inkscape:locked="false" />
    <sodipodi:guide
       position="8,26"
       orientation="0,1"
       id="guide3210"
       inkscape:locked="false" />
    <sodipodi:guide
       position="10,47"
       orientation="0,1"
       id="guide3212"
       inkscape:locked="false" />
    <sodipodi:guide
       position="7,19"
       orientation="0,1"
       id="guide3214"
       inkscape:locked="false" />
  </sodipodi:namedview>
  <path
     d="M 8,13 10,9 V 5 L 8,1 6,0 H 4 L 2,1 0,5 v 4 l 2,4 2,1 h 2 z"
     style="fill:none;stroke:none;stroke-width:2.02367;stroke-linecap:round;stroke-linejoin:round;stroke-opacity:1"
     id="path3187"
     inkscape:connector-curvature="0"
     sodipodi:nodetypes="ccccccccccccc" />
  <path
     d="M 8,13 10,9 V 5 L 8,1 6,0 H 4 L 2,1 0,5 v 4 l 2,4 2,1 h 2 z"
     style="fill:none;stroke:none;stroke-width:2.02367;stroke-linecap:round;stroke-linejoin:round;stroke-opacity:1"
     id="path1"
     inkscape:connector-curvature="0"
     sodipodi:nodetypes="ccccccccccccc" />
</svg>
