<?xml version="1.0"?><!DOCTYPE svg PUBLIC "-//W3C//DTD SVG 1.1//EN" "http://www.w3.org/Graphics/SVG/1.1/DTD/svg11.dtd"><svg xmlns="http://www.w3.org/2000/svg" xmlns:xlink="http://www.w3.org/1999/xlink" width="350" height="1000" viewBox="0 0 10 26" >
            
                ['<path class="dot" d="M 5.519583333333333,4.140271133333333 L 5.519583333333333,4.140271133333333 C 5.229583333333333,3.8502711333333326 4.780083333333333,3.8502711333333326 4.490083333333333,4.140271133333333 L 4.113083333333333,4.517271133333333 C 3.823083333333333,4.807271133333333 3.823083333333333,5.2567711333333325 4.113083333333333,5.546771133333333 L 4.504583333333333,5.938271133333332 C 4.794583333333333,6.228271133333333 5.244083333333333,6.228271133333333 5.534083333333333,5.938271133333332 L 5.911083333333334,5.546771133333333 C 6.201083333333333,5.2567711333333325 6.201083333333333,4.807271133333333 5.911083333333334,4.517271133333333 L 5.519583333333333,4.140271133333333" stroke-linejoin="round"/>', '<path class="dot" d="M 5.519583333333333,14.140270833333332 L 5.519583333333333,14.140270833333332 C 5.229583333333333,13.850270833333333 4.780083333333333,13.850270833333333 4.490083333333333,14.140270833333332 L 4.113083333333333,14.517270833333333 C 3.823083333333333,14.807270833333334 3.823083333333333,15.256770833333333 4.113083333333333,15.546770833333333 L 4.504583333333333,15.938270833333332 C 4.794583333333333,16.228270833333333 5.244083333333333,16.228270833333333 5.534083333333333,15.938270833333332 L 5.911083333333334,15.546770833333333 C 6.201083333333333,15.256770833333333 6.201083333333333,14.807270833333334 5.911083333333334,14.517270833333333 L 5.519583333333333,14.140270833333332" stroke-linejoin="round"/>']
            
                ['<path class="dot" d="M 2.5195833333333333,4.140270833333333 L 2.5195833333333333,4.140270833333333 C 2.2295833333333333,3.8502708333333326 1.7800833333333332,3.8502708333333326 1.4900833333333332,4.140270833333333 L 1.1130833333333332,4.517270833333333 C 0.8230833333333332,4.807270833333333 0.8230833333333331,5.2567708333333325 1.1130833333333332,5.546770833333333 L 1.5045833333333332,5.938270833333332 C 1.794583333333333,6.228270833333333 2.244083333333333,6.228270833333333 2.5340833333333332,5.938270833333332 L 2.9110833333333335,5.546770833333333 C 3.2010833333333335,5.2567708333333325 3.2010833333333335,4.807270833333333 2.9110833333333335,4.517270833333333 L 2.5195833333333333,4.140270833333333" stroke-linejoin="round"/>', '<path class="dot" d="M 5.519583333333333,4.140270833333333 L 5.519583333333333,4.140270833333333 C 5.229583333333333,3.8502708333333326 4.780083333333333,3.8502708333333326 4.490083333333333,4.140270833333333 L 4.113083333333333,4.517270833333333 C 3.823083333333333,4.807270833333333 3.823083333333333,5.2567708333333325 4.113083333333333,5.546770833333333 L 4.504583333333333,5.938270833333332 C 4.794583333333333,6.228270833333333 5.244083333333333,6.228270833333333 5.534083333333333,5.938270833333332 L 5.911083333333334,5.546770833333333 C 6.201083333333333,5.2567708333333325 6.201083333333333,4.807270833333333 5.911083333333334,4.517270833333333 L 5.519583333333333,4.140270833333333" stroke-linejoin="round"/>']
            
                ['<path class="dot" d="M 2.5195833333333333,14.140270833333332 L 2.5195833333333333,14.140270833333332 C 2.2295833333333333,13.850270833333333 1.7800833333333332,13.850270833333333 1.4900833333333332,14.140270833333332 L 1.1130833333333332,14.517270833333333 C 0.8230833333333332,14.807270833333334 0.8230833333333331,15.256770833333333 1.1130833333333332,15.546770833333333 L 1.5045833333333332,15.938270833333332 C 1.794583333333333,16.228270833333333 2.244083333333333,16.228270833333333 2.5340833333333332,15.938270833333332 L 2.9110833333333335,15.546770833333333 C 3.2010833333333335,15.256770833333333 3.2010833333333335,14.807270833333334 2.9110833333333335,14.517270833333333 L 2.5195833333333333,14.140270833333332" stroke-linejoin="round"/>', '<path class="dot" d="M 8.519583333333333,14.140270833333332 L 8.519583333333333,14.140270833333332 C 8.229583333333332,13.850270833333333 7.780083333333333,13.850270833333333 7.490083333333333,14.140270833333332 L 7.113083333333333,14.517270833333333 C 6.823083333333333,14.807270833333334 6.823083333333333,15.256770833333333 7.113083333333333,15.546770833333333 L 7.504583333333333,15.938270833333332 C 7.794583333333333,16.228270833333333 8.244083333333332,16.228270833333333 8.534083333333333,15.938270833333332 L 8.911083333333334,15.546770833333333 C 9.201083333333333,15.256770833333333 9.201083333333333,14.807270833333334 8.911083333333334,14.517270833333333 L 8.519583333333333,14.140270833333332" stroke-linejoin="round"/>']
            
                ['<path class="dot" d="M 7.519583333333333,2.1402704757054636 L 7.519583333333332,2.1402704757054636 C 7.229583333333332,1.8502704757054635 6.780083333333333,1.8502704757054635 6.490083333333333,2.1402704757054636 L 6.113083333333333,2.517270475705464 C 5.823083333333333,2.8072704757054634 5.823083333333333,3.256770475705464 6.113083333333333,3.546770475705464 L 6.504583333333333,3.9382704757054636 C 6.794583333333333,4.228270475705464 7.244083333333332,4.228270475705464 7.534083333333332,3.9382704757054636 L 7.911083333333333,3.546770475705464 C 8.201083333333333,3.256770475705464 8.201083333333333,2.807270475705464 7.911083333333333,2.5172704757054634 L 7.519583333333333,2.1402704757054636" stroke-linejoin="round"/>', '<path class="dot" d="M 5.519583333333333,0.1402705180775938 L 5.519583333333333,0.1402705180775938 C 5.229583333333333,-0.14972948192240623 4.780083333333333,-0.1497294819224063 4.490083333333333,0.1402705180775938 L 4.113083333333333,0.5172705180775939 C 3.823083333333333,0.8072705180775939 3.823083333333333,1.2567705180775939 4.113083333333333,1.546770518077594 L 4.504583333333333,1.9382705180775937 C 4.794583333333333,2.2282705180775935 5.244083333333333,2.2282705180775935 5.534083333333333,1.9382705180775937 L 5.911083333333334,1.546770518077594 C 6.201083333333333,1.2567705180775939 6.201083333333333,0.807270518077594 5.911083333333334,0.5172705180775938 L 5.519583333333333,0.14027051807759383" stroke-linejoin="round"/>', '<path class="dot" d="M 3.5195833333333333,2.1402704757054636 L 3.5195833333333333,2.1402704757054636 C 3.2295833333333333,1.8502704757054635 2.7800833333333332,1.8502704757054635 2.490083333333333,2.1402704757054636 L 2.113083333333333,2.517270475705464 C 1.8230833333333332,2.8072704757054634 1.8230833333333332,3.256770475705464 2.113083333333333,3.546770475705464 L 2.504583333333333,3.9382704757054636 C 2.7945833333333328,4.228270475705464 3.244083333333333,4.228270475705464 3.5340833333333332,3.9382704757054636 L 3.9110833333333335,3.546770475705464 C 4.201083333333333,3.256770475705464 4.201083333333333,2.807270475705464 3.9110833333333335,2.5172704757054634 L 3.5195833333333333,2.1402704757054636" stroke-linejoin="round"/>']
            
            
            <path d="M 5.0,5.0000003 L 5.0,15.0" fill="none"
            stroke="black"
            stroke-width="1.5"
            stroke-linecap="round"
            stroke-linejoin="round"
            />
            
            <path d="M 2.0,5.0 L 5.0,5.0" fill="none"
            stroke="black"
            stroke-width="1.5"
            stroke-linecap="round"
            stroke-linejoin="round"
            />
            
            <path d="M 2.0,15.0 L 8.0,15.0" fill="none"
            stroke="black"
            stroke-width="1.5"
            stroke-linecap="round"
            stroke-linejoin="round"
            />
            
            <path d="M 7.0,2.9999996423721305 L 5.0,0.9999996847442607 L 3.0,2.9999996423721305" fill="none"
            stroke="black"
            stroke-width="1.5"
            stroke-linecap="round"
            stroke-linejoin="round"
            />
            
            
        </svg>