<?xml version="1.0"?><!DOCTYPE svg PUBLIC "-//W3C//DTD SVG 1.1//EN" "http://www.w3.org/Graphics/SVG/1.1/DTD/svg11.dtd"><svg xmlns="http://www.w3.org/2000/svg" xmlns:xlink="http://www.w3.org/1999/xlink" width="350" height="1000" viewBox="0 0 10 26" >
            
                ['<path class="dot" d="M 7.519583333333333,0.1402708333333331 L 7.519583333333332,0.1402708333333331 C 7.229583333333332,-0.14972916666666694 6.780083333333333,-0.149729166666667 6.490083333333333,0.1402708333333331 L 6.113083333333333,0.5172708333333332 C 5.823083333333333,0.8072708333333332 5.823083333333333,1.2567708333333332 6.113083333333333,1.5467708333333332 L 6.504583333333333,1.938270833333333 C 6.794583333333333,2.228270833333333 7.244083333333332,2.228270833333333 7.534083333333332,1.938270833333333 L 7.911083333333333,1.5467708333333332 C 8.201083333333333,1.2567708333333332 8.201083333333333,0.8072708333333333 7.911083333333333,0.5172708333333331 L 7.519583333333333,0.14027083333333312" stroke-linejoin="round"/>', '<path class="dot" d="M 6.519583333333333,1.1507531333333332 L 6.519583333333332,1.1507531333333332 C 6.229583333333332,0.8607531333333331 5.780083333333333,0.860753133333333 5.490083333333333,1.1507531333333332 L 5.113083333333333,1.5277531333333334 C 4.823083333333333,1.8177531333333332 4.823083333333333,2.267253133333333 5.113083333333333,2.557253133333333 L 5.504583333333333,2.9487531333333328 C 5.794583333333333,3.238753133333333 6.244083333333332,3.238753133333333 6.534083333333332,2.9487531333333328 L 6.911083333333333,2.557253133333333 C 7.201083333333333,2.267253133333333 7.201083333333333,1.8177531333333334 6.911083333333333,1.5277531333333332 L 6.519583333333333,1.1507531333333332" stroke-linejoin="round"/>', '<path class="dot" d="M 4.519583333333333,4.140270833333333 L 4.519583333333333,4.140270833333333 C 4.229583333333333,3.8502708333333326 3.7800833333333332,3.8502708333333326 3.490083333333333,4.140270833333333 L 3.113083333333333,4.517270833333333 C 2.823083333333333,4.807270833333333 2.823083333333333,5.2567708333333325 3.113083333333333,5.546770833333333 L 3.504583333333333,5.938270833333332 C 3.7945833333333328,6.228270833333333 4.244083333333333,6.228270833333333 4.534083333333333,5.938270833333332 L 4.911083333333334,5.546770833333333 C 5.201083333333333,5.2567708333333325 5.201083333333333,4.807270833333333 4.911083333333334,4.517270833333333 L 4.519583333333333,4.140270833333333" stroke-linejoin="round"/>', '<path class="dot" d="M 3.5195833333333333,8.140270833333332 L 3.5195833333333333,8.140270833333332 C 3.2295833333333333,7.850270833333333 2.7800833333333332,7.850270833333333 2.490083333333333,8.140270833333332 L 2.113083333333333,8.517270833333333 C 1.8230833333333332,8.807270833333334 1.8230833333333332,9.256770833333333 2.113083333333333,9.546770833333333 L 2.504583333333333,9.938270833333332 C 2.7945833333333328,10.228270833333333 3.244083333333333,10.228270833333333 3.5340833333333332,9.938270833333332 L 3.9110833333333335,9.546770833333333 C 4.201083333333333,9.256770833333333 4.201083333333333,8.807270833333334 3.9110833333333335,8.517270833333333 L 3.5195833333333333,8.140270833333332" stroke-linejoin="round"/>', '<path class="dot" d="M 3.5195833333333333,10.140270833333332 L 3.5195833333333333,10.140270833333332 C 3.2295833333333333,9.850270833333333 2.7800833333333332,9.850270833333333 2.490083333333333,10.140270833333332 L 2.113083333333333,10.517270833333333 C 1.8230833333333332,10.807270833333334 1.8230833333333332,11.256770833333333 2.113083333333333,11.546770833333333 L 2.504583333333333,11.938270833333332 C 2.7945833333333328,12.228270833333333 3.244083333333333,12.228270833333333 3.5340833333333332,11.938270833333332 L 3.9110833333333335,11.546770833333333 C 4.201083333333333,11.256770833333333 4.201083333333333,10.807270833333334 3.9110833333333335,10.517270833333333 L 3.5195833333333333,10.140270833333332" stroke-linejoin="round"/>', '<path class="dot" d="M 4.519583333333333,14.140270833333332 L 4.519583333333333,14.140270833333332 C 4.229583333333333,13.850270833333333 3.7800833333333332,13.850270833333333 3.490083333333333,14.140270833333332 L 3.113083333333333,14.517270833333333 C 2.823083333333333,14.807270833333334 2.823083333333333,15.256770833333333 3.113083333333333,15.546770833333333 L 3.504583333333333,15.938270833333332 C 3.7945833333333328,16.228270833333333 4.244083333333333,16.228270833333333 4.534083333333333,15.938270833333332 L 4.911083333333334,15.546770833333333 C 5.201083333333333,15.256770833333333 5.201083333333333,14.807270833333334 4.911083333333334,14.517270833333333 L 4.519583333333333,14.140270833333332" stroke-linejoin="round"/>', '<path class="dot" d="M 6.519583333333333,17.127573833333336 L 6.519583333333332,17.127573833333336 C 6.229583333333332,16.837573833333334 5.780083333333333,16.837573833333334 5.490083333333333,17.127573833333336 L 5.113083333333333,17.504573833333335 C 4.823083333333333,17.794573833333335 4.823083333333333,18.244073833333335 5.113083333333333,18.534073833333334 L 5.504583333333333,18.925573833333335 C 5.794583333333333,19.215573833333334 6.244083333333332,19.215573833333334 6.534083333333332,18.925573833333335 L 6.911083333333333,18.534073833333334 C 7.201083333333333,18.244073833333335 7.201083333333333,17.794573833333335 6.911083333333333,17.504573833333335 L 6.519583333333333,17.127573833333336" stroke-linejoin="round"/>', '<path class="dot" d="M 7.519583333333333,18.140270833333336 L 7.519583333333332,18.140270833333336 C 7.229583333333332,17.850270833333333 6.780083333333333,17.850270833333333 6.490083333333333,18.140270833333336 L 6.113083333333333,18.517270833333335 C 5.823083333333333,18.807270833333334 5.823083333333333,19.256770833333334 6.113083333333333,19.546770833333333 L 6.504583333333333,19.938270833333334 C 6.794583333333333,20.228270833333333 7.244083333333332,20.228270833333333 7.534083333333332,19.938270833333334 L 7.911083333333333,19.546770833333333 C 8.201083333333333,19.256770833333334 8.201083333333333,18.807270833333334 7.911083333333333,18.517270833333335 L 7.519583333333333,18.140270833333336" stroke-linejoin="round"/>']
            
            
            <path d="M 7.0,1.0 L 6.0,2.0104823 L 4.0,5.0 L 3.0,9.0 L 3.0,11.0 L 4.0,15.0 L 6.0,17.987303 L 7.0,19.0" fill="none"
            stroke="black"
            stroke-width="1.5"
            stroke-linecap="round"
            stroke-linejoin="round"
            />
            
            
        </svg>