<?xml version="1.0" encoding="UTF-8" standalone="no"?>
<svg
   width="6"
   height="14"
   viewBox="0 0 0.24 0.56"
   version="1.1"
   id="svg25"
   sodipodi:docname="s-cap.svg"
   inkscape:version="1.3.2 (091e20ef0f, 2023-11-25, custom)"
   xml:space="preserve"
   xmlns:inkscape="http://www.inkscape.org/namespaces/inkscape"
   xmlns:sodipodi="http://sodipodi.sourceforge.net/DTD/sodipodi-0.dtd"
   xmlns="http://www.w3.org/2000/svg"
   xmlns:svg="http://www.w3.org/2000/svg"><defs
   id="defs25" /><sodipodi:namedview
   id="namedview25"
   pagecolor="#ffffff"
   bordercolor="#666666"
   borderopacity="1.0"
   inkscape:showpageshadow="2"
   inkscape:pageopacity="0.0"
   inkscape:pagecheckerboard="0"
   inkscape:deskcolor="#d1d1d1"
   showgrid="true"
   inkscape:zoom="65.73854"
   inkscape:cx="-0.56283574"
   inkscape:cy="5.6892045"
   inkscape:window-width="2560"
   inkscape:window-height="1403"
   inkscape:window-x="0"
   inkscape:window-y="0"
   inkscape:window-maximized="1"
   inkscape:current-layer="g2"
   showguides="true"><inkscape:grid
     id="grid25"
     units="px"
     originx="-0.079999998"
     originy="-0.039999999"
     spacingx="0.04"
     spacingy="0.04"
     empcolor="#0099e5"
     empopacity="0.30196078"
     color="#0099e5"
     opacity="0.14901961"
     empspacing="5"
     dotted="false"
     gridanglex="30"
     gridanglez="30"
     visible="true" /><sodipodi:guide
     position="-0.065287399,0.48000001"
     orientation="0,-1"
     id="guide29"
     inkscape:locked="false" /><sodipodi:guide
     position="-0.22187149,0.88"
     orientation="0,-1"
     id="guide30"
     inkscape:locked="false" /><sodipodi:guide
     position="0.10495839,1.04"
     orientation="0,-1"
     id="guide31"
     inkscape:locked="false" /><sodipodi:guide
     position="0.097602092,0.32000002"
     orientation="0,-1"
     id="guide32"
     inkscape:locked="false" /></sodipodi:namedview>
            
                ['', '']
            
                ['', '', '', '', '', '', '', '', '', '']
            
                ['', '', '', '', '', '', '', '', '', '']
            
            
            <g
   id="g29"
   transform="matrix(0.03,0,0,0.02857143,0.1161,0.35400001)"
   style="stroke-width:34.1565"><g
     id="g28"
     style="stroke-width:34.1565"><g
       id="g32"
       style="stroke:none;stroke-width:1350.16"
       transform="matrix(0.024,0,0,0.02666667,0.21487991,-2.5116004)"><g
         id="g33"
         style="stroke:none;stroke-width:53441.4"
         transform="matrix(0.02393569,0,0,0.02666667,-5.5608276,-1.1116285)"><g
           id="g34"
           style="stroke:none;stroke-width:2.11247e+06"
           transform="matrix(0.02399997,0,0,0.02666664,-21284.883,51.222335)"><g
             id="g35"
             style="stroke:none;stroke-width:7.46871e+07"
             transform="matrix(0.03,0,0,0.02666667,862957.68,-3880.085)"><g
               id="g1"
               transform="matrix(0.59999999,0,0,0.66666664,2300026.6,10143724)"
               style="stroke-width:1.18091e+08"><g
                 id="g2"
                 transform="matrix(3223662.7,0,0,2966310.3,-18427404,-27708509)"
                 style="stroke-width:1.80387e+08"><path
                   d="M 10,-2.8000003 6.6666665,-5.6000004 H 3.3333333 L 5.1648689e-8,-2.8000003 l -7.4505806e-8,1.4 1.666666622857117,2.8 1.6666667,1.4000001 3.3333332,1.4 1.6666667,1.4 L 10,8.3999995 V 11.2 L 6.6666665,14 H 3.3333333 L 5.1648689e-8,11.2"
                   style="fill:none;stroke:none;stroke-width:3.05504;stroke-linecap:round;stroke-linejoin:round"
                   id="path1"
                   sodipodi:nodetypes="cccccccccccccc"
                   inkscape:connector-curvature="0" /></g></g></g></g></g></g></g></g></svg>
