<?xml version="1.0"?><!DOCTYPE svg PUBLIC "-//W3C//DTD SVG 1.1//EN" "http://www.w3.org/Graphics/SVG/1.1/DTD/svg11.dtd"><svg xmlns="http://www.w3.org/2000/svg" xmlns:xlink="http://www.w3.org/1999/xlink" width="350" height="1000" viewBox="0 0 14 40" >
            
                ['<path class="dot" d="M 12.790943877551019,9.777193877551019 L 12.790943877551019,9.777193877551019 C 12.34094387755102,9.327193877551018 11.64344387755102,9.327193877551018 11.193443877551019,9.777193877551019 L 10.60844387755102,10.362193877551018 C 10.158443877551019,10.81219387755102 10.158443877551019,11.509693877551019 10.60844387755102,11.959693877551018 L 11.21594387755102,12.567193877551018 C 11.665943877551019,13.01719387755102 12.363443877551019,13.01719387755102 12.81344387755102,12.567193877551018 L 13.39844387755102,11.959693877551018 C 13.84844387755102,11.509693877551019 13.84844387755102,10.81219387755102 13.39844387755102,10.362193877551018 L 12.790943877551019,9.777193877551019" stroke-linejoin="round"/>', '<path class="dot" d="M 11.790943877551019,7.777193877551018 L 11.790943877551019,7.777193877551018 C 11.34094387755102,7.327193877551018 10.64344387755102,7.327193877551018 10.193443877551019,7.777193877551018 L 9.60844387755102,8.362193877551018 C 9.158443877551019,8.812193877551017 9.158443877551019,9.509693877551019 9.60844387755102,9.959693877551018 L 10.21594387755102,10.567193877551018 C 10.665943877551019,11.017193877551017 11.363443877551019,11.017193877551017 11.81344387755102,10.567193877551018 L 12.39844387755102,9.959693877551018 C 12.84844387755102,9.509693877551019 12.84844387755102,8.812193877551017 12.39844387755102,8.362193877551018 L 11.790943877551019,7.777193877551018" stroke-linejoin="round"/>', '<path class="dot" d="M 9.79094387755102,6.777193877551018 L 9.790943877551019,6.777193877551018 C 9.34094387755102,6.327193877551018 8.64344387755102,6.327193877551018 8.19344387755102,6.777193877551018 L 7.608443877551021,7.362193877551018 C 7.15844387755102,7.812193877551018 7.15844387755102,8.509693877551019 7.608443877551021,8.959693877551018 L 8.21594387755102,9.567193877551018 C 8.66594387755102,10.017193877551017 9.36344387755102,10.017193877551017 9.81344387755102,9.567193877551018 L 10.39844387755102,8.959693877551018 C 10.84844387755102,8.509693877551019 10.84844387755102,7.812193877551018 10.39844387755102,7.362193877551018 L 9.79094387755102,6.777193877551018" stroke-linejoin="round"/>', '<path class="dot" d="M 6.790943877551021,6.777193877551018 L 6.79094387755102,6.777193877551018 C 6.34094387755102,6.327193877551018 5.64344387755102,6.327193877551018 5.1934438775510205,6.777193877551018 L 4.608443877551021,7.362193877551018 C 4.15844387755102,7.812193877551018 4.15844387755102,8.509693877551019 4.608443877551021,8.959693877551018 L 5.21594387755102,9.567193877551018 C 5.66594387755102,10.017193877551017 6.3634438775510205,10.017193877551017 6.81344387755102,9.567193877551018 L 7.398443877551021,8.959693877551018 C 7.84844387755102,8.509693877551019 7.84844387755102,7.812193877551018 7.398443877551021,7.362193877551018 L 6.790943877551021,6.777193877551018" stroke-linejoin="round"/>', '<path class="dot" d="M 4.790943877551021,7.777193877551018 L 4.79094387755102,7.777193877551018 C 4.34094387755102,7.327193877551018 3.64344387755102,7.327193877551018 3.19344387755102,7.777193877551018 L 2.60844387755102,8.362193877551018 C 2.1584438775510204,8.812193877551017 2.15844387755102,9.509693877551019 2.60844387755102,9.959693877551018 L 3.21594387755102,10.567193877551018 C 3.66594387755102,11.017193877551017 4.3634438775510205,11.017193877551017 4.81344387755102,10.567193877551018 L 5.398443877551021,9.959693877551018 C 5.84844387755102,9.509693877551019 5.84844387755102,8.812193877551017 5.398443877551021,8.362193877551018 L 4.790943877551021,7.777193877551018" stroke-linejoin="round"/>', '<path class="dot" d="M 3.7909438775510207,9.777193877551019 L 3.79094387755102,9.777193877551019 C 3.3409438775510196,9.327193877551018 2.64344387755102,9.327193877551018 2.19344387755102,9.777193877551019 L 1.60844387755102,10.362193877551018 C 1.15844387755102,10.81219387755102 1.15844387755102,11.509693877551019 1.60844387755102,11.959693877551018 L 2.2159438775510196,12.567193877551018 C 2.66594387755102,13.01719387755102 3.3634438775510196,13.01719387755102 3.8134438775510198,12.567193877551018 L 4.398443877551021,11.959693877551018 C 4.84844387755102,11.509693877551019 4.84844387755102,10.81219387755102 4.398443877551021,10.362193877551018 L 3.7909438775510207,9.777193877551019" stroke-linejoin="round"/>', '<path class="dot" d="M 4.790943877551021,11.777193877551019 L 4.79094387755102,11.777193877551019 C 4.34094387755102,11.327193877551018 3.64344387755102,11.327193877551018 3.19344387755102,11.777193877551019 L 2.60844387755102,12.362193877551018 C 2.1584438775510204,12.81219387755102 2.15844387755102,13.509693877551019 2.60844387755102,13.959693877551018 L 3.21594387755102,14.567193877551018 C 3.66594387755102,15.01719387755102 4.3634438775510205,15.01719387755102 4.81344387755102,14.567193877551018 L 5.398443877551021,13.959693877551018 C 5.84844387755102,13.509693877551019 5.84844387755102,12.81219387755102 5.398443877551021,12.362193877551018 L 4.790943877551021,11.777193877551019" stroke-linejoin="round"/>', '<path class="dot" d="M 6.790943877551021,12.777193877551019 L 6.79094387755102,12.777193877551019 C 6.34094387755102,12.327193877551018 5.64344387755102,12.327193877551018 5.1934438775510205,12.777193877551019 L 4.608443877551021,13.362193877551018 C 4.15844387755102,13.81219387755102 4.15844387755102,14.509693877551019 4.608443877551021,14.959693877551018 L 5.21594387755102,15.567193877551018 C 5.66594387755102,16.01719387755102 6.3634438775510205,16.01719387755102 6.81344387755102,15.567193877551018 L 7.398443877551021,14.959693877551018 C 7.84844387755102,14.509693877551019 7.84844387755102,13.81219387755102 7.398443877551021,13.362193877551018 L 6.790943877551021,12.777193877551019" stroke-linejoin="round"/>', '<path class="dot" d="M 9.79094387755102,13.777193877551019 L 9.790943877551019,13.777193877551019 C 9.34094387755102,13.327193877551018 8.64344387755102,13.327193877551018 8.19344387755102,13.777193877551019 L 7.608443877551021,14.362193877551018 C 7.15844387755102,14.81219387755102 7.15844387755102,15.509693877551019 7.608443877551021,15.959693877551018 L 8.21594387755102,16.56719387755102 C 8.66594387755102,17.01719387755102 9.36344387755102,17.01719387755102 9.81344387755102,16.56719387755102 L 10.39844387755102,15.959693877551018 C 10.84844387755102,15.509693877551019 10.84844387755102,14.81219387755102 10.39844387755102,14.362193877551018 L 9.79094387755102,13.777193877551019" stroke-linejoin="round"/>', '<path class="dot" d="M 11.790943877551019,14.777193877551019 L 11.790943877551019,14.777193877551019 C 11.34094387755102,14.327193877551018 10.64344387755102,14.327193877551018 10.193443877551019,14.777193877551019 L 9.60844387755102,15.362193877551018 C 9.158443877551019,15.81219387755102 9.158443877551019,16.50969387755102 9.60844387755102,16.959693877551018 L 10.21594387755102,17.56719387755102 C 10.665943877551019,18.01719387755102 11.363443877551019,18.01719387755102 11.81344387755102,17.56719387755102 L 12.39844387755102,16.959693877551018 C 12.84844387755102,16.50969387755102 12.84844387755102,15.81219387755102 12.39844387755102,15.362193877551018 L 11.790943877551019,14.777193877551019" stroke-linejoin="round"/>', '<path class="dot" d="M 12.790943877551019,16.777193877551017 L 12.790943877551019,16.777193877551017 C 12.34094387755102,16.327193877551018 11.64344387755102,16.327193877551018 11.193443877551019,16.777193877551017 L 10.60844387755102,17.362193877551018 C 10.158443877551019,17.812193877551017 10.158443877551019,18.50969387755102 10.60844387755102,18.959693877551018 L 11.21594387755102,19.56719387755102 C 11.665943877551019,20.01719387755102 12.363443877551019,20.01719387755102 12.81344387755102,19.56719387755102 L 13.39844387755102,18.959693877551018 C 13.84844387755102,18.50969387755102 13.84844387755102,17.812193877551017 13.39844387755102,17.362193877551018 L 12.790943877551019,16.777193877551017" stroke-linejoin="round"/>', '<path class="dot" d="M 12.790943877551019,17.777193877551017 L 12.790943877551019,17.777193877551017 C 12.34094387755102,17.327193877551018 11.64344387755102,17.327193877551018 11.193443877551019,17.777193877551017 L 10.60844387755102,18.362193877551018 C 10.158443877551019,18.812193877551017 10.158443877551019,19.50969387755102 10.60844387755102,19.959693877551018 L 11.21594387755102,20.56719387755102 C 11.665943877551019,21.01719387755102 12.363443877551019,21.01719387755102 12.81344387755102,20.56719387755102 L 13.39844387755102,19.959693877551018 C 13.84844387755102,19.50969387755102 13.84844387755102,18.812193877551017 13.39844387755102,18.362193877551018 L 12.790943877551019,17.777193877551017" stroke-linejoin="round"/>', '<path class="dot" d="M 11.790943877551019,19.777193877551017 L 11.790943877551019,19.777193877551017 C 11.34094387755102,19.327193877551018 10.64344387755102,19.327193877551018 10.193443877551019,19.777193877551017 L 9.60844387755102,20.362193877551018 C 9.158443877551019,20.812193877551017 9.158443877551019,21.50969387755102 9.60844387755102,21.959693877551018 L 10.21594387755102,22.56719387755102 C 10.665943877551019,23.01719387755102 11.363443877551019,23.01719387755102 11.81344387755102,22.56719387755102 L 12.39844387755102,21.959693877551018 C 12.84844387755102,21.50969387755102 12.84844387755102,20.812193877551017 12.39844387755102,20.362193877551018 L 11.790943877551019,19.777193877551017" stroke-linejoin="round"/>', '<path class="dot" d="M 9.79094387755102,20.777193877551017 L 9.790943877551019,20.777193877551017 C 9.34094387755102,20.327193877551018 8.64344387755102,20.327193877551018 8.19344387755102,20.777193877551017 L 7.608443877551021,21.362193877551018 C 7.15844387755102,21.812193877551017 7.15844387755102,22.50969387755102 7.608443877551021,22.959693877551018 L 8.21594387755102,23.56719387755102 C 8.66594387755102,24.01719387755102 9.36344387755102,24.01719387755102 9.81344387755102,23.56719387755102 L 10.39844387755102,22.959693877551018 C 10.84844387755102,22.50969387755102 10.84844387755102,21.812193877551017 10.39844387755102,21.362193877551018 L 9.79094387755102,20.777193877551017" stroke-linejoin="round"/>', '<path class="dot" d="M 6.790943877551021,20.777193877551017 L 6.79094387755102,20.777193877551017 C 6.34094387755102,20.327193877551018 5.64344387755102,20.327193877551018 5.1934438775510205,20.777193877551017 L 4.608443877551021,21.362193877551018 C 4.15844387755102,21.812193877551017 4.15844387755102,22.50969387755102 4.608443877551021,22.959693877551018 L 5.21594387755102,23.56719387755102 C 5.66594387755102,24.01719387755102 6.3634438775510205,24.01719387755102 6.81344387755102,23.56719387755102 L 7.398443877551021,22.959693877551018 C 7.84844387755102,22.50969387755102 7.84844387755102,21.812193877551017 7.398443877551021,21.362193877551018 L 6.790943877551021,20.777193877551017" stroke-linejoin="round"/>', '<path class="dot" d="M 4.790943877551021,19.777193877551017 L 4.79094387755102,19.777193877551017 C 4.34094387755102,19.327193877551018 3.64344387755102,19.327193877551018 3.19344387755102,19.777193877551017 L 2.60844387755102,20.362193877551018 C 2.1584438775510204,20.812193877551017 2.15844387755102,21.50969387755102 2.60844387755102,21.959693877551018 L 3.21594387755102,22.56719387755102 C 3.66594387755102,23.01719387755102 4.3634438775510205,23.01719387755102 4.81344387755102,22.56719387755102 L 5.398443877551021,21.959693877551018 C 5.84844387755102,21.50969387755102 5.84844387755102,20.812193877551017 5.398443877551021,20.362193877551018 L 4.790943877551021,19.777193877551017" stroke-linejoin="round"/>', '<path class="dot" d="M 3.7909438775510207,17.777193877551017 L 3.79094387755102,17.777193877551017 C 3.3409438775510196,17.327193877551018 2.64344387755102,17.327193877551018 2.19344387755102,17.777193877551017 L 1.60844387755102,18.362193877551018 C 1.15844387755102,18.812193877551017 1.15844387755102,19.50969387755102 1.60844387755102,19.959693877551018 L 2.2159438775510196,20.56719387755102 C 2.66594387755102,21.01719387755102 3.3634438775510196,21.01719387755102 3.8134438775510198,20.56719387755102 L 4.398443877551021,19.959693877551018 C 4.84844387755102,19.50969387755102 4.84844387755102,18.812193877551017 4.398443877551021,18.362193877551018 L 3.7909438775510207,17.777193877551017" stroke-linejoin="round"/>']
            
            
            <path d="M 12.0,11.0 L 11.0,9.0 L 9.0,8.0 L 6.0,8.0 L 4.0,9.0 L 3.0,11.0 L 4.0,13.0 L 6.0,14.0 L 9.0,15.0 L 11.0,16.0 L 12.0,18.0 L 12.0,19.0 L 11.0,21.0 L 9.0,22.0 L 6.0,22.0 L 4.0,21.0 L 3.0,19.0" fill="none"
            stroke="black"
            stroke-width="2.5"
            stroke-linecap="round"
            stroke-linejoin="round"
            />
            
            
        </svg>