<?xml version="1.0"?><!DOCTYPE svg PUBLIC "-//W3C//DTD SVG 1.1//EN" "http://www.w3.org/Graphics/SVG/1.1/DTD/svg11.dtd"><svg xmlns="http://www.w3.org/2000/svg" xmlns:xlink="http://www.w3.org/1999/xlink" width="350" height="1000" viewBox="0 0 10 26" >
            
                ['<path class="dot" d="M 6.519583333333333,13.140270833333332 L 6.519583333333332,13.140270833333332 C 6.229583333333332,12.850270833333333 5.780083333333333,12.850270833333333 5.490083333333333,13.140270833333332 L 5.113083333333333,13.517270833333333 C 4.823083333333333,13.807270833333334 4.823083333333333,14.256770833333333 5.113083333333333,14.546770833333333 L 5.504583333333333,14.938270833333332 C 5.794583333333333,15.228270833333333 6.244083333333332,15.228270833333333 6.534083333333332,14.938270833333332 L 6.911083333333333,14.546770833333333 C 7.201083333333333,14.256770833333333 7.201083333333333,13.807270833333334 6.911083333333333,13.517270833333333 L 6.519583333333333,13.140270833333332" stroke-linejoin="round"/>', '<path class="dot" d="M 5.519583333333333,14.140271033333333 L 5.519583333333333,14.140271033333333 C 5.229583333333333,13.850271033333334 4.780083333333333,13.850271033333334 4.490083333333333,14.140271033333333 L 4.113083333333333,14.517271033333333 C 3.823083333333333,14.807271033333333 3.823083333333333,15.256771033333333 4.113083333333333,15.546771033333334 L 4.504583333333333,15.938271033333333 C 4.794583333333333,16.228271033333332 5.244083333333333,16.228271033333332 5.534083333333333,15.938271033333333 L 5.911083333333334,15.546771033333334 C 6.201083333333333,15.256771033333333 6.201083333333333,14.807271033333334 5.911083333333334,14.517271033333333 L 5.519583333333333,14.140271033333333" stroke-linejoin="round"/>', '<path class="dot" d="M 4.519583333333333,13.140270833333332 L 4.519583333333333,13.140270833333332 C 4.229583333333333,12.850270833333333 3.7800833333333332,12.850270833333333 3.490083333333333,13.140270833333332 L 3.113083333333333,13.517270833333333 C 2.823083333333333,13.807270833333334 2.823083333333333,14.256770833333333 3.113083333333333,14.546770833333333 L 3.504583333333333,14.938270833333332 C 3.7945833333333328,15.228270833333333 4.244083333333333,15.228270833333333 4.534083333333333,14.938270833333332 L 4.911083333333334,14.546770833333333 C 5.201083333333333,14.256770833333333 5.201083333333333,13.807270833333334 4.911083333333334,13.517270833333333 L 4.519583333333333,13.140270833333332" stroke-linejoin="round"/>', '<path class="dot" d="M 5.519583333333333,12.140270833333332 L 5.519583333333333,12.140270833333332 C 5.229583333333333,11.850270833333333 4.780083333333333,11.850270833333333 4.490083333333333,12.140270833333332 L 4.113083333333333,12.517270833333333 C 3.823083333333333,12.807270833333334 3.823083333333333,13.256770833333333 4.113083333333333,13.546770833333333 L 4.504583333333333,13.938270833333332 C 4.794583333333333,14.228270833333333 5.244083333333333,14.228270833333333 5.534083333333333,13.938270833333332 L 5.911083333333334,13.546770833333333 C 6.201083333333333,13.256770833333333 6.201083333333333,12.807270833333334 5.911083333333334,12.517270833333333 L 5.519583333333333,12.140270833333332" stroke-linejoin="round"/>', '<path class="dot" d="M 6.519583333333333,13.140270833333332 L 6.519583333333332,13.140270833333332 C 6.229583333333332,12.850270833333333 5.780083333333333,12.850270833333333 5.490083333333333,13.140270833333332 L 5.113083333333333,13.517270833333333 C 4.823083333333333,13.807270833333334 4.823083333333333,14.256770833333333 5.113083333333333,14.546770833333333 L 5.504583333333333,14.938270833333332 C 5.794583333333333,15.228270833333333 6.244083333333332,15.228270833333333 6.534083333333332,14.938270833333332 L 6.911083333333333,14.546770833333333 C 7.201083333333333,14.256770833333333 7.201083333333333,13.807270833333334 6.911083333333333,13.517270833333333 L 6.519583333333333,13.140270833333332" stroke-linejoin="round"/>', '<path class="dot" d="M 6.519583333333333,16.140270833333332 L 6.519583333333332,16.140270833333332 C 6.229583333333332,15.850270833333333 5.780083333333333,15.850270833333333 5.490083333333333,16.140270833333332 L 5.113083333333333,16.517270833333335 C 4.823083333333333,16.807270833333334 4.823083333333333,17.256770833333334 5.113083333333333,17.546770833333333 L 5.504583333333333,17.938270833333334 C 5.794583333333333,18.228270833333333 6.244083333333332,18.228270833333333 6.534083333333332,17.938270833333334 L 6.911083333333333,17.546770833333333 C 7.201083333333333,17.256770833333334 7.201083333333333,16.807270833333334 6.911083333333333,16.517270833333335 L 6.519583333333333,16.140270833333332" stroke-linejoin="round"/>', '<path class="dot" d="M 4.519583333333333,18.140270833333336 L 4.519583333333333,18.140270833333336 C 4.229583333333333,17.850270833333333 3.7800833333333332,17.850270833333333 3.490083333333333,18.140270833333336 L 3.113083333333333,18.517270833333335 C 2.823083333333333,18.807270833333334 2.823083333333333,19.256770833333334 3.113083333333333,19.546770833333333 L 3.504583333333333,19.938270833333334 C 3.7945833333333328,20.228270833333333 4.244083333333333,20.228270833333333 4.534083333333333,19.938270833333334 L 4.911083333333334,19.546770833333333 C 5.201083333333333,19.256770833333334 5.201083333333333,18.807270833333334 4.911083333333334,18.517270833333335 L 4.519583333333333,18.140270833333336" stroke-linejoin="round"/>']
            
            
            <path d="M 6.0,14.0 L 5.0,15.0000002 L 4.0,14.0 L 5.0,13.0 L 6.0,14.0 L 6.0,17.0 L 4.0,19.0" fill="none"
            stroke="black"
            stroke-width="1.5"
            stroke-linecap="round"
            stroke-linejoin="round"
            />
            
            
        </svg>