<?xml version="1.0"?><!DOCTYPE svg PUBLIC "-//W3C//DTD SVG 1.1//EN" "http://www.w3.org/Graphics/SVG/1.1/DTD/svg11.dtd"><svg xmlns="http://www.w3.org/2000/svg" xmlns:xlink="http://www.w3.org/1999/xlink" width="350" height="1000" viewBox="0 0 7 17" >
            
                ['<path class="dot" d="M 1.9083212725502283,0.3108699714507357 L 1.908321272550228,0.3108699714507357 C 1.6883212725502281,0.09086997145073561 1.3473212725502282,0.09086997145073558 1.1273212725502282,0.3108699714507357 L 0.8413212725502281,0.5968699714507358 C 0.6213212725502281,0.8168699714507358 0.6213212725502281,1.157869971450736 0.8413212725502281,1.3778699714507359 L 1.138321272550228,1.6748699714507356 C 1.358321272550228,1.8948699714507355 1.6993212725502282,1.8948699714507355 1.919321272550228,1.6748699714507356 L 2.2053212725502283,1.3778699714507359 C 2.4253212725502284,1.1578699714507357 2.4253212725502284,0.8168699714507358 2.2053212725502283,0.5968699714507357 L 1.9083212725502283,0.3108699714507357" stroke-linejoin="round"/>', '<path class="dot" d="M 5.861678727449771,13.325130028549264 L 5.861678727449771,13.325130028549264 C 5.64167872744977,13.105130028549265 5.300678727449771,13.105130028549265 5.0806787274497704,13.325130028549264 L 4.794678727449771,13.611130028549265 C 4.574678727449771,13.831130028549264 4.574678727449771,14.172130028549265 4.794678727449771,14.392130028549264 L 5.091678727449771,14.689130028549265 C 5.31167872744977,14.909130028549265 5.652678727449771,14.909130028549265 5.87267872744977,14.689130028549265 L 6.158678727449772,14.392130028549264 C 6.378678727449771,14.172130028549265 6.378678727449771,13.831130028549264 6.158678727449772,13.611130028549265 L 5.861678727449771,13.325130028549264" stroke-linejoin="round"/>']
            
            
            <path d="M 1.5233212725502283,0.9928699714507356 L 5.476678727449771,14.007130028549264" fill="none"
            stroke="black"
            stroke-width="1"
            stroke-linecap="round"
            stroke-linejoin="round"
            />
            
            
        </svg>