<?xml version="1.0" encoding="UTF-8" standalone="no"?>
<svg
   width="350"
   height="1000"
   viewBox="0 0 14 40"
   version="1.1"
   id="svg29"
   sodipodi:docname="a-e-40.svg"
   inkscape:version="1.3.2 (091e20ef0f, 2023-11-25, custom)"
   xmlns:inkscape="http://www.inkscape.org/namespaces/inkscape"
   xmlns:sodipodi="http://sodipodi.sourceforge.net/DTD/sodipodi-0.dtd"
   xmlns="http://www.w3.org/2000/svg"
   xmlns:svg="http://www.w3.org/2000/svg"><defs
   id="defs29" />
<sodipodi:namedview
   id="namedview29"
   pagecolor="#ffffff"
   bordercolor="#666666"
   borderopacity="1.0"
   inkscape:showpageshadow="2"
   inkscape:pageopacity="0.0"
   inkscape:pagecheckerboard="0"
   inkscape:deskcolor="#d1d1d1"
   showguides="true"
   inkscape:zoom="2.316"
   inkscape:cx="168.82556"
   inkscape:cy="395.94128"
   inkscape:window-width="2560"
   inkscape:window-height="1371"
   inkscape:window-x="0"
   inkscape:window-y="0"
   inkscape:window-maximized="1"
   inkscape:current-layer="svg29">
  <sodipodi:guide
     position="13.000262,20.343897"
     orientation="1,0"
     id="guide30"
     inkscape:locked="false" />
</sodipodi:namedview>

            
                ['<path
   id="path1"
   class="dot"
   d="M 2.9921875 6.4396875 C 2.7053128 6.4396875 2.4184373 6.5521877 2.1934375 6.7771875 L 1.6084375 7.3621875 C 1.5363162 7.4343088 1.4758786 7.5128268 1.426875 7.595625 C 1.3440768 7.6446286 1.2655588 7.7050662 1.1934375 7.7771875 L 0.6084375 8.3621875 C 0.19736431 8.7732607 0.16207627 9.3907735 0.50203125 9.8375781 L -0.041640625 12.012266 L -0.3915625 12.362188 C -0.84156205 12.812187 -0.84156205 13.509688 -0.3915625 13.959688 L -0.25 14.10125 L -0.25 16.220625 L -0.3915625 16.362188 C -0.84156205 16.812187 -0.84156205 17.509688 -0.3915625 17.959688 L 0.065625 18.416875 L 0.56382813 20.409453 C 0.1591112 20.859851 0.17388569 21.525136 0.6084375 21.959688 L 1.2159375 22.567187 C 1.2839727 22.635223 1.3577513 22.692772 1.4353906 22.740234 C 1.4828534 22.817874 1.5404023 22.891652 1.6084375 22.959688 L 2.2159375 23.567187 C 2.6659371 24.017187 3.363438 24.017187 3.8134375 23.567187 L 4.0108594 23.362109 L 4.2159375 23.567187 C 4.6659371 24.017187 5.363438 24.017187 5.8134375 23.567187 L 6.0108594 23.362109 L 6.2159375 23.567187 C 6.6659371 24.017187 7.3634379 24.017187 7.8134375 23.567187 L 8.0108594 23.362109 L 8.2159375 23.567187 C 8.6659371 24.017187 9.3634379 24.017187 9.8134375 23.567187 L 10.010859 23.362109 L 10.215938 23.567187 C 10.665937 24.017187 11.363438 24.017187 11.813438 23.567187 L 12.398438 22.959688 C 12.46034 22.897785 12.513409 22.831075 12.558281 22.761094 C 12.649067 22.710017 12.735054 22.645571 12.813438 22.567187 L 13.398438 21.959688 C 13.743534 21.614591 13.823653 21.124054 13.639453 20.711094 C 13.700499 20.669725 13.758802 20.621823 13.813438 20.567187 L 14.398438 19.959688 C 14.848437 19.509688 14.848437 18.812187 14.398438 18.362188 L 13.790938 17.777188 C 13.340938 17.327188 12.643437 17.327188 12.193437 17.777188 L 11.608438 18.362188 C 11.284614 18.686011 11.193865 19.137976 11.336094 19.533672 L 11.233125 19.739375 C 11.21971 19.751635 11.206451 19.764174 11.193437 19.777188 L 10.608438 20.362188 C 10.536316 20.434309 10.475879 20.512827 10.426875 20.595625 C 10.354814 20.638274 10.286127 20.689841 10.221953 20.75 L 9.7624219 20.75 C 9.7086955 20.699635 9.6517515 20.655436 9.5923437 20.617344 C 9.5412668 20.526558 9.476821 20.440571 9.3984375 20.362188 L 9.04375 20.020625 L 8.4996875 17.844297 C 8.8451393 17.396982 8.8115747 16.775325 8.3984375 16.362188 L 8.25 16.219219 L 8.25 15.25 L 11.89875 15.25 L 12.215938 15.567188 C 12.665937 16.017187 13.363438 16.017187 13.813438 15.567188 L 14.398438 14.959688 C 14.848437 14.509688 14.848437 13.812187 14.398438 13.362188 L 14.25 13.219219 L 14.25 12.113828 L 14.398438 11.959688 C 14.848437 11.509688 14.848437 10.812187 14.398438 10.362188 L 13.790938 9.7771875 C 13.787278 9.7735275 13.783458 9.770163 13.779766 9.7665625 L 13.6675 9.5421094 C 13.814106 9.1444025 13.724579 8.6883286 13.398438 8.3621875 L 12.790938 7.7771875 C 12.729035 7.7152846 12.662325 7.6622157 12.592344 7.6173437 C 12.541267 7.5265576 12.476821 7.440571 12.398438 7.3621875 L 11.790938 6.7771875 C 11.350291 6.336541 10.672465 6.3276708 10.221953 6.75 L 9.7333594 6.75 C 9.2828478 6.3276708 8.6050215 6.336541 8.164375 6.7771875 L 7.9811719 6.9603906 L 7.7909375 6.7771875 C 7.3409379 6.3271879 6.6434371 6.3271879 6.1934375 6.7771875 L 5.9960156 6.9746094 L 5.7909375 6.7771875 C 5.350291 6.336541 4.6724647 6.3276708 4.2219531 6.75 L 3.7624219 6.75 C 3.5419473 6.5433175 3.2671371 6.4396875 2.9921875 6.4396875 z M 9.9960938 9.3473438 L 10.215938 9.5671875 C 10.283973 9.6352227 10.357751 9.6927716 10.435391 9.7402344 C 10.482853 9.8178737 10.540402 9.8916523 10.608438 9.9596875 L 11.215938 10.567188 C 11.265418 10.616668 11.318006 10.660386 11.372813 10.698984 C 11.181584 11.114427 11.259966 11.611216 11.608438 11.959688 L 11.75 12.10125 L 11.75 12.75 L 8.6560156 12.75 C 8.6064324 12.626496 8.5339255 12.509108 8.4380469 12.40375 L 8.6315625 11.628594 C 8.6929876 11.497057 8.7273239 11.357204 8.7344531 11.216406 L 8.9257031 10.450625 L 9.3984375 9.9596875 C 9.4685237 9.8896013 9.5276828 9.8135046 9.5759375 9.7332813 C 9.649523 9.6871439 9.7195756 9.6319869 9.784375 9.5671875 L 9.9960938 9.3473438 z M 4.0108594 9.3621094 L 4.2159375 9.5671875 C 4.2839727 9.6352227 4.3577513 9.6927716 4.4353906 9.7402344 C 4.4828534 9.8178737 4.5404023 9.8916523 4.6084375 9.9596875 L 5.2159375 10.567188 C 5.2654175 10.616668 5.3180059 10.660386 5.3728125 10.698984 C 5.1815835 11.114427 5.2599658 11.611216 5.6084375 11.959688 L 5.75 12.10125 L 5.75 12.220625 L 5.6084375 12.362188 C 5.2492659 12.721359 5.1771469 13.238117 5.3913281 13.660938 C 5.1771292 14.083763 5.2492578 14.600508 5.6084375 14.959688 L 5.75 15.10125 L 5.75 16.220625 L 5.6084375 16.362188 C 5.1584379 16.812187 5.1584379 17.509688 5.6084375 17.959688 L 5.75 18.10125 L 5.75 18.220625 L 5.6084375 18.362188 C 5.2847404 18.685885 5.1939461 19.137618 5.3359375 19.533203 L 5.2325781 19.739844 C 5.2193442 19.751953 5.2062798 19.764345 5.1934375 19.777188 L 4.6084375 20.362188 C 4.5363162 20.434309 4.4758786 20.512827 4.426875 20.595625 C 4.3548145 20.638274 4.2861266 20.689841 4.2219531 20.75 L 3.7624219 20.75 C 3.7086955 20.699635 3.6517515 20.655436 3.5923437 20.617344 C 3.5412668 20.526558 3.476821 20.440571 3.3984375 20.362188 L 3.04375 20.020625 L 2.4996875 17.844297 C 2.8451393 17.396982 2.8115747 16.775325 2.3984375 16.362188 L 2.25 16.219219 L 2.25 14.113828 L 2.3984375 13.959688 C 2.8349124 13.523213 2.8479729 12.853909 2.4377344 12.403438 L 2.9260156 10.450313 L 3.3984375 9.9596875 C 3.4603404 9.8977846 3.5134093 9.8310752 3.5582813 9.7610938 C 3.6490674 9.7100168 3.735054 9.645571 3.8134375 9.5671875 L 4.0108594 9.3621094 z " />
', '', '', '', '', '', '', '', '', '', '', '', '', '', '', '', '', '', '', '', '', '', '', '', '', '', '', '']
            
            
            </svg>
