<?xml version="1.0"?><!DOCTYPE svg PUBLIC "-//W3C//DTD SVG 1.1//EN" "http://www.w3.org/Graphics/SVG/1.1/DTD/svg11.dtd"><svg xmlns="http://www.w3.org/2000/svg" xmlns:xlink="http://www.w3.org/1999/xlink" width="350" height="1000" viewBox="0 0 7 17" >
            
                ['<path class="dot" d="M 1.885,0.31800000000000006 L 1.8849999999999998,0.31800000000000006 C 1.6649999999999998,0.09799999999999998 1.3239999999999998,0.09799999999999995 1.1039999999999999,0.31800000000000006 L 0.8179999999999998,0.6040000000000002 C 0.5979999999999998,0.8240000000000002 0.5979999999999998,1.1650000000000003 0.8179999999999998,1.3850000000000002 L 1.1149999999999998,1.682 C 1.3349999999999997,1.902 1.676,1.902 1.8959999999999997,1.682 L 2.1820000000000004,1.3850000000000002 C 2.402,1.165 2.402,0.8240000000000002 2.1820000000000004,0.6040000000000001 L 1.885,0.31800000000000006" stroke-linejoin="round"/>', '<path class="dot" d="M 1.885,10.318 L 1.8849999999999998,10.318 C 1.6649999999999998,10.098 1.3239999999999998,10.098 1.1039999999999999,10.318 L 0.8179999999999998,10.604000000000001 C 0.5979999999999998,10.824 0.5979999999999998,11.165000000000001 0.8179999999999998,11.385000000000002 L 1.1149999999999998,11.682 C 1.3349999999999997,11.902000000000001 1.676,11.902000000000001 1.8959999999999997,11.682 L 2.1820000000000004,11.385000000000002 C 2.402,11.165000000000001 2.402,10.824 2.1820000000000004,10.604000000000001 L 1.885,10.318000000000001" stroke-linejoin="round"/>']
            
                ['<path class="dot" d="M 1.885,0.31800000000000006 L 1.8849999999999998,0.31800000000000006 C 1.6649999999999998,0.09799999999999998 1.3239999999999998,0.09799999999999995 1.1039999999999999,0.31800000000000006 L 0.8179999999999998,0.6040000000000002 C 0.5979999999999998,0.8240000000000002 0.5979999999999998,1.1650000000000003 0.8179999999999998,1.3850000000000002 L 1.1149999999999998,1.682 C 1.3349999999999997,1.902 1.676,1.902 1.8959999999999997,1.682 L 2.1820000000000004,1.3850000000000002 C 2.402,1.165 2.402,0.8240000000000002 2.1820000000000004,0.6040000000000001 L 1.885,0.31800000000000006" stroke-linejoin="round"/>', '<path class="dot" d="M 5.885,0.31800000000000006 L 5.885,0.31800000000000006 C 5.664999999999999,0.09799999999999998 5.324,0.09799999999999995 5.103999999999999,0.31800000000000006 L 4.818,0.6040000000000002 C 4.598,0.8240000000000002 4.598,1.1650000000000003 4.818,1.3850000000000002 L 5.114999999999999,1.682 C 5.334999999999999,1.902 5.676,1.902 5.895999999999999,1.682 L 6.182,1.3850000000000002 C 6.402,1.165 6.402,0.8240000000000002 6.182,0.6040000000000001 L 5.885,0.31800000000000006" stroke-linejoin="round"/>']
            
                ['<path class="dot" d="M 1.885,5.3180000000000005 L 1.8849999999999998,5.3180000000000005 C 1.6649999999999998,5.098000000000001 1.3239999999999998,5.098000000000001 1.1039999999999999,5.3180000000000005 L 0.8179999999999998,5.604000000000001 C 0.5979999999999998,5.824000000000001 0.5979999999999998,6.165000000000001 0.8179999999999998,6.385000000000001 L 1.1149999999999998,6.682 C 1.3349999999999997,6.902 1.676,6.902 1.8959999999999997,6.682 L 2.1820000000000004,6.385000000000001 C 2.402,6.165000000000001 2.402,5.824000000000001 2.1820000000000004,5.604000000000001 L 1.885,5.3180000000000005" stroke-linejoin="round"/>', '<path class="dot" d="M 5.885,5.3180000000000005 L 5.885,5.3180000000000005 C 5.664999999999999,5.098000000000001 5.324,5.098000000000001 5.103999999999999,5.3180000000000005 L 4.818,5.604000000000001 C 4.598,5.824000000000001 4.598,6.165000000000001 4.818,6.385000000000001 L 5.114999999999999,6.682 C 5.334999999999999,6.902 5.676,6.902 5.895999999999999,6.682 L 6.182,6.385000000000001 C 6.402,6.165000000000001 6.402,5.824000000000001 6.182,5.604000000000001 L 5.885,5.3180000000000005" stroke-linejoin="round"/>']
            
                ['<path class="dot" d="M 1.885,10.318 L 1.8849999999999998,10.318 C 1.6649999999999998,10.098 1.3239999999999998,10.098 1.1039999999999999,10.318 L 0.8179999999999998,10.604000000000001 C 0.5979999999999998,10.824 0.5979999999999998,11.165000000000001 0.8179999999999998,11.385000000000002 L 1.1149999999999998,11.682 C 1.3349999999999997,11.902000000000001 1.676,11.902000000000001 1.8959999999999997,11.682 L 2.1820000000000004,11.385000000000002 C 2.402,11.165000000000001 2.402,10.824 2.1820000000000004,10.604000000000001 L 1.885,10.318000000000001" stroke-linejoin="round"/>', '<path class="dot" d="M 5.885,10.318 L 5.885,10.318 C 5.664999999999999,10.098 5.324,10.098 5.103999999999999,10.318 L 4.818,10.604000000000001 C 4.598,10.824 4.598,11.165000000000001 4.818,11.385000000000002 L 5.114999999999999,11.682 C 5.334999999999999,11.902000000000001 5.676,11.902000000000001 5.895999999999999,11.682 L 6.182,11.385000000000002 C 6.402,11.165000000000001 6.402,10.824 6.182,10.604000000000001 L 5.885,10.318000000000001" stroke-linejoin="round"/>']
            
                ['<path class="dot" d="M 6.885,-2.682 L 6.885,-2.682 C 6.664999999999999,-2.902 6.324,-2.902 6.103999999999999,-2.682 L 5.818,-2.396 C 5.598,-2.1759999999999997 5.598,-1.8349999999999997 5.818,-1.6149999999999998 L 6.114999999999999,-1.318 C 6.334999999999999,-1.098 6.676,-1.098 6.895999999999999,-1.318 L 7.182,-1.6149999999999998 C 7.402,-1.835 7.402,-2.1759999999999997 7.182,-2.396 L 6.885,-2.682" stroke-linejoin="round"/>', '<path class="dot" d="M 5.885,-1.682 L 5.885,-1.682 C 5.664999999999999,-1.9020000000000001 5.324,-1.9020000000000001 5.103999999999999,-1.682 L 4.818,-1.396 C 4.598,-1.1759999999999997 4.598,-0.8349999999999997 4.818,-0.6149999999999998 L 5.114999999999999,-0.31800000000000006 C 5.334999999999999,-0.09800000000000009 5.676,-0.09800000000000009 5.895999999999999,-0.31800000000000006 L 6.182,-0.6149999999999998 C 6.402,-0.835 6.402,-1.1759999999999997 6.182,-1.396 L 5.885,-1.682" stroke-linejoin="round"/>', '<path class="dot" d="M 4.885,-2.682 L 4.885,-2.682 C 4.664999999999999,-2.902 4.324,-2.902 4.103999999999999,-2.682 L 3.8179999999999996,-2.396 C 3.5979999999999994,-2.1759999999999997 3.5979999999999994,-1.8349999999999997 3.8179999999999996,-1.6149999999999998 L 4.114999999999999,-1.318 C 4.334999999999999,-1.098 4.676,-1.098 4.895999999999999,-1.318 L 5.182,-1.6149999999999998 C 5.402,-1.835 5.402,-2.1759999999999997 5.182,-2.396 L 4.885,-2.682" stroke-linejoin="round"/>', '<path class="dot" d="M 5.885,-3.682 L 5.885,-3.682 C 5.664999999999999,-3.902 5.324,-3.902 5.103999999999999,-3.682 L 4.818,-3.396 C 4.598,-3.1759999999999997 4.598,-2.835 4.818,-2.6149999999999998 L 5.114999999999999,-2.318 C 5.334999999999999,-2.098 5.676,-2.098 5.895999999999999,-2.318 L 6.182,-2.6149999999999998 C 6.402,-2.835 6.402,-3.1759999999999997 6.182,-3.396 L 5.885,-3.682" stroke-linejoin="round"/>', '<path class="dot" d="M 2.885,-2.682 L 2.885,-2.682 C 2.665,-2.902 2.324,-2.902 2.1039999999999996,-2.682 L 1.8179999999999998,-2.396 C 1.5979999999999999,-2.1759999999999997 1.5979999999999996,-1.8349999999999997 1.8179999999999998,-1.6149999999999998 L 2.1149999999999998,-1.318 C 2.335,-1.098 2.676,-1.098 2.896,-1.318 L 3.1820000000000004,-1.6149999999999998 C 3.402,-1.835 3.402,-2.1759999999999997 3.1820000000000004,-2.396 L 2.885,-2.682" stroke-linejoin="round"/>', '<path class="dot" d="M 1.885,-1.682 L 1.8849999999999998,-1.682 C 1.6649999999999998,-1.9020000000000001 1.3239999999999998,-1.9020000000000001 1.1039999999999999,-1.682 L 0.8179999999999998,-1.396 C 0.5979999999999998,-1.1759999999999997 0.5979999999999998,-0.8349999999999997 0.8179999999999998,-0.6149999999999998 L 1.1149999999999998,-0.31800000000000006 C 1.3349999999999997,-0.09800000000000009 1.676,-0.09800000000000009 1.8959999999999997,-0.31800000000000006 L 2.1820000000000004,-0.6149999999999998 C 2.402,-0.835 2.402,-1.1759999999999997 2.1820000000000004,-1.396 L 1.885,-1.682" stroke-linejoin="round"/>', '<path class="dot" d="M 0.885,-2.6820002 L 0.8849999999999998,-2.6820002 C 0.6649999999999998,-2.9020002000000003 0.32399999999999984,-2.9020002000000003 0.10399999999999981,-2.6820002 L -0.1820000000000002,-2.3960002 C -0.40200000000000025,-2.1760002 -0.40200000000000025,-1.8350001999999999 -0.1820000000000002,-1.6150001999999999 L 0.11499999999999977,-1.3180002000000002 C 0.33499999999999974,-1.0980002000000002 0.6759999999999999,-1.0980002000000002 0.8959999999999997,-1.3180002000000002 L 1.1820000000000002,-1.6150001999999999 C 1.4020000000000001,-1.8350002 1.4020000000000001,-2.1760002 1.1820000000000002,-2.3960002 L 0.885,-2.6820002" stroke-linejoin="round"/>', '<path class="dot" d="M 1.885,-3.682 L 1.8849999999999998,-3.682 C 1.6649999999999998,-3.902 1.3239999999999998,-3.902 1.1039999999999999,-3.682 L 0.8179999999999998,-3.396 C 0.5979999999999998,-3.1759999999999997 0.5979999999999998,-2.835 0.8179999999999998,-2.6149999999999998 L 1.1149999999999998,-2.318 C 1.3349999999999997,-2.098 1.676,-2.098 1.8959999999999997,-2.318 L 2.1820000000000004,-2.6149999999999998 C 2.402,-2.835 2.402,-3.1759999999999997 2.1820000000000004,-3.396 L 1.885,-3.682" stroke-linejoin="round"/>', '<path class="dot" d="M 2.885,-2.682 L 2.885,-2.682 C 2.665,-2.902 2.324,-2.902 2.1039999999999996,-2.682 L 1.8179999999999998,-2.396 C 1.5979999999999999,-2.1759999999999997 1.5979999999999996,-1.8349999999999997 1.8179999999999998,-1.6149999999999998 L 2.1149999999999998,-1.318 C 2.335,-1.098 2.676,-1.098 2.896,-1.318 L 3.1820000000000004,-1.6149999999999998 C 3.402,-1.835 3.402,-2.1759999999999997 3.1820000000000004,-2.396 L 2.885,-2.682" stroke-linejoin="round"/>']
            
            
            <path d="M 1.5,1.0 L 1.5,11.0" fill="none"
            stroke="black"
            stroke-width="1"
            stroke-linecap="round"
            stroke-linejoin="round"
            />
            
            <path d="M 1.5,1.0 L 5.5,1.0" fill="none"
            stroke="black"
            stroke-width="1"
            stroke-linecap="round"
            stroke-linejoin="round"
            />
            
            <path d="M 1.5,6.0 L 5.5,6.0" fill="none"
            stroke="black"
            stroke-width="1"
            stroke-linecap="round"
            stroke-linejoin="round"
            />
            
            <path d="M 1.5,11.0 L 5.5,11.0" fill="none"
            stroke="black"
            stroke-width="1"
            stroke-linecap="round"
            stroke-linejoin="round"
            />
            
            <path d="M 6.5,-2.0 L 5.5,-1.0 L 4.5,-2.0 L 5.5,-3.0 L 6.5,-2.0 M 2.5,-2.0 L 1.5,-1.0 L 0.5,-2.0000002 L 1.5,-3.0 L 2.5,-2.0" fill="none"
            stroke="black"
            stroke-width="1"
            stroke-linecap="round"
            stroke-linejoin="round"
            />
            
            
        </svg>