<?xml version="1.0"?><!DOCTYPE svg PUBLIC "-//W3C//DTD SVG 1.1//EN" "http://www.w3.org/Graphics/SVG/1.1/DTD/svg11.dtd"><svg xmlns="http://www.w3.org/2000/svg" xmlns:xlink="http://www.w3.org/1999/xlink" width="350" height="1000" viewBox="0 0 7 17" >
            
                ['<path class="dot" d="M 1.885,0.31800000000000006 L 1.8849999999999998,0.31800000000000006 C 1.6649999999999998,0.09799999999999998 1.3239999999999998,0.09799999999999995 1.1039999999999999,0.31800000000000006 L 0.8179999999999998,0.6040000000000002 C 0.5979999999999998,0.8240000000000002 0.5979999999999998,1.1650000000000003 0.8179999999999998,1.3850000000000002 L 1.1149999999999998,1.682 C 1.3349999999999997,1.902 1.676,1.902 1.8959999999999997,1.682 L 2.1820000000000004,1.3850000000000002 C 2.402,1.165 2.402,0.8240000000000002 2.1820000000000004,0.6040000000000001 L 1.885,0.31800000000000006" stroke-linejoin="round"/>', '<path class="dot" d="M 1.885,7.3180000000000005 L 1.8849999999999998,7.3180000000000005 C 1.6649999999999998,7.098000000000001 1.3239999999999998,7.098000000000001 1.1039999999999999,7.3180000000000005 L 0.8179999999999998,7.604000000000001 C 0.5979999999999998,7.824000000000001 0.5979999999999998,8.165000000000001 0.8179999999999998,8.385000000000002 L 1.1149999999999998,8.682 C 1.3349999999999997,8.902000000000001 1.676,8.902000000000001 1.8959999999999997,8.682 L 2.1820000000000004,8.385000000000002 C 2.402,8.165000000000001 2.402,7.824000000000001 2.1820000000000004,7.604000000000001 L 1.885,7.3180000000000005" stroke-linejoin="round"/>', '<path class="dot" d="M 3.885,10.318 L 3.885,10.318 C 3.6649999999999996,10.098 3.324,10.098 3.1039999999999996,10.318 L 2.8179999999999996,10.604000000000001 C 2.5979999999999994,10.824 2.5979999999999994,11.165000000000001 2.8179999999999996,11.385000000000002 L 3.1149999999999993,11.682 C 3.3349999999999995,11.902000000000001 3.6759999999999997,11.902000000000001 3.8959999999999995,11.682 L 4.182,11.385000000000002 C 4.402,11.165000000000001 4.402,10.824 4.182,10.604000000000001 L 3.885,10.318000000000001" stroke-linejoin="round"/>', '<path class="dot" d="M 5.885,7.3180000000000005 L 5.885,7.3180000000000005 C 5.664999999999999,7.098000000000001 5.324,7.098000000000001 5.103999999999999,7.3180000000000005 L 4.818,7.604000000000001 C 4.598,7.824000000000001 4.598,8.165000000000001 4.818,8.385000000000002 L 5.114999999999999,8.682 C 5.334999999999999,8.902000000000001 5.676,8.902000000000001 5.895999999999999,8.682 L 6.182,8.385000000000002 C 6.402,8.165000000000001 6.402,7.824000000000001 6.182,7.604000000000001 L 5.885,7.3180000000000005" stroke-linejoin="round"/>', '<path class="dot" d="M 5.885,0.31800000000000006 L 5.885,0.31800000000000006 C 5.664999999999999,0.09799999999999998 5.324,0.09799999999999995 5.103999999999999,0.31800000000000006 L 4.818,0.6040000000000002 C 4.598,0.8240000000000002 4.598,1.1650000000000003 4.818,1.3850000000000002 L 5.114999999999999,1.682 C 5.334999999999999,1.902 5.676,1.902 5.895999999999999,1.682 L 6.182,1.3850000000000002 C 6.402,1.165 6.402,0.8240000000000002 6.182,0.6040000000000001 L 5.885,0.31800000000000006" stroke-linejoin="round"/>']
            
                ['<path class="dot" d="M 2.885,-1.682 L 2.885,-1.682 C 2.665,-1.9020000000000001 2.324,-1.9020000000000001 2.1039999999999996,-1.682 L 1.8179999999999998,-1.396 C 1.5979999999999999,-1.1759999999999997 1.5979999999999996,-0.8349999999999997 1.8179999999999998,-0.6149999999999998 L 2.1149999999999998,-0.31800000000000006 C 2.335,-0.09800000000000009 2.676,-0.09800000000000009 2.896,-0.31800000000000006 L 3.1820000000000004,-0.6149999999999998 C 3.402,-0.835 3.402,-1.1759999999999997 3.1820000000000004,-1.396 L 2.885,-1.682" stroke-linejoin="round"/>', '<path class="dot" d="M 4.885,-2.682 L 4.885,-2.682 C 4.664999999999999,-2.902 4.324,-2.902 4.103999999999999,-2.682 L 3.8179999999999996,-2.396 C 3.5979999999999994,-2.1759999999999997 3.5979999999999994,-1.8349999999999997 3.8179999999999996,-1.6149999999999998 L 4.114999999999999,-1.318 C 4.334999999999999,-1.098 4.676,-1.098 4.895999999999999,-1.318 L 5.182,-1.6149999999999998 C 5.402,-1.835 5.402,-2.1759999999999997 5.182,-2.396 L 4.885,-2.682" stroke-linejoin="round"/>']
            
            
            <path d="M 1.5,1.0 L 1.5,8.0 L 3.5,11.0 L 5.5,8.0 L 5.5,1.0" fill="none"
            stroke="black"
            stroke-width="1"
            stroke-linecap="round"
            stroke-linejoin="round"
            />
            
            <path d="M 2.5,-1.0 L 4.5,-2.0" fill="none"
            stroke="black"
            stroke-width="1"
            stroke-linecap="round"
            stroke-linejoin="round"
            />
            
            
        </svg>