<?xml version="1.0"?><!DOCTYPE svg PUBLIC "-//W3C//DTD SVG 1.1//EN" "http://www.w3.org/Graphics/SVG/1.1/DTD/svg11.dtd"><svg xmlns="http://www.w3.org/2000/svg" xmlns:xlink="http://www.w3.org/1999/xlink" width="350" height="1000" viewBox="0 0 10 26" >
            
                ['<path class="dot" d="M 4.519583333333333,14.140270833333332 L 4.519583333333333,14.140270833333332 C 4.229583333333333,13.850270833333333 3.7800833333333332,13.850270833333333 3.490083333333333,14.140270833333332 L 3.113083333333333,14.517270833333333 C 2.823083333333333,14.807270833333334 2.823083333333333,15.256770833333333 3.113083333333333,15.546770833333333 L 3.504583333333333,15.938270833333332 C 3.7945833333333328,16.228270833333333 4.244083333333333,16.228270833333333 4.534083333333333,15.938270833333332 L 4.911083333333334,15.546770833333333 C 5.201083333333333,15.256770833333333 5.201083333333333,14.807270833333334 4.911083333333334,14.517270833333333 L 4.519583333333333,14.140270833333332" stroke-linejoin="round"/>', '<path class="dot" d="M 4.519583333333333,0.1402708333333331 L 4.519583333333333,0.1402708333333331 C 4.229583333333333,-0.14972916666666694 3.7800833333333332,-0.149729166666667 3.490083333333333,0.1402708333333331 L 3.113083333333333,0.5172708333333332 C 2.823083333333333,0.8072708333333332 2.823083333333333,1.2567708333333332 3.113083333333333,1.5467708333333332 L 3.504583333333333,1.938270833333333 C 3.7945833333333328,2.228270833333333 4.244083333333333,2.228270833333333 4.534083333333333,1.938270833333333 L 4.911083333333334,1.5467708333333332 C 5.201083333333333,1.2567708333333332 5.201083333333333,0.8072708333333333 4.911083333333334,0.5172708333333331 L 4.519583333333333,0.14027083333333312" stroke-linejoin="round"/>']
            
                ['<path class="dot" d="M 2.5195833333333333,14.140270833333332 L 2.5195833333333333,14.140270833333332 C 2.2295833333333333,13.850270833333333 1.7800833333333332,13.850270833333333 1.4900833333333332,14.140270833333332 L 1.1130833333333332,14.517270833333333 C 0.8230833333333332,14.807270833333334 0.8230833333333331,15.256770833333333 1.1130833333333332,15.546770833333333 L 1.5045833333333332,15.938270833333332 C 1.794583333333333,16.228270833333333 2.244083333333333,16.228270833333333 2.5340833333333332,15.938270833333332 L 2.9110833333333335,15.546770833333333 C 3.2010833333333335,15.256770833333333 3.2010833333333335,14.807270833333334 2.9110833333333335,14.517270833333333 L 2.5195833333333333,14.140270833333332" stroke-linejoin="round"/>', '<path class="dot" d="M 6.519583333333333,14.140270833333332 L 6.519583333333332,14.140270833333332 C 6.229583333333332,13.850270833333333 5.780083333333333,13.850270833333333 5.490083333333333,14.140270833333332 L 5.113083333333333,14.517270833333333 C 4.823083333333333,14.807270833333334 4.823083333333333,15.256770833333333 5.113083333333333,15.546770833333333 L 5.504583333333333,15.938270833333332 C 5.794583333333333,16.228270833333333 6.244083333333332,16.228270833333333 6.534083333333332,15.938270833333332 L 6.911083333333333,15.546770833333333 C 7.201083333333333,15.256770833333333 7.201083333333333,14.807270833333334 6.911083333333333,14.517270833333333 L 6.519583333333333,14.140270833333332" stroke-linejoin="round"/>']
            
                ['<path class="dot" d="M 2.5195833333333333,0.1402708333333331 L 2.5195833333333333,0.1402708333333331 C 2.2295833333333333,-0.14972916666666694 1.7800833333333332,-0.149729166666667 1.4900833333333332,0.1402708333333331 L 1.1130833333333332,0.5172708333333332 C 0.8230833333333332,0.8072708333333332 0.8230833333333331,1.2567708333333332 1.1130833333333332,1.5467708333333332 L 1.5045833333333332,1.938270833333333 C 1.794583333333333,2.228270833333333 2.244083333333333,2.228270833333333 2.5340833333333332,1.938270833333333 L 2.9110833333333335,1.5467708333333332 C 3.2010833333333335,1.2567708333333332 3.2010833333333335,0.8072708333333333 2.9110833333333335,0.5172708333333331 L 2.5195833333333333,0.14027083333333312" stroke-linejoin="round"/>', '<path class="dot" d="M 6.519583333333333,0.1402708333333331 L 6.519583333333332,0.1402708333333331 C 6.229583333333332,-0.14972916666666694 5.780083333333333,-0.149729166666667 5.490083333333333,0.1402708333333331 L 5.113083333333333,0.5172708333333332 C 4.823083333333333,0.8072708333333332 4.823083333333333,1.2567708333333332 5.113083333333333,1.5467708333333332 L 5.504583333333333,1.938270833333333 C 5.794583333333333,2.228270833333333 6.244083333333332,2.228270833333333 6.534083333333332,1.938270833333333 L 6.911083333333333,1.5467708333333332 C 7.201083333333333,1.2567708333333332 7.201083333333333,0.8072708333333333 6.911083333333333,0.5172708333333331 L 6.519583333333333,0.14027083333333312" stroke-linejoin="round"/>']
            
                ['<path class="dot" d="M 7.519583333333333,-2.859728766666668 L 7.519583333333332,-2.859728766666668 C 7.229583333333332,-3.149728766666668 6.780083333333333,-3.149728766666668 6.490083333333333,-2.859728766666668 L 6.113083333333333,-2.4827287666666678 C 5.823083333333333,-2.1927287666666677 5.823083333333333,-1.7432287666666677 6.113083333333333,-1.4532287666666677 L 6.504583333333333,-1.061728766666668 C 6.794583333333333,-0.7717287666666679 7.244083333333332,-0.7717287666666679 7.534083333333332,-1.061728766666668 L 7.911083333333333,-1.4532287666666677 C 8.201083333333333,-1.7432287666666677 8.201083333333333,-2.1927287666666677 7.911083333333333,-2.4827287666666678 L 7.519583333333333,-2.8597287666666675" stroke-linejoin="round"/>', '<path class="dot" d="M 3.5195833333333333,-0.8597291666666675 L 3.5195833333333333,-0.8597291666666675 C 3.2295833333333333,-1.1497291666666676 2.7800833333333332,-1.1497291666666676 2.490083333333333,-0.8597291666666675 L 2.113083333333333,-0.48272916666666743 C 1.8230833333333332,-0.1927291666666675 1.8230833333333332,0.2567708333333325 2.113083333333333,0.5467708333333325 L 2.504583333333333,0.9382708333333323 C 2.7945833333333328,1.2282708333333323 3.244083333333333,1.2282708333333323 3.5340833333333332,0.9382708333333323 L 3.9110833333333335,0.5467708333333325 C 4.201083333333333,0.2567708333333325 4.201083333333333,-0.1927291666666674 3.9110833333333335,-0.48272916666666754 L 3.5195833333333333,-0.8597291666666675" stroke-linejoin="round"/>']
            
            
            <path d="M 4.0,15.0 L 4.0,1.0" fill="none"
            stroke="black"
            stroke-width="1.5"
            stroke-linecap="round"
            stroke-linejoin="round"
            />
            
            <path d="M 2.0,15.0 L 6.0,15.0" fill="none"
            stroke="black"
            stroke-width="1.5"
            stroke-linecap="round"
            stroke-linejoin="round"
            />
            
            <path d="M 2.0,1.0 L 6.0,1.0" fill="none"
            stroke="black"
            stroke-width="1.5"
            stroke-linecap="round"
            stroke-linejoin="round"
            />
            
            <path d="M 7.0,-1.9999996000000007 L 3.0,-6.661338147750939e-16" fill="none"
            stroke="black"
            stroke-width="1.5"
            stroke-linecap="round"
            stroke-linejoin="round"
            />
            
            
        </svg>