<?xml version="1.0"?><!DOCTYPE svg PUBLIC "-//W3C//DTD SVG 1.1//EN" "http://www.w3.org/Graphics/SVG/1.1/DTD/svg11.dtd"><svg xmlns="http://www.w3.org/2000/svg" xmlns:xlink="http://www.w3.org/1999/xlink" width="350" height="1000" viewBox="0 0 10 26" >
            
                ['<path class="dot" d="M 2.5195833333333333,14.140270833333332 L 2.5195833333333333,14.140270833333332 C 2.2295833333333333,13.850270833333333 1.7800833333333332,13.850270833333333 1.4900833333333332,14.140270833333332 L 1.1130833333333332,14.517270833333333 C 0.8230833333333332,14.807270833333334 0.8230833333333331,15.256770833333333 1.1130833333333332,15.546770833333333 L 1.5045833333333332,15.938270833333332 C 1.794583333333333,16.228270833333333 2.244083333333333,16.228270833333333 2.5340833333333332,15.938270833333332 L 2.9110833333333335,15.546770833333333 C 3.2010833333333335,15.256770833333333 3.2010833333333335,14.807270833333334 2.9110833333333335,14.517270833333333 L 2.5195833333333333,14.140270833333332" stroke-linejoin="round"/>', '<path class="dot" d="M 2.5195833333333333,0.1402708333333331 L 2.5195833333333333,0.1402708333333331 C 2.2295833333333333,-0.14972916666666694 1.7800833333333332,-0.149729166666667 1.4900833333333332,0.1402708333333331 L 1.1130833333333332,0.5172708333333332 C 0.8230833333333332,0.8072708333333332 0.8230833333333331,1.2567708333333332 1.1130833333333332,1.5467708333333332 L 1.5045833333333332,1.938270833333333 C 1.794583333333333,2.228270833333333 2.244083333333333,2.228270833333333 2.5340833333333332,1.938270833333333 L 2.9110833333333335,1.5467708333333332 C 3.2010833333333335,1.2567708333333332 3.2010833333333335,0.8072708333333333 2.9110833333333335,0.5172708333333331 L 2.5195833333333333,0.14027083333333312" stroke-linejoin="round"/>']
            
                ['<path class="dot" d="M 2.5195833333333333,14.140269833333333 L 2.5195833333333333,14.140269833333333 C 2.2295833333333333,13.850269833333334 1.7800833333333332,13.850269833333334 1.4900833333333332,14.140269833333333 L 1.1130833333333332,14.517269833333334 C 0.8230833333333332,14.807269833333333 0.8230833333333331,15.256769833333333 1.1130833333333332,15.546769833333334 L 1.5045833333333332,15.938269833333333 C 1.794583333333333,16.228269833333332 2.244083333333333,16.228269833333332 2.5340833333333332,15.938269833333333 L 2.9110833333333335,15.546769833333334 C 3.2010833333333335,15.256769833333333 3.2010833333333335,14.807269833333335 2.9110833333333335,14.517269833333334 L 2.5195833333333333,14.140269833333333" stroke-linejoin="round"/>', '<path class="dot" d="M 5.519583233333334,14.140270833333332 L 5.519583233333334,14.140270833333332 C 5.229583233333334,13.850270833333333 4.780083233333333,13.850270833333333 4.490083233333333,14.140270833333332 L 4.113083233333334,14.517270833333333 C 3.8230832333333336,14.807270833333334 3.8230832333333336,15.256770833333333 4.113083233333334,15.546770833333333 L 4.504583233333333,15.938270833333332 C 4.794583233333333,16.228270833333333 5.244083233333334,16.228270833333333 5.534083233333334,15.938270833333332 L 5.9110832333333345,15.546770833333333 C 6.201083233333334,15.256770833333333 6.201083233333334,14.807270833333334 5.9110832333333345,14.517270833333333 L 5.519583233333334,14.140270833333332" stroke-linejoin="round"/>', '<path class="dot" d="M 7.519583233333334,12.140270833333332 L 7.519583233333333,12.140270833333332 C 7.229583233333333,11.850270833333333 6.780083233333333,11.850270833333333 6.490083233333333,12.140270833333332 L 6.113083233333334,12.517270833333333 C 5.8230832333333336,12.807270833333334 5.8230832333333336,13.256770833333333 6.113083233333334,13.546770833333333 L 6.504583233333333,13.938270833333332 C 6.794583233333333,14.228270833333333 7.244083233333333,14.228270833333333 7.534083233333333,13.938270833333332 L 7.911083233333334,13.546770833333333 C 8.201083233333334,13.256770833333333 8.201083233333334,12.807270833333334 7.911083233333334,12.517270833333333 L 7.519583233333334,12.140270833333332" stroke-linejoin="round"/>', '<path class="dot" d="M 8.509949933333335,9.169170133333331 L 8.509949933333335,9.169170133333331 C 8.219949933333334,8.879170133333332 7.770449933333334,8.879170133333332 7.480449933333334,9.169170133333331 L 7.1034499333333345,9.546170133333332 C 6.8134499333333345,9.836170133333333 6.8134499333333345,10.285670133333332 7.1034499333333345,10.575670133333333 L 7.494949933333334,10.967170133333331 C 7.784949933333334,11.257170133333332 8.234449933333334,11.257170133333332 8.524449933333335,10.967170133333331 L 8.901449933333335,10.575670133333333 C 9.191449933333335,10.285670133333332 9.191449933333335,9.836170133333333 8.901449933333335,9.546170133333332 L 8.509949933333335,9.169170133333331" stroke-linejoin="round"/>', '<path class="dot" d="M 8.519579933333334,5.170733733333332 L 8.519579933333334,5.170733733333332 C 8.229579933333333,4.880733733333332 7.780079933333334,4.880733733333332 7.490079933333334,5.170733733333332 L 7.113079933333334,5.547733733333332 C 6.823079933333334,5.837733733333332 6.823079933333334,6.287233733333332 7.113079933333334,6.5772337333333315 L 7.504579933333334,6.968733733333332 C 7.794579933333334,7.258733733333331 8.244079933333333,7.258733733333331 8.534079933333334,6.968733733333332 L 8.911079933333333,6.5772337333333315 C 9.201079933333334,6.287233733333332 9.201079933333334,5.837733733333332 8.911079933333333,5.547733733333332 L 8.519579933333334,5.170733733333332" stroke-linejoin="round"/>', '<path class="dot" d="M 7.519579933333334,2.1402708333333322 L 7.5195799333333335,2.1402708333333322 C 7.2295799333333335,1.8502708333333322 6.780079933333334,1.8502708333333322 6.490079933333334,2.1402708333333322 L 6.113079933333334,2.5172708333333325 C 5.823079933333334,2.807270833333332 5.823079933333334,3.2567708333333325 6.113079933333334,3.5467708333333325 L 6.504579933333334,3.9382708333333323 C 6.794579933333334,4.228270833333332 7.244079933333333,4.228270833333332 7.5340799333333335,3.9382708333333323 L 7.911079933333334,3.5467708333333325 C 8.201079933333334,3.2567708333333325 8.201079933333334,2.8072708333333325 7.911079933333334,2.517270833333332 L 7.519579933333334,2.1402708333333322" stroke-linejoin="round"/>', '<path class="dot" d="M 5.5195799333333335,0.1402708333333322 L 5.5195799333333335,0.1402708333333322 C 5.2295799333333335,-0.14972916666666783 4.780079933333333,-0.14972916666666788 4.490079933333333,0.1402708333333322 L 4.113079933333333,0.5172708333333323 C 3.823079933333333,0.8072708333333323 3.823079933333333,1.2567708333333323 4.113079933333333,1.5467708333333323 L 4.504579933333333,1.938270833333332 C 4.794579933333333,2.2282708333333323 5.244079933333333,2.2282708333333323 5.5340799333333335,1.938270833333332 L 5.911079933333333,1.5467708333333323 C 6.201079933333334,1.2567708333333323 6.201079933333334,0.8072708333333324 5.911079933333333,0.5172708333333322 L 5.5195799333333335,0.14027083333333223" stroke-linejoin="round"/>', '<path class="dot" d="M 2.5195833333333333,0.1402708333333322 L 2.5195833333333333,0.1402708333333322 C 2.2295833333333333,-0.14972916666666783 1.7800833333333332,-0.14972916666666788 1.4900833333333332,0.1402708333333322 L 1.1130833333333332,0.5172708333333323 C 0.8230833333333332,0.8072708333333323 0.8230833333333331,1.2567708333333323 1.1130833333333332,1.5467708333333323 L 1.5045833333333332,1.938270833333332 C 1.794583333333333,2.2282708333333323 2.244083333333333,2.2282708333333323 2.5340833333333332,1.938270833333332 L 2.9110833333333335,1.5467708333333323 C 3.2010833333333335,1.2567708333333323 3.2010833333333335,0.8072708333333324 2.9110833333333335,0.5172708333333322 L 2.5195833333333333,0.14027083333333223" stroke-linejoin="round"/>']
            
            
            <path d="M 2.0,15.0 L 2.0,1.0" fill="none"
            stroke="black"
            stroke-width="1.5"
            stroke-linecap="round"
            stroke-linejoin="round"
            />
            
            <path d="M 2.0,14.999999 L 4.999999900000001,15.0 L 6.999999900000001,13.0 L 7.990366600000001,10.028899299999999 L 7.9999966,6.030462899999999 L 6.9999966,2.999999999999999 L 4.9999966,0.9999999999999991 L 2.0,0.9999999999999991" fill="none"
            stroke="black"
            stroke-width="1.5"
            stroke-linecap="round"
            stroke-linejoin="round"
            />
            
            
        </svg>