<?xml version="1.0" encoding="UTF-8" standalone="no"?>
<!-- Created with Inkscape (http://www.inkscape.org/) -->

<svg
   width="9.9999876"
   height="10.000138"
   viewBox="0 0 9.9999876 10.000138"
   version="1.1"
   id="svg1"
   sodipodi:docname="petite-panse.svg"
   inkscape:version="1.3.2 (091e20ef0f, 2023-11-25, custom)"
   xmlns:inkscape="http://www.inkscape.org/namespaces/inkscape"
   xmlns:sodipodi="http://sodipodi.sourceforge.net/DTD/sodipodi-0.dtd"
   xmlns="http://www.w3.org/2000/svg"
   xmlns:svg="http://www.w3.org/2000/svg">
  <sodipodi:namedview
     id="namedview1"
     pagecolor="#ffffff"
     bordercolor="#666666"
     borderopacity="1.0"
     inkscape:showpageshadow="2"
     inkscape:pageopacity="0.0"
     inkscape:pagecheckerboard="0"
     inkscape:deskcolor="#d1d1d1"
     inkscape:zoom="57.899199"
     inkscape:cx="2.1589245"
     inkscape:cy="5.9586316"
     inkscape:window-width="2560"
     inkscape:window-height="1371"
     inkscape:window-x="0"
     inkscape:window-y="0"
     inkscape:window-maximized="1"
     inkscape:current-layer="svg1" />
  <defs
     id="defs1" />
  <path
     d="m 0,1.1338583e-4 m 0,0 L 6.0000001,0 7.9999749,1.0000252 9.0000001,2.0000126 9.9999875,4.0000252 V 6.0000001 L 9.0000001,8.0000127 7.9999749,9.0000001 6.0000001,10.000025 0,10.000139 m 4.9999749,-1.14e-4"
     style="fill:none;stroke:none;stroke-width:0.529168;stroke-linecap:round;stroke-linejoin:round"
     id="path1" />
</svg>
