<?xml version="1.0" encoding="UTF-8" standalone="no"?>
<svg
   data-dec="86"
   width="10"
   height="26"
   version="1.1"
   id="svg6322"
   xmlns="http://www.w3.org/2000/svg"
   xmlns:svg="http://www.w3.org/2000/svg"
   xmlns:rdf="http://www.w3.org/1999/02/22-rdf-syntax-ns#"
   xmlns:cc="http://creativecommons.org/ns#"
   xmlns:dc="http://purl.org/dc/elements/1.1/">
  <metadata
     id="metadata6328">
    <rdf:RDF>
      <cc:Work
         rdf:about="">
        <dc:format>image/svg+xml</dc:format>
        <dc:type
           rdf:resource="http://purl.org/dc/dcmitype/StillImage" />
      </cc:Work>
    </rdf:RDF>
  </metadata>
  <defs
     id="defs6326" />
  <path
     d="M 1,1 5.0000001,15 M 9,1 5.0000001,15"
     style="fill:none;stroke:none;stroke-width:1.96396;stroke-linecap:round;stroke-linejoin:round"
     id="path6320" />
</svg>
