<?xml version="1.0"?><!DOCTYPE svg PUBLIC "-//W3C//DTD SVG 1.1//EN" "http://www.w3.org/Graphics/SVG/1.1/DTD/svg11.dtd"><svg xmlns="http://www.w3.org/2000/svg" xmlns:xlink="http://www.w3.org/1999/xlink" width="350" height="1000" viewBox="0 0 7 17" >
            
                ['<path class="dot" d="M 1.885,0.31800000000000006 L 1.8849999999999998,0.31800000000000006 C 1.6649999999999998,0.09799999999999998 1.3239999999999998,0.09799999999999995 1.1039999999999999,0.31800000000000006 L 0.8179999999999998,0.6040000000000002 C 0.5979999999999998,0.8240000000000002 0.5979999999999998,1.1650000000000003 0.8179999999999998,1.3850000000000002 L 1.1149999999999998,1.682 C 1.3349999999999997,1.902 1.676,1.902 1.8959999999999997,1.682 L 2.1820000000000004,1.3850000000000002 C 2.402,1.165 2.402,0.8240000000000002 2.1820000000000004,0.6040000000000001 L 1.885,0.31800000000000006" stroke-linejoin="round"/>', '<path class="dot" d="M 3.885,5.3180000000000005 L 3.885,5.3180000000000005 C 3.6649999999999996,5.098000000000001 3.324,5.098000000000001 3.1039999999999996,5.3180000000000005 L 2.8179999999999996,5.604000000000001 C 2.5979999999999994,5.824000000000001 2.5979999999999994,6.165000000000001 2.8179999999999996,6.385000000000001 L 3.1149999999999993,6.682 C 3.3349999999999995,6.902 3.6759999999999997,6.902 3.8959999999999995,6.682 L 4.182,6.385000000000001 C 4.402,6.165000000000001 4.402,5.824000000000001 4.182,5.604000000000001 L 3.885,5.3180000000000005" stroke-linejoin="round"/>', '<path class="dot" d="M 5.885,0.31800000000000006 L 5.885,0.31800000000000006 C 5.664999999999999,0.09799999999999998 5.324,0.09799999999999995 5.103999999999999,0.31800000000000006 L 4.818,0.6040000000000002 C 4.598,0.8240000000000002 4.598,1.1650000000000003 4.818,1.3850000000000002 L 5.114999999999999,1.682 C 5.334999999999999,1.902 5.676,1.902 5.895999999999999,1.682 L 6.182,1.3850000000000002 C 6.402,1.165 6.402,0.8240000000000002 6.182,0.6040000000000001 L 5.885,0.31800000000000006" stroke-linejoin="round"/>', '<path class="dot" d="M 3.885,5.3180000000000005 L 3.885,5.3180000000000005 C 3.6649999999999996,5.098000000000001 3.324,5.098000000000001 3.1039999999999996,5.3180000000000005 L 2.8179999999999996,5.604000000000001 C 2.5979999999999994,5.824000000000001 2.5979999999999994,6.165000000000001 2.8179999999999996,6.385000000000001 L 3.1149999999999993,6.682 C 3.3349999999999995,6.902 3.6759999999999997,6.902 3.8959999999999995,6.682 L 4.182,6.385000000000001 C 4.402,6.165000000000001 4.402,5.824000000000001 4.182,5.604000000000001 L 3.885,5.3180000000000005" stroke-linejoin="round"/>']
            
            
            <path d="M 1.5,1.0 L 3.5,6.0 L 3.5,11.0 M 5.5,1.0 L 3.5,6.0" fill="none"
            stroke="black"
            stroke-width="1"
            stroke-linecap="round"
            stroke-linejoin="round"
            />
            
            
        </svg>