<?xml version="1.0" encoding="UTF-8" standalone="no"?>
<svg
   data-dec="107"
   width="10"
   height="21"
   version="1.1"
   id="svg6983"
   sodipodi:docname="o-e-cap.svg"
   inkscape:version="1.3.2 (091e20ef0f, 2023-11-25, custom)"
   xmlns:inkscape="http://www.inkscape.org/namespaces/inkscape"
   xmlns:sodipodi="http://sodipodi.sourceforge.net/DTD/sodipodi-0.dtd"
   xmlns="http://www.w3.org/2000/svg"
   xmlns:svg="http://www.w3.org/2000/svg"
   xmlns:rdf="http://www.w3.org/1999/02/22-rdf-syntax-ns#"
   xmlns:cc="http://creativecommons.org/ns#"
   xmlns:dc="http://purl.org/dc/elements/1.1/">
  <metadata
     id="metadata6989">
    <rdf:RDF>
      <cc:Work
         rdf:about="">
        <dc:format>image/svg+xml</dc:format>
        <dc:type
           rdf:resource="http://purl.org/dc/dcmitype/StillImage" />
      </cc:Work>
    </rdf:RDF>
  </metadata>
  <defs
     id="defs6987" />
  <sodipodi:namedview
     pagecolor="#ffffff"
     bordercolor="#666666"
     borderopacity="1"
     objecttolerance="10"
     gridtolerance="10"
     guidetolerance="10"
     inkscape:pageopacity="0"
     inkscape:pageshadow="2"
     inkscape:window-width="2560"
     inkscape:window-height="1403"
     id="namedview6985"
     showgrid="true"
     showguides="true"
     inkscape:guide-bbox="true"
     inkscape:zoom="33.213946"
     inkscape:cx="2.4989503"
     inkscape:cy="12.765722"
     inkscape:window-x="0"
     inkscape:window-y="0"
     inkscape:window-maximized="1"
     inkscape:current-layer="svg6983"
     inkscape:showpageshadow="2"
     inkscape:pagecheckerboard="0"
     inkscape:deskcolor="#d1d1d1">
    <sodipodi:guide
       position="1.5,19"
       orientation="0,1"
       id="guide7534"
       inkscape:locked="false" />
    <inkscape:grid
       type="xygrid"
       id="grid7536"
       originx="-2"
       originy="-1"
       spacingy="1"
       spacingx="1"
       units="px"
       visible="true" />
    <sodipodi:guide
       position="11,33"
       orientation="0,1"
       id="guide7538"
       inkscape:locked="false" />
    <sodipodi:guide
       position="5,40"
       orientation="0,1"
       id="guide7540"
       inkscape:locked="false" />
  </sodipodi:namedview>
  <path
     d="M 5,0 H 3 L 2,1 1,3 0,8 v 5 l 1,5 1,2 1,1 H 5 M 5,0 V 21 M 5,0 h 5 M 5,10 H 8 M 5,21 h 5"
     style="fill:none;stroke:none;stroke-width:2;stroke-linecap:round;stroke-linejoin:round"
     id="path1"
     sodipodi:nodetypes="cccccccccccccccccc" />
</svg>
