<?xml version="1.0"?><!DOCTYPE svg PUBLIC "-//W3C//DTD SVG 1.1//EN" "http://www.w3.org/Graphics/SVG/1.1/DTD/svg11.dtd"><svg xmlns="http://www.w3.org/2000/svg" xmlns:xlink="http://www.w3.org/1999/xlink" width="350" height="1000" viewBox="0 0 14 40" >
            
                ['<path class="dot" d="M 2.7909438775510207,-0.22280612244898207 L 2.79094387755102,-0.22280612244898207 C 2.3409438775510196,-0.6728061224489821 1.6434438775510198,-0.6728061224489822 1.19344387755102,-0.22280612244898207 L 0.6084438775510199,0.3621938775510183 C 0.15844387755101996,0.8121938775510182 0.15844387755101985,1.5096938775510182 0.6084438775510199,1.9596938775510184 L 1.2159438775510198,2.567193877551018 C 1.6659438775510198,3.0171938775510174 2.3634438775510196,3.0171938775510174 2.8134438775510198,2.567193877551018 L 3.3984438775510206,1.9596938775510184 C 3.84844387755102,1.5096938775510182 3.84844387755102,0.8121938775510182 3.3984438775510206,0.36219387755101806 L 2.7909438775510207,-0.2228061224489819" stroke-linejoin="round"/>', '<path class="dot" d="M 2.7909438775510207,20.777193877551017 L 2.79094387755102,20.777193877551017 C 2.3409438775510196,20.327193877551018 1.6434438775510198,20.327193877551018 1.19344387755102,20.777193877551017 L 0.6084438775510199,21.362193877551018 C 0.15844387755101996,21.812193877551017 0.15844387755101985,22.50969387755102 0.6084438775510199,22.959693877551018 L 1.2159438775510198,23.56719387755102 C 1.6659438775510198,24.01719387755102 2.3634438775510196,24.01719387755102 2.8134438775510198,23.56719387755102 L 3.3984438775510206,22.959693877551018 C 3.84844387755102,22.50969387755102 3.84844387755102,21.812193877551017 3.3984438775510206,21.362193877551018 L 2.7909438775510207,20.777193877551017" stroke-linejoin="round"/>']
            
                ['<path class="dot" d="M 2.7909438775510207,-0.22280612244898207 L 2.79094387755102,-0.22280612244898207 C 2.3409438775510196,-0.6728061224489821 1.6434438775510198,-0.6728061224489822 1.19344387755102,-0.22280612244898207 L 0.6084438775510199,0.3621938775510183 C 0.15844387755101996,0.8121938775510182 0.15844387755101985,1.5096938775510182 0.6084438775510199,1.9596938775510184 L 1.2159438775510198,2.567193877551018 C 1.6659438775510198,3.0171938775510174 2.3634438775510196,3.0171938775510174 2.8134438775510198,2.567193877551018 L 3.3984438775510206,1.9596938775510184 C 3.84844387755102,1.5096938775510182 3.84844387755102,0.8121938775510182 3.3984438775510206,0.36219387755101806 L 2.7909438775510207,-0.2228061224489819" stroke-linejoin="round"/>', '<path class="dot" d="M 12.790942977551019,-0.22280612244898207 L 12.790942977551019,-0.22280612244898207 C 12.34094297755102,-0.6728061224489821 11.64344297755102,-0.6728061224489822 11.193442977551019,-0.22280612244898207 L 10.60844297755102,0.3621938775510183 C 10.158442977551019,0.8121938775510182 10.158442977551019,1.5096938775510182 10.60844297755102,1.9596938775510184 L 11.21594297755102,2.567193877551018 C 11.665942977551019,3.0171938775510174 12.363442977551019,3.0171938775510174 12.81344297755102,2.567193877551018 L 13.39844297755102,1.9596938775510184 C 13.84844297755102,1.5096938775510182 13.84844297755102,0.8121938775510182 13.39844297755102,0.36219387755101806 L 12.790942977551019,-0.2228061224489819" stroke-linejoin="round"/>']
            
                ['<path class="dot" d="M 2.7909438775510207,9.777193877551019 L 2.79094387755102,9.777193877551019 C 2.3409438775510196,9.327193877551018 1.6434438775510198,9.327193877551018 1.19344387755102,9.777193877551019 L 0.6084438775510199,10.362193877551018 C 0.15844387755101996,10.81219387755102 0.15844387755101985,11.509693877551019 0.6084438775510199,11.959693877551018 L 1.2159438775510198,12.567193877551018 C 1.6659438775510198,13.01719387755102 2.3634438775510196,13.01719387755102 2.8134438775510198,12.567193877551018 L 3.3984438775510206,11.959693877551018 C 3.84844387755102,11.509693877551019 3.84844387755102,10.81219387755102 3.3984438775510206,10.362193877551018 L 2.7909438775510207,9.777193877551019" stroke-linejoin="round"/>', '<path class="dot" d="M 10.790943577551019,9.777193877551019 L 10.790943577551019,9.777193877551019 C 10.34094357755102,9.327193877551018 9.64344357755102,9.327193877551018 9.193443577551019,9.777193877551019 L 8.60844357755102,10.362193877551018 C 8.158443577551019,10.81219387755102 8.158443577551019,11.509693877551019 8.60844357755102,11.959693877551018 L 9.21594357755102,12.567193877551018 C 9.665943577551019,13.01719387755102 10.363443577551019,13.01719387755102 10.81344357755102,12.567193877551018 L 11.39844357755102,11.959693877551018 C 11.84844357755102,11.509693877551019 11.84844357755102,10.81219387755102 11.39844357755102,10.362193877551018 L 10.790943577551019,9.777193877551019" stroke-linejoin="round"/>']
            
                ['<path class="dot" d="M 2.7909438775510207,20.777193877551017 L 2.79094387755102,20.777193877551017 C 2.3409438775510196,20.327193877551018 1.6434438775510198,20.327193877551018 1.19344387755102,20.777193877551017 L 0.6084438775510199,21.362193877551018 C 0.15844387755101996,21.812193877551017 0.15844387755101985,22.50969387755102 0.6084438775510199,22.959693877551018 L 1.2159438775510198,23.56719387755102 C 1.6659438775510198,24.01719387755102 2.3634438775510196,24.01719387755102 2.8134438775510198,23.56719387755102 L 3.3984438775510206,22.959693877551018 C 3.84844387755102,22.50969387755102 3.84844387755102,21.812193877551017 3.3984438775510206,21.362193877551018 L 2.7909438775510207,20.777193877551017" stroke-linejoin="round"/>', '<path class="dot" d="M 12.790942977551019,20.777193877551017 L 12.790942977551019,20.777193877551017 C 12.34094297755102,20.327193877551018 11.64344297755102,20.327193877551018 11.193442977551019,20.777193877551017 L 10.60844297755102,21.362193877551018 C 10.158442977551019,21.812193877551017 10.158442977551019,22.50969387755102 10.60844297755102,22.959693877551018 L 11.21594297755102,23.56719387755102 C 11.665942977551019,24.01719387755102 12.363442977551019,24.01719387755102 12.81344297755102,23.56719387755102 L 13.39844297755102,22.959693877551018 C 13.84844297755102,22.50969387755102 13.84844297755102,21.812193877551017 13.39844297755102,21.362193877551018 L 12.790942977551019,20.777193877551017" stroke-linejoin="round"/>']
            
                ['<path class="dot" d="M 4.790943577551021,-6.222806122448982 L 4.79094357755102,-6.222806122448982 C 4.34094357755102,-6.672806122448982 3.64344357755102,-6.672806122448982 3.19344357755102,-6.222806122448982 L 2.60844357755102,-5.637806122448982 C 2.1584435775510205,-5.187806122448982 2.15844357755102,-4.490306122448982 2.60844357755102,-4.040306122448982 L 3.21594357755102,-3.4328061224489823 C 3.66594357755102,-2.9828061224489826 4.3634435775510205,-2.9828061224489826 4.81344357755102,-3.4328061224489823 L 5.398443577551021,-4.040306122448982 C 5.84844357755102,-4.490306122448982 5.84844357755102,-5.187806122448982 5.398443577551021,-5.637806122448982 L 4.790943577551021,-6.222806122448982" stroke-linejoin="round"/>', '<path class="dot" d="M 3.7909438775510207,-5.222806122448982 L 3.79094387755102,-5.222806122448982 C 3.3409438775510196,-5.672806122448982 2.64344387755102,-5.672806122448982 2.19344387755102,-5.222806122448982 L 1.60844387755102,-4.637806122448982 C 1.15844387755102,-4.187806122448982 1.15844387755102,-3.490306122448982 1.60844387755102,-3.040306122448982 L 2.2159438775510196,-2.4328061224489823 C 2.66594387755102,-1.9828061224489826 3.3634438775510196,-1.9828061224489826 3.8134438775510198,-2.4328061224489823 L 4.398443877551021,-3.040306122448982 C 4.84844387755102,-3.490306122448982 4.84844387755102,-4.187806122448982 4.398443877551021,-4.637806122448982 L 3.7909438775510207,-5.222806122448982" stroke-linejoin="round"/>', '<path class="dot" d="M 4.790943577551021,-4.222806122448982 L 4.79094357755102,-4.222806122448982 C 4.34094357755102,-4.672806122448982 3.64344357755102,-4.672806122448982 3.19344357755102,-4.222806122448982 L 2.60844357755102,-3.637806122448982 C 2.1584435775510205,-3.1878061224489818 2.15844357755102,-2.490306122448982 2.60844357755102,-2.040306122448982 L 3.21594357755102,-1.4328061224489823 C 3.66594357755102,-0.9828061224489826 4.3634435775510205,-0.9828061224489826 4.81344357755102,-1.4328061224489823 L 5.398443577551021,-2.040306122448982 C 5.84844357755102,-2.490306122448982 5.84844357755102,-3.1878061224489818 5.398443577551021,-3.637806122448982 L 4.790943577551021,-4.222806122448982" stroke-linejoin="round"/>', '<path class="dot" d="M 5.790943877551021,-5.222806122448982 L 5.79094387755102,-5.222806122448982 C 5.34094387755102,-5.672806122448982 4.64344387755102,-5.672806122448982 4.1934438775510205,-5.222806122448982 L 3.60844387755102,-4.637806122448982 C 3.1584438775510204,-4.187806122448982 3.15844387755102,-3.490306122448982 3.60844387755102,-3.040306122448982 L 4.21594387755102,-2.4328061224489823 C 4.66594387755102,-1.9828061224489826 5.3634438775510205,-1.9828061224489826 5.81344387755102,-2.4328061224489823 L 6.398443877551021,-3.040306122448982 C 6.84844387755102,-3.490306122448982 6.84844387755102,-4.187806122448982 6.398443877551021,-4.637806122448982 L 5.790943877551021,-5.222806122448982" stroke-linejoin="round"/>', '<path class="dot" d="M 10.79094487755102,-6.222806122448982 L 10.79094487755102,-6.222806122448982 C 10.34094487755102,-6.672806122448982 9.64344487755102,-6.672806122448982 9.19344487755102,-6.222806122448982 L 8.60844487755102,-5.637806122448982 C 8.15844487755102,-5.187806122448982 8.15844487755102,-4.490306122448982 8.60844487755102,-4.040306122448982 L 9.21594487755102,-3.4328061224489823 C 9.66594487755102,-2.9828061224489826 10.36344487755102,-2.9828061224489826 10.81344487755102,-3.4328061224489823 L 11.398444877551022,-4.040306122448982 C 11.848444877551021,-4.490306122448982 11.848444877551021,-5.187806122448982 11.398444877551022,-5.637806122448982 L 10.79094487755102,-6.222806122448982" stroke-linejoin="round"/>', '<path class="dot" d="M 9.79094377755102,-5.222806122448982 L 9.790943777551018,-5.222806122448982 C 9.340943777551018,-5.672806122448982 8.643443777551019,-5.672806122448982 8.19344377755102,-5.222806122448982 L 7.608443777551019,-4.637806122448982 C 7.158443777551019,-4.187806122448982 7.158443777551019,-3.490306122448982 7.608443777551019,-3.040306122448982 L 8.215943777551018,-2.4328061224489823 C 8.66594377755102,-1.9828061224489826 9.36344377755102,-1.9828061224489826 9.813443777551019,-2.4328061224489823 L 10.39844377755102,-3.040306122448982 C 10.848443777551019,-3.490306122448982 10.848443777551019,-4.187806122448982 10.39844377755102,-4.637806122448982 L 9.79094377755102,-5.222806122448982" stroke-linejoin="round"/>', '<path class="dot" d="M 10.79094487755102,-4.222806122448982 L 10.79094487755102,-4.222806122448982 C 10.34094487755102,-4.672806122448982 9.64344487755102,-4.672806122448982 9.19344487755102,-4.222806122448982 L 8.60844487755102,-3.637806122448982 C 8.15844487755102,-3.1878061224489818 8.15844487755102,-2.490306122448982 8.60844487755102,-2.040306122448982 L 9.21594487755102,-1.4328061224489823 C 9.66594487755102,-0.9828061224489826 10.36344487755102,-0.9828061224489826 10.81344487755102,-1.4328061224489823 L 11.398444877551022,-2.040306122448982 C 11.848444877551021,-2.490306122448982 11.848444877551021,-3.1878061224489818 11.398444877551022,-3.637806122448982 L 10.79094487755102,-4.222806122448982" stroke-linejoin="round"/>', '<path class="dot" d="M 11.790943877551019,-5.222806122448982 L 11.790943877551019,-5.222806122448982 C 11.34094387755102,-5.672806122448982 10.64344387755102,-5.672806122448982 10.193443877551019,-5.222806122448982 L 9.60844387755102,-4.637806122448982 C 9.158443877551019,-4.187806122448982 9.158443877551019,-3.490306122448982 9.60844387755102,-3.040306122448982 L 10.21594387755102,-2.4328061224489823 C 10.665943877551019,-1.9828061224489826 11.363443877551019,-1.9828061224489826 11.81344387755102,-2.4328061224489823 L 12.39844387755102,-3.040306122448982 C 12.84844387755102,-3.490306122448982 12.84844387755102,-4.187806122448982 12.39844387755102,-4.637806122448982 L 11.790943877551019,-5.222806122448982" stroke-linejoin="round"/>', '<path class="dot" d="M 10.79094487755102,-6.222806122448982 L 10.79094487755102,-6.222806122448982 C 10.34094487755102,-6.672806122448982 9.64344487755102,-6.672806122448982 9.19344487755102,-6.222806122448982 L 8.60844487755102,-5.637806122448982 C 8.15844487755102,-5.187806122448982 8.15844487755102,-4.490306122448982 8.60844487755102,-4.040306122448982 L 9.21594487755102,-3.4328061224489823 C 9.66594487755102,-2.9828061224489826 10.36344487755102,-2.9828061224489826 10.81344487755102,-3.4328061224489823 L 11.398444877551022,-4.040306122448982 C 11.848444877551021,-4.490306122448982 11.848444877551021,-5.187806122448982 11.398444877551022,-5.637806122448982 L 10.79094487755102,-6.222806122448982" stroke-linejoin="round"/>']
            
            
            <path d="M 2.0,1.0 L 2.0,22.0" fill="none"
            stroke="black"
            stroke-width="2.5"
            stroke-linecap="round"
            stroke-linejoin="round"
            />
            
            <path d="M 2.0,1.0 L 11.9999991,1.0" fill="none"
            stroke="black"
            stroke-width="2.5"
            stroke-linecap="round"
            stroke-linejoin="round"
            />
            
            <path d="M 2.0,11.0 L 9.9999997,11.0" fill="none"
            stroke="black"
            stroke-width="2.5"
            stroke-linecap="round"
            stroke-linejoin="round"
            />
            
            <path d="M 2.0,22.0 L 11.9999991,22.0" fill="none"
            stroke="black"
            stroke-width="2.5"
            stroke-linecap="round"
            stroke-linejoin="round"
            />
            
            <path d="M 3.9999997,-5.0 L 3.0,-4.0 L 3.9999997,-3.0 L 5.0,-4.0 L 3.9999997,-5.0 M 10.000001000000001,-5.0 L 8.999999899999999,-4.0 L 10.000001000000001,-3.0 L 11.0,-4.0 L 10.000001000000001,-5.0" fill="none"
            stroke="black"
            stroke-width="2.5"
            stroke-linecap="round"
            stroke-linejoin="round"
            />
            
            
        </svg>