<?xml version="1.0"?><!DOCTYPE svg PUBLIC "-//W3C//DTD SVG 1.1//EN" "http://www.w3.org/Graphics/SVG/1.1/DTD/svg11.dtd"><svg xmlns="http://www.w3.org/2000/svg" xmlns:xlink="http://www.w3.org/1999/xlink" width="350" height="1000" viewBox="0 0 14 40" >
            
                ['<path class="dot" d="M 10.790943877551019,19.777193877551017 L 10.790943877551019,19.777193877551017 C 10.34094387755102,19.327193877551018 9.64344387755102,19.327193877551018 9.193443877551019,19.777193877551017 L 8.60844387755102,20.362193877551018 C 8.158443877551019,20.812193877551017 8.158443877551019,21.50969387755102 8.60844387755102,21.959693877551018 L 9.21594387755102,22.56719387755102 C 9.665943877551019,23.01719387755102 10.363443877551019,23.01719387755102 10.81344387755102,22.56719387755102 L 11.39844387755102,21.959693877551018 C 11.84844387755102,21.50969387755102 11.84844387755102,20.812193877551017 11.39844387755102,20.362193877551018 L 10.790943877551019,19.777193877551017" stroke-linejoin="round"/>', '<path class="dot" d="M 12.790943877551019,15.777193877551019 L 12.790943877551019,15.777193877551019 C 12.34094387755102,15.327193877551018 11.64344387755102,15.327193877551018 11.193443877551019,15.777193877551019 L 10.60844387755102,16.362193877551018 C 10.158443877551019,16.812193877551017 10.158443877551019,17.50969387755102 10.60844387755102,17.959693877551018 L 11.21594387755102,18.56719387755102 C 11.665943877551019,19.01719387755102 12.363443877551019,19.01719387755102 12.81344387755102,18.56719387755102 L 13.39844387755102,17.959693877551018 C 13.84844387755102,17.50969387755102 13.84844387755102,16.812193877551017 13.39844387755102,16.362193877551018 L 12.790943877551019,15.777193877551019" stroke-linejoin="round"/>', '<path class="dot" d="M 12.790943877551019,11.777193877551019 L 12.790943877551019,11.777193877551019 C 12.34094387755102,11.327193877551018 11.64344387755102,11.327193877551018 11.193443877551019,11.777193877551019 L 10.60844387755102,12.362193877551018 C 10.158443877551019,12.81219387755102 10.158443877551019,13.509693877551019 10.60844387755102,13.959693877551018 L 11.21594387755102,14.567193877551018 C 11.665943877551019,15.01719387755102 12.363443877551019,15.01719387755102 12.81344387755102,14.567193877551018 L 13.39844387755102,13.959693877551018 C 13.84844387755102,13.509693877551019 13.84844387755102,12.81219387755102 13.39844387755102,12.362193877551018 L 12.790943877551019,11.777193877551019" stroke-linejoin="round"/>', '<path class="dot" d="M 10.790943877551019,7.777193877551018 L 10.790943877551019,7.777193877551018 C 10.34094387755102,7.327193877551018 9.64344387755102,7.327193877551018 9.193443877551019,7.777193877551018 L 8.60844387755102,8.362193877551018 C 8.158443877551019,8.812193877551017 8.158443877551019,9.509693877551019 8.60844387755102,9.959693877551018 L 9.21594387755102,10.567193877551018 C 9.665943877551019,11.017193877551017 10.363443877551019,11.017193877551017 10.81344387755102,10.567193877551018 L 11.39844387755102,9.959693877551018 C 11.84844387755102,9.509693877551019 11.84844387755102,8.812193877551017 11.39844387755102,8.362193877551018 L 10.790943877551019,7.777193877551018" stroke-linejoin="round"/>', '<path class="dot" d="M 8.79094387755102,6.777193877551018 L 8.790943877551019,6.777193877551018 C 8.34094387755102,6.327193877551018 7.64344387755102,6.327193877551018 7.1934438775510205,6.777193877551018 L 6.608443877551021,7.362193877551018 C 6.15844387755102,7.812193877551018 6.15844387755102,8.509693877551019 6.608443877551021,8.959693877551018 L 7.21594387755102,9.567193877551018 C 7.66594387755102,10.017193877551017 8.36344387755102,10.017193877551017 8.81344387755102,9.567193877551018 L 9.39844387755102,8.959693877551018 C 9.84844387755102,8.509693877551019 9.84844387755102,7.812193877551018 9.39844387755102,7.362193877551018 L 8.79094387755102,6.777193877551018" stroke-linejoin="round"/>', '<path class="dot" d="M 6.790943877551021,6.777193877551018 L 6.79094387755102,6.777193877551018 C 6.34094387755102,6.327193877551018 5.64344387755102,6.327193877551018 5.1934438775510205,6.777193877551018 L 4.608443877551021,7.362193877551018 C 4.15844387755102,7.812193877551018 4.15844387755102,8.509693877551019 4.608443877551021,8.959693877551018 L 5.21594387755102,9.567193877551018 C 5.66594387755102,10.017193877551017 6.3634438775510205,10.017193877551017 6.81344387755102,9.567193877551018 L 7.398443877551021,8.959693877551018 C 7.84844387755102,8.509693877551019 7.84844387755102,7.812193877551018 7.398443877551021,7.362193877551018 L 6.790943877551021,6.777193877551018" stroke-linejoin="round"/>', '<path class="dot" d="M 4.790943877551021,7.777193877551018 L 4.79094387755102,7.777193877551018 C 4.34094387755102,7.327193877551018 3.64344387755102,7.327193877551018 3.19344387755102,7.777193877551018 L 2.60844387755102,8.362193877551018 C 2.1584438775510204,8.812193877551017 2.15844387755102,9.509693877551019 2.60844387755102,9.959693877551018 L 3.21594387755102,10.567193877551018 C 3.66594387755102,11.017193877551017 4.3634438775510205,11.017193877551017 4.81344387755102,10.567193877551018 L 5.398443877551021,9.959693877551018 C 5.84844387755102,9.509693877551019 5.84844387755102,8.812193877551017 5.398443877551021,8.362193877551018 L 4.790943877551021,7.777193877551018" stroke-linejoin="round"/>', '<path class="dot" d="M 2.7909438775510207,11.777193877551019 L 2.79094387755102,11.777193877551019 C 2.3409438775510196,11.327193877551018 1.6434438775510198,11.327193877551018 1.19344387755102,11.777193877551019 L 0.6084438775510199,12.362193877551018 C 0.15844387755101996,12.81219387755102 0.15844387755101985,13.509693877551019 0.6084438775510199,13.959693877551018 L 1.2159438775510198,14.567193877551018 C 1.6659438775510198,15.01719387755102 2.3634438775510196,15.01719387755102 2.8134438775510198,14.567193877551018 L 3.3984438775510206,13.959693877551018 C 3.84844387755102,13.509693877551019 3.84844387755102,12.81219387755102 3.3984438775510206,12.362193877551018 L 2.7909438775510207,11.777193877551019" stroke-linejoin="round"/>', '<path class="dot" d="M 2.7909438775510207,15.777193877551019 L 2.79094387755102,15.777193877551019 C 2.3409438775510196,15.327193877551018 1.6434438775510198,15.327193877551018 1.19344387755102,15.777193877551019 L 0.6084438775510199,16.362193877551018 C 0.15844387755101996,16.812193877551017 0.15844387755101985,17.50969387755102 0.6084438775510199,17.959693877551018 L 1.2159438775510198,18.56719387755102 C 1.6659438775510198,19.01719387755102 2.3634438775510196,19.01719387755102 2.8134438775510198,18.56719387755102 L 3.3984438775510206,17.959693877551018 C 3.84844387755102,17.50969387755102 3.84844387755102,16.812193877551017 3.3984438775510206,16.362193877551018 L 2.7909438775510207,15.777193877551019" stroke-linejoin="round"/>', '<path class="dot" d="M 4.790943877551021,19.777193877551017 L 4.79094387755102,19.777193877551017 C 4.34094387755102,19.327193877551018 3.64344387755102,19.327193877551018 3.19344387755102,19.777193877551017 L 2.60844387755102,20.362193877551018 C 2.1584438775510204,20.812193877551017 2.15844387755102,21.50969387755102 2.60844387755102,21.959693877551018 L 3.21594387755102,22.56719387755102 C 3.66594387755102,23.01719387755102 4.3634438775510205,23.01719387755102 4.81344387755102,22.56719387755102 L 5.398443877551021,21.959693877551018 C 5.84844387755102,21.50969387755102 5.84844387755102,20.812193877551017 5.398443877551021,20.362193877551018 L 4.790943877551021,19.777193877551017" stroke-linejoin="round"/>', '<path class="dot" d="M 6.790943877551021,20.777193877551017 L 6.79094387755102,20.777193877551017 C 6.34094387755102,20.327193877551018 5.64344387755102,20.327193877551018 5.1934438775510205,20.777193877551017 L 4.608443877551021,21.362193877551018 C 4.15844387755102,21.812193877551017 4.15844387755102,22.50969387755102 4.608443877551021,22.959693877551018 L 5.21594387755102,23.56719387755102 C 5.66594387755102,24.01719387755102 6.3634438775510205,24.01719387755102 6.81344387755102,23.56719387755102 L 7.398443877551021,22.959693877551018 C 7.84844387755102,22.50969387755102 7.84844387755102,21.812193877551017 7.398443877551021,21.362193877551018 L 6.790943877551021,20.777193877551017" stroke-linejoin="round"/>', '<path class="dot" d="M 8.79094387755102,20.777193877551017 L 8.790943877551019,20.777193877551017 C 8.34094387755102,20.327193877551018 7.64344387755102,20.327193877551018 7.1934438775510205,20.777193877551017 L 6.608443877551021,21.362193877551018 C 6.15844387755102,21.812193877551017 6.15844387755102,22.50969387755102 6.608443877551021,22.959693877551018 L 7.21594387755102,23.56719387755102 C 7.66594387755102,24.01719387755102 8.36344387755102,24.01719387755102 8.81344387755102,23.56719387755102 L 9.39844387755102,22.959693877551018 C 9.84844387755102,22.50969387755102 9.84844387755102,21.812193877551017 9.39844387755102,21.362193877551018 L 8.79094387755102,20.777193877551017" stroke-linejoin="round"/>', '<path class="dot" d="M 10.790943877551019,19.777193877551017 L 10.790943877551019,19.777193877551017 C 10.34094387755102,19.327193877551018 9.64344387755102,19.327193877551018 9.193443877551019,19.777193877551017 L 8.60844387755102,20.362193877551018 C 8.158443877551019,20.812193877551017 8.158443877551019,21.50969387755102 8.60844387755102,21.959693877551018 L 9.21594387755102,22.56719387755102 C 9.665943877551019,23.01719387755102 10.363443877551019,23.01719387755102 10.81344387755102,22.56719387755102 L 11.39844387755102,21.959693877551018 C 11.84844387755102,21.50969387755102 11.84844387755102,20.812193877551017 11.39844387755102,20.362193877551018 L 10.790943877551019,19.777193877551017" stroke-linejoin="round"/>']
            
                ['<path class="dot" d="M 11.790943777551018,-1.2228061224489821 L 11.790943777551018,-1.2228061224489821 C 11.340943777551018,-1.672806122448982 10.643443777551019,-1.672806122448982 10.193443777551018,-1.2228061224489821 L 9.608443777551019,-0.6378061224489817 C 9.158443777551017,-0.18780612244898176 9.158443777551017,0.5096938775510182 9.608443777551019,0.9596938775510184 L 10.215943777551018,1.567193877551018 C 10.665943777551018,2.0171938775510174 11.363443777551018,2.0171938775510174 11.813443777551019,1.567193877551018 L 12.39844377755102,0.9596938775510184 C 12.848443777551019,0.5096938775510182 12.848443777551019,-0.18780612244898176 12.39844377755102,-0.6378061224489819 L 11.790943777551018,-1.222806122448982" stroke-linejoin="round"/>', '<path class="dot" d="M 3.7909438775510207,3.7771938775510177 L 3.79094387755102,3.7771938775510177 C 3.3409438775510196,3.327193877551018 2.64344387755102,3.3271938775510175 2.19344387755102,3.7771938775510177 L 1.60844387755102,4.362193877551018 C 1.15844387755102,4.812193877551018 1.15844387755102,5.509693877551018 1.60844387755102,5.959693877551018 L 2.2159438775510196,6.567193877551018 C 2.66594387755102,7.017193877551017 3.3634438775510196,7.017193877551017 3.8134438775510198,6.567193877551018 L 4.398443877551021,5.959693877551018 C 4.84844387755102,5.509693877551018 4.84844387755102,4.812193877551018 4.398443877551021,4.362193877551018 L 3.7909438775510207,3.777193877551018" stroke-linejoin="round"/>']
            
            
            <path d="M 10.0,21.0 L 12.0,17.0 L 12.0,13.0 L 10.0,9.0 L 8.0,8.0 L 6.0,8.0 L 4.0,9.0 L 2.0,13.0 L 2.0,17.0 L 4.0,21.0 L 6.0,22.0 L 8.0,22.0 L 10.0,21.0" fill="none"
            stroke="black"
            stroke-width="2.5"
            stroke-linecap="round"
            stroke-linejoin="round"
            />
            
            <path d="M 10.999999899999999,0.0 L 3.0,5.0" fill="none"
            stroke="black"
            stroke-width="2.5"
            stroke-linecap="round"
            stroke-linejoin="round"
            />
            
            
        </svg>