<?xml version="1.0"?><!DOCTYPE svg PUBLIC "-//W3C//DTD SVG 1.1//EN" "http://www.w3.org/Graphics/SVG/1.1/DTD/svg11.dtd"><svg xmlns="http://www.w3.org/2000/svg" xmlns:xlink="http://www.w3.org/1999/xlink" width="350" height="1000" viewBox="0 0 7 17" >
            
                ['<path class="dot" d="M 2.385,0.31800000000000006 L 2.385,0.31800000000000006 C 2.165,0.09799999999999998 1.8239999999999998,0.09799999999999995 1.6039999999999999,0.31800000000000006 L 1.3179999999999998,0.6040000000000002 C 1.0979999999999999,0.8240000000000002 1.0979999999999996,1.1650000000000003 1.3179999999999998,1.3850000000000002 L 1.6149999999999998,1.682 C 1.8349999999999997,1.902 2.176,1.902 2.396,1.682 L 2.6820000000000004,1.3850000000000002 C 2.902,1.165 2.902,0.8240000000000002 2.6820000000000004,0.6040000000000001 L 2.385,0.31800000000000006" stroke-linejoin="round"/>', '<path class="dot" d="M 2.385,10.318 L 2.385,10.318 C 2.165,10.098 1.8239999999999998,10.098 1.6039999999999999,10.318 L 1.3179999999999998,10.604000000000001 C 1.0979999999999999,10.824 1.0979999999999996,11.165000000000001 1.3179999999999998,11.385000000000002 L 1.6149999999999998,11.682 C 1.8349999999999997,11.902000000000001 2.176,11.902000000000001 2.396,11.682 L 2.6820000000000004,11.385000000000002 C 2.902,11.165000000000001 2.902,10.824 2.6820000000000004,10.604000000000001 L 2.385,10.318000000000001" stroke-linejoin="round"/>']
            
                ['<path class="dot" d="M 6.385,4.3180000000000005 L 6.385,4.3180000000000005 C 6.164999999999999,4.098000000000001 5.824,4.098000000000001 5.603999999999999,4.3180000000000005 L 5.318,4.604000000000001 C 5.098,4.824000000000001 5.098,5.165000000000001 5.318,5.385000000000001 L 5.614999999999999,5.682 C 5.834999999999999,5.902 6.176,5.902 6.395999999999999,5.682 L 6.682,5.385000000000001 C 6.902,5.165000000000001 6.902,4.824000000000001 6.682,4.604000000000001 L 6.385,4.3180000000000005" stroke-linejoin="round"/>', '<path class="dot" d="M 4.385,7.324837600000001 L 4.385,7.324837600000001 C 4.164999999999999,7.1048376000000015 3.824,7.1048376000000015 3.6039999999999996,7.324837600000001 L 3.3179999999999996,7.610837600000002 C 3.0979999999999994,7.8308376000000015 3.0979999999999994,8.171837600000002 3.3179999999999996,8.391837600000002 L 3.6149999999999993,8.688837600000001 C 3.8349999999999995,8.908837600000002 4.176,8.908837600000002 4.395999999999999,8.688837600000001 L 4.682,8.391837600000002 C 4.902,8.171837600000002 4.902,7.8308376000000015 4.682,7.610837600000002 L 4.385,7.324837600000001" stroke-linejoin="round"/>', '<path class="dot" d="M 6.385,10.318 L 6.385,10.318 C 6.164999999999999,10.098 5.824,10.098 5.603999999999999,10.318 L 5.318,10.604000000000001 C 5.098,10.824 5.098,11.165000000000001 5.318,11.385000000000002 L 5.614999999999999,11.682 C 5.834999999999999,11.902000000000001 6.176,11.902000000000001 6.395999999999999,11.682 L 6.682,11.385000000000002 C 6.902,11.165000000000001 6.902,10.824 6.682,10.604000000000001 L 6.385,10.318000000000001" stroke-linejoin="round"/>']
            
            
            <path d="M 2.0,1.0 L 2.0,11.0" fill="none"
            stroke="black"
            stroke-width="1"
            stroke-linecap="round"
            stroke-linejoin="round"
            />
            
            <path d="M 6.0,5.0 L 2.0,9.0 M 4.0,8.0068376 L 6.0,11.0" fill="none"
            stroke="black"
            stroke-width="1"
            stroke-linecap="round"
            stroke-linejoin="round"
            />
            
            
        </svg>