<?xml version="1.0"?><!DOCTYPE svg PUBLIC "-//W3C//DTD SVG 1.1//EN" "http://www.w3.org/Graphics/SVG/1.1/DTD/svg11.dtd"><svg xmlns="http://www.w3.org/2000/svg" xmlns:xlink="http://www.w3.org/1999/xlink" width="350" height="1000" viewBox="0 0 14 40" >
            
                ['<path class="dot" d="M 7.7909437775510195,-0.22280612244898207 L 7.790943777551019,-0.22280612244898207 C 7.3409437775510185,-0.6728061224489821 6.643443777551019,-0.6728061224489822 6.193443777551019,-0.22280612244898207 L 5.608443777551019,0.3621938775510183 C 5.158443777551019,0.8121938775510182 5.158443777551019,1.5096938775510182 5.608443777551019,1.9596938775510184 L 6.2159437775510185,2.567193877551018 C 6.665943777551019,3.0171938775510174 7.363443777551019,3.0171938775510174 7.813443777551019,2.567193877551018 L 8.39844377755102,1.9596938775510184 C 8.848443777551019,1.5096938775510182 8.848443777551019,0.8121938775510182 8.39844377755102,0.36219387755101806 L 7.7909437775510195,-0.2228061224489819" stroke-linejoin="round"/>', '<path class="dot" d="M 7.7909437775510195,-0.22280612244898207 L 7.790943777551019,-0.22280612244898207 C 7.3409437775510185,-0.6728061224489821 6.643443777551019,-0.6728061224489822 6.193443777551019,-0.22280612244898207 L 5.608443777551019,0.3621938775510183 C 5.158443777551019,0.8121938775510182 5.158443777551019,1.5096938775510182 5.608443777551019,1.9596938775510184 L 6.2159437775510185,2.567193877551018 C 6.665943777551019,3.0171938775510174 7.363443777551019,3.0171938775510174 7.813443777551019,2.567193877551018 L 8.39844377755102,1.9596938775510184 C 8.848443777551019,1.5096938775510182 8.848443777551019,0.8121938775510182 8.39844377755102,0.36219387755101806 L 7.7909437775510195,-0.2228061224489819" stroke-linejoin="round"/>', '<path class="dot" d="M 13.790943877551019,20.777193877551017 L 13.790943877551019,20.777193877551017 C 13.34094387755102,20.327193877551018 12.64344387755102,20.327193877551018 12.193443877551019,20.777193877551017 L 11.60844387755102,21.362193877551018 C 11.158443877551019,21.812193877551017 11.158443877551019,22.50969387755102 11.60844387755102,22.959693877551018 L 12.21594387755102,23.56719387755102 C 12.665943877551019,24.01719387755102 13.363443877551019,24.01719387755102 13.81344387755102,23.56719387755102 L 14.39844387755102,22.959693877551018 C 14.84844387755102,22.50969387755102 14.84844387755102,21.812193877551017 14.39844387755102,21.362193877551018 L 13.790943877551019,20.777193877551017" stroke-linejoin="round"/>']
            
                ['<path class="dot" d="M 3.7909438775510207,12.777193877551019 L 3.79094387755102,12.777193877551019 C 3.3409438775510196,12.327193877551018 2.64344387755102,12.327193877551018 2.19344387755102,12.777193877551019 L 1.60844387755102,13.362193877551018 C 1.15844387755102,13.81219387755102 1.15844387755102,14.509693877551019 1.60844387755102,14.959693877551018 L 2.2159438775510196,15.567193877551018 C 2.66594387755102,16.01719387755102 3.3634438775510196,16.01719387755102 3.8134438775510198,15.567193877551018 L 4.398443877551021,14.959693877551018 C 4.84844387755102,14.509693877551019 4.84844387755102,13.81219387755102 4.398443877551021,13.362193877551018 L 3.7909438775510207,12.777193877551019" stroke-linejoin="round"/>', '<path class="dot" d="M 11.790943577551019,12.777193877551019 L 11.790943577551019,12.777193877551019 C 11.34094357755102,12.327193877551018 10.64344357755102,12.327193877551018 10.193443577551019,12.777193877551019 L 9.60844357755102,13.362193877551018 C 9.158443577551019,13.81219387755102 9.158443577551019,14.509693877551019 9.60844357755102,14.959693877551018 L 10.21594357755102,15.567193877551018 C 10.665943577551019,16.01719387755102 11.363443577551019,16.01719387755102 11.81344357755102,15.567193877551018 L 12.39844357755102,14.959693877551018 C 12.84844357755102,14.509693877551019 12.84844357755102,13.81219387755102 12.39844357755102,13.362193877551018 L 11.790943577551019,12.777193877551019" stroke-linejoin="round"/>']
            
                ['<path class="dot" d="M 3.7909438775510207,-4.222806122448982 L 3.79094387755102,-4.222806122448982 C 3.3409438775510196,-4.672806122448982 2.64344387755102,-4.672806122448982 2.19344387755102,-4.222806122448982 L 1.60844387755102,-3.637806122448982 C 1.15844387755102,-3.1878061224489818 1.15844387755102,-2.490306122448982 1.60844387755102,-2.040306122448982 L 2.2159438775510196,-1.4328061224489823 C 2.66594387755102,-0.9828061224489826 3.3634438775510196,-0.9828061224489826 3.8134438775510198,-1.4328061224489823 L 4.398443877551021,-2.040306122448982 C 4.84844387755102,-2.490306122448982 4.84844387755102,-3.1878061224489818 4.398443877551021,-3.637806122448982 L 3.7909438775510207,-4.222806122448982" stroke-linejoin="round"/>', '<path class="dot" d="M 3.7909438775510207,-5.222806122448982 L 3.79094387755102,-5.222806122448982 C 3.3409438775510196,-5.672806122448982 2.64344387755102,-5.672806122448982 2.19344387755102,-5.222806122448982 L 1.60844387755102,-4.637806122448982 C 1.15844387755102,-4.187806122448982 1.15844387755102,-3.490306122448982 1.60844387755102,-3.040306122448982 L 2.2159438775510196,-2.4328061224489823 C 2.66594387755102,-1.9828061224489826 3.3634438775510196,-1.9828061224489826 3.8134438775510198,-2.4328061224489823 L 4.398443877551021,-3.040306122448982 C 4.84844387755102,-3.490306122448982 4.84844387755102,-4.187806122448982 4.398443877551021,-4.637806122448982 L 3.7909438775510207,-5.222806122448982" stroke-linejoin="round"/>', '<path class="dot" d="M 5.790943877551021,-7.222806122448982 L 5.79094387755102,-7.222806122448982 C 5.34094387755102,-7.672806122448982 4.64344387755102,-7.672806122448982 4.1934438775510205,-7.222806122448982 L 3.60844387755102,-6.637806122448982 C 3.1584438775510204,-6.187806122448982 3.15844387755102,-5.490306122448982 3.60844387755102,-5.040306122448982 L 4.21594387755102,-4.432806122448982 C 4.66594387755102,-3.9828061224489826 5.3634438775510205,-3.9828061224489826 5.81344387755102,-4.432806122448982 L 6.398443877551021,-5.040306122448982 C 6.84844387755102,-5.490306122448982 6.84844387755102,-6.187806122448982 6.398443877551021,-6.637806122448982 L 5.790943877551021,-7.222806122448982" stroke-linejoin="round"/>', '<path class="dot" d="M 6.790943877551021,-7.222806122448982 L 6.79094387755102,-7.222806122448982 C 6.34094387755102,-7.672806122448982 5.64344387755102,-7.672806122448982 5.1934438775510205,-7.222806122448982 L 4.608443877551021,-6.637806122448982 C 4.15844387755102,-6.187806122448982 4.15844387755102,-5.490306122448982 4.608443877551021,-5.040306122448982 L 5.21594387755102,-4.432806122448982 C 5.66594387755102,-3.9828061224489826 6.3634438775510205,-3.9828061224489826 6.81344387755102,-4.432806122448982 L 7.398443877551021,-5.040306122448982 C 7.84844387755102,-5.490306122448982 7.84844387755102,-6.187806122448982 7.398443877551021,-6.637806122448982 L 6.790943877551021,-7.222806122448982" stroke-linejoin="round"/>', '<path class="dot" d="M 8.79094387755102,-5.222806122448982 L 8.790943877551019,-5.222806122448982 C 8.34094387755102,-5.672806122448982 7.64344387755102,-5.672806122448982 7.1934438775510205,-5.222806122448982 L 6.608443877551021,-4.637806122448982 C 6.15844387755102,-4.187806122448982 6.15844387755102,-3.490306122448982 6.608443877551021,-3.040306122448982 L 7.21594387755102,-2.4328061224489823 C 7.66594387755102,-1.9828061224489826 8.36344387755102,-1.9828061224489826 8.81344387755102,-2.4328061224489823 L 9.39844387755102,-3.040306122448982 C 9.84844387755102,-3.490306122448982 9.84844387755102,-4.187806122448982 9.39844387755102,-4.637806122448982 L 8.79094387755102,-5.222806122448982" stroke-linejoin="round"/>', '<path class="dot" d="M 9.79094387755102,-5.222806122448982 L 9.790943877551019,-5.222806122448982 C 9.34094387755102,-5.672806122448982 8.64344387755102,-5.672806122448982 8.19344387755102,-5.222806122448982 L 7.608443877551021,-4.637806122448982 C 7.15844387755102,-4.187806122448982 7.15844387755102,-3.490306122448982 7.608443877551021,-3.040306122448982 L 8.21594387755102,-2.4328061224489823 C 8.66594387755102,-1.9828061224489826 9.36344387755102,-1.9828061224489826 9.81344387755102,-2.4328061224489823 L 10.39844387755102,-3.040306122448982 C 10.84844387755102,-3.490306122448982 10.84844387755102,-4.187806122448982 10.39844387755102,-4.637806122448982 L 9.79094387755102,-5.222806122448982" stroke-linejoin="round"/>', '<path class="dot" d="M 11.790943877551019,-7.222806122448982 L 11.790943877551019,-7.222806122448982 C 11.34094387755102,-7.672806122448982 10.64344387755102,-7.672806122448982 10.193443877551019,-7.222806122448982 L 9.60844387755102,-6.637806122448982 C 9.158443877551019,-6.187806122448982 9.158443877551019,-5.490306122448982 9.60844387755102,-5.040306122448982 L 10.21594387755102,-4.432806122448982 C 10.665943877551019,-3.9828061224489826 11.363443877551019,-3.9828061224489826 11.81344387755102,-4.432806122448982 L 12.39844387755102,-5.040306122448982 C 12.84844387755102,-5.490306122448982 12.84844387755102,-6.187806122448982 12.39844387755102,-6.637806122448982 L 11.790943877551019,-7.222806122448982" stroke-linejoin="round"/>', '<path class="dot" d="M 11.790943877551019,-8.222806122448981 L 11.790943877551019,-8.222806122448981 C 11.34094387755102,-8.672806122448982 10.64344387755102,-8.672806122448982 10.193443877551019,-8.222806122448981 L 9.60844387755102,-7.637806122448981 C 9.158443877551019,-7.187806122448981 9.158443877551019,-6.490306122448981 9.60844387755102,-6.040306122448981 L 10.21594387755102,-5.432806122448982 C 10.665943877551019,-4.982806122448982 11.363443877551019,-4.982806122448982 11.81344387755102,-5.432806122448982 L 12.39844387755102,-6.040306122448981 C 12.84844387755102,-6.490306122448981 12.84844387755102,-7.187806122448981 12.39844387755102,-7.637806122448981 L 11.790943877551019,-8.222806122448981" stroke-linejoin="round"/>']
            
            
            <path d="M 6.999999899999999,1.0 L 1.0000000000000009,22.0 M 6.999999899999999,1.0 L 13.0,22.0" fill="none"
            stroke="black"
            stroke-width="2.5"
            stroke-linecap="round"
            stroke-linejoin="round"
            />
            
            <path d="M 3.0,14.0 L 10.9999997,14.0" fill="none"
            stroke="black"
            stroke-width="2.5"
            stroke-linecap="round"
            stroke-linejoin="round"
            />
            
            <path d="M 3.0,-3.0 L 3.0,-4.0 L 5.0,-6.0 L 6.0,-6.0 L 8.0,-4.0 L 9.0,-4.0 L 11.0,-6.0 L 11.0,-7.0" fill="none"
            stroke="black"
            stroke-width="2.5"
            stroke-linecap="round"
            stroke-linejoin="round"
            />
            
            
        </svg>