<?xml version="1.0" encoding="UTF-8" standalone="no"?>
<svg
   width="2"
   height="4"
   viewBox="0 0 2 4"
   version="1.1"
   id="svg25"
   xml:space="preserve"
   sodipodi:docname="q-cap-excpt.svg"
   inkscape:version="1.3.1 (9b9bdc1480, 2023-11-25, custom)"
   xmlns:inkscape="http://www.inkscape.org/namespaces/inkscape"
   xmlns:sodipodi="http://sodipodi.sourceforge.net/DTD/sodipodi-0.dtd"
   xmlns="http://www.w3.org/2000/svg"
   xmlns:svg="http://www.w3.org/2000/svg"><sodipodi:namedview
   id="namedview1"
   pagecolor="#ffffff"
   bordercolor="#999999"
   borderopacity="1"
   inkscape:showpageshadow="2"
   inkscape:pageopacity="0"
   inkscape:pagecheckerboard="0"
   inkscape:deskcolor="#d1d1d1"
   showgrid="true"
   showguides="true"
   inkscape:zoom="44.384549"
   inkscape:cx="0.76603234"
   inkscape:cy="-1.3518218"
   inkscape:window-width="1878"
   inkscape:window-height="1016"
   inkscape:window-x="0"
   inkscape:window-y="0"
   inkscape:window-maximized="1"
   inkscape:current-layer="svg25"><inkscape:grid
     id="grid1"
     units="px"
     originx="0"
     originy="0"
     spacingx="1"
     spacingy="1"
     empcolor="#0099e5"
     empopacity="0.30196078"
     color="#0099e5"
     opacity="0.14901961"
     empspacing="5"
     dotted="false"
     gridanglex="30"
     gridanglez="30"
     visible="true" /><sodipodi:guide
     position="-0.080000008,0.95999999"
     orientation="0,-1"
     id="guide1"
     inkscape:locked="false" /><sodipodi:guide
     position="-0.12,0.83999999"
     orientation="0,-1"
     id="guide2"
     inkscape:locked="false" /><sodipodi:guide
     position="-0.13578431,0.56"
     orientation="0,-1"
     id="guide3"
     inkscape:locked="false" /><sodipodi:guide
     position="-0.13960784,0.44"
     orientation="0,-1"
     id="guide4"
     inkscape:locked="false" /></sodipodi:namedview><defs
   id="defs25" />
            
                ['', '']
            
                ['', '', '', '', '', '', '', '', '', '']
            
                ['', '', '', '', '', '', '', '', '', '']
            
            
            <path
   style="fill:#000000;stroke-width:0.0799748"
   d="M 0,0 2,4"
   id="path1"
   sodipodi:nodetypes="cc" /></svg>
