<?xml version="1.0"?><!DOCTYPE svg PUBLIC "-//W3C//DTD SVG 1.1//EN" "http://www.w3.org/Graphics/SVG/1.1/DTD/svg11.dtd"><svg xmlns="http://www.w3.org/2000/svg" xmlns:xlink="http://www.w3.org/1999/xlink" width="350" height="1000" viewBox="0 0 14 40" >
            
                ['<path class="dot" d="M 6.790943877551021,-0.22280612244898207 L 6.79094387755102,-0.22280612244898207 C 6.34094387755102,-0.6728061224489821 5.64344387755102,-0.6728061224489822 5.1934438775510205,-0.22280612244898207 L 4.608443877551021,0.3621938775510183 C 4.15844387755102,0.8121938775510182 4.15844387755102,1.5096938775510182 4.608443877551021,1.9596938775510184 L 5.21594387755102,2.567193877551018 C 5.66594387755102,3.0171938775510174 6.3634438775510205,3.0171938775510174 6.81344387755102,2.567193877551018 L 7.398443877551021,1.9596938775510184 C 7.84844387755102,1.5096938775510182 7.84844387755102,0.8121938775510182 7.398443877551021,0.36219387755101806 L 6.790943877551021,-0.2228061224489819" stroke-linejoin="round"/>', '<path class="dot" d="M 4.790943877551021,0.7771938775510179 L 4.79094387755102,0.7771938775510179 C 4.34094387755102,0.3271938775510179 3.64344387755102,0.3271938775510178 3.19344387755102,0.7771938775510179 L 2.60844387755102,1.3621938775510183 C 2.1584438775510204,1.8121938775510182 2.15844387755102,2.509693877551018 2.60844387755102,2.959693877551018 L 3.21594387755102,3.567193877551018 C 3.66594387755102,4.017193877551017 4.3634438775510205,4.017193877551017 4.81344387755102,3.567193877551018 L 5.398443877551021,2.959693877551018 C 5.84844387755102,2.509693877551018 5.84844387755102,1.8121938775510182 5.398443877551021,1.362193877551018 L 4.790943877551021,0.7771938775510181" stroke-linejoin="round"/>', '<path class="dot" d="M 3.7909438775510207,2.7771938775510177 L 3.79094387755102,2.7771938775510177 C 3.3409438775510196,2.327193877551018 2.64344387755102,2.3271938775510175 2.19344387755102,2.7771938775510177 L 1.60844387755102,3.362193877551018 C 1.15844387755102,3.8121938775510182 1.15844387755102,4.509693877551018 1.60844387755102,4.959693877551018 L 2.2159438775510196,5.567193877551018 C 2.66594387755102,6.017193877551017 3.3634438775510196,6.017193877551017 3.8134438775510198,5.567193877551018 L 4.398443877551021,4.959693877551018 C 4.84844387755102,4.509693877551018 4.84844387755102,3.8121938775510182 4.398443877551021,3.362193877551018 L 3.7909438775510207,2.777193877551018" stroke-linejoin="round"/>', '<path class="dot" d="M 2.7909438775510207,7.777193877551018 L 2.79094387755102,7.777193877551018 C 2.3409438775510196,7.327193877551018 1.6434438775510198,7.327193877551018 1.19344387755102,7.777193877551018 L 0.6084438775510199,8.362193877551018 C 0.15844387755101996,8.812193877551017 0.15844387755101985,9.509693877551019 0.6084438775510199,9.959693877551018 L 1.2159438775510198,10.567193877551018 C 1.6659438775510198,11.017193877551017 2.3634438775510196,11.017193877551017 2.8134438775510198,10.567193877551018 L 3.3984438775510206,9.959693877551018 C 3.84844387755102,9.509693877551019 3.84844387755102,8.812193877551017 3.3984438775510206,8.362193877551018 L 2.7909438775510207,7.777193877551018" stroke-linejoin="round"/>', '<path class="dot" d="M 2.7909438775510207,12.777193877551019 L 2.79094387755102,12.777193877551019 C 2.3409438775510196,12.327193877551018 1.6434438775510198,12.327193877551018 1.19344387755102,12.777193877551019 L 0.6084438775510199,13.362193877551018 C 0.15844387755101996,13.81219387755102 0.15844387755101985,14.509693877551019 0.6084438775510199,14.959693877551018 L 1.2159438775510198,15.567193877551018 C 1.6659438775510198,16.01719387755102 2.3634438775510196,16.01719387755102 2.8134438775510198,15.567193877551018 L 3.3984438775510206,14.959693877551018 C 3.84844387755102,14.509693877551019 3.84844387755102,13.81219387755102 3.3984438775510206,13.362193877551018 L 2.7909438775510207,12.777193877551019" stroke-linejoin="round"/>', '<path class="dot" d="M 3.7909438775510207,17.777193877551017 L 3.79094387755102,17.777193877551017 C 3.3409438775510196,17.327193877551018 2.64344387755102,17.327193877551018 2.19344387755102,17.777193877551017 L 1.60844387755102,18.362193877551018 C 1.15844387755102,18.812193877551017 1.15844387755102,19.50969387755102 1.60844387755102,19.959693877551018 L 2.2159438775510196,20.56719387755102 C 2.66594387755102,21.01719387755102 3.3634438775510196,21.01719387755102 3.8134438775510198,20.56719387755102 L 4.398443877551021,19.959693877551018 C 4.84844387755102,19.50969387755102 4.84844387755102,18.812193877551017 4.398443877551021,18.362193877551018 L 3.7909438775510207,17.777193877551017" stroke-linejoin="round"/>', '<path class="dot" d="M 4.790943877551021,19.777193877551017 L 4.79094387755102,19.777193877551017 C 4.34094387755102,19.327193877551018 3.64344387755102,19.327193877551018 3.19344387755102,19.777193877551017 L 2.60844387755102,20.362193877551018 C 2.1584438775510204,20.812193877551017 2.15844387755102,21.50969387755102 2.60844387755102,21.959693877551018 L 3.21594387755102,22.56719387755102 C 3.66594387755102,23.01719387755102 4.3634438775510205,23.01719387755102 4.81344387755102,22.56719387755102 L 5.398443877551021,21.959693877551018 C 5.84844387755102,21.50969387755102 5.84844387755102,20.812193877551017 5.398443877551021,20.362193877551018 L 4.790943877551021,19.777193877551017" stroke-linejoin="round"/>', '<path class="dot" d="M 6.790943877551021,20.777193877551017 L 6.79094387755102,20.777193877551017 C 6.34094387755102,20.327193877551018 5.64344387755102,20.327193877551018 5.1934438775510205,20.777193877551017 L 4.608443877551021,21.362193877551018 C 4.15844387755102,21.812193877551017 4.15844387755102,22.50969387755102 4.608443877551021,22.959693877551018 L 5.21594387755102,23.56719387755102 C 5.66594387755102,24.01719387755102 6.3634438775510205,24.01719387755102 6.81344387755102,23.56719387755102 L 7.398443877551021,22.959693877551018 C 7.84844387755102,22.50969387755102 7.84844387755102,21.812193877551017 7.398443877551021,21.362193877551018 L 6.790943877551021,20.777193877551017" stroke-linejoin="round"/>', '<path class="dot" d="M 8.79094387755102,20.777193877551017 L 8.790943877551019,20.777193877551017 C 8.34094387755102,20.327193877551018 7.64344387755102,20.327193877551018 7.1934438775510205,20.777193877551017 L 6.608443877551021,21.362193877551018 C 6.15844387755102,21.812193877551017 6.15844387755102,22.50969387755102 6.608443877551021,22.959693877551018 L 7.21594387755102,23.56719387755102 C 7.66594387755102,24.01719387755102 8.36344387755102,24.01719387755102 8.81344387755102,23.56719387755102 L 9.39844387755102,22.959693877551018 C 9.84844387755102,22.50969387755102 9.84844387755102,21.812193877551017 9.39844387755102,21.362193877551018 L 8.79094387755102,20.777193877551017" stroke-linejoin="round"/>', '<path class="dot" d="M 10.790943877551019,19.777193877551017 L 10.790943877551019,19.777193877551017 C 10.34094387755102,19.327193877551018 9.64344387755102,19.327193877551018 9.193443877551019,19.777193877551017 L 8.60844387755102,20.362193877551018 C 8.158443877551019,20.812193877551017 8.158443877551019,21.50969387755102 8.60844387755102,21.959693877551018 L 9.21594387755102,22.56719387755102 C 9.665943877551019,23.01719387755102 10.363443877551019,23.01719387755102 10.81344387755102,22.56719387755102 L 11.39844387755102,21.959693877551018 C 11.84844387755102,21.50969387755102 11.84844387755102,20.812193877551017 11.39844387755102,20.362193877551018 L 10.790943877551019,19.777193877551017" stroke-linejoin="round"/>', '<path class="dot" d="M 11.790943877551019,17.777193877551017 L 11.790943877551019,17.777193877551017 C 11.34094387755102,17.327193877551018 10.64344387755102,17.327193877551018 10.193443877551019,17.777193877551017 L 9.60844387755102,18.362193877551018 C 9.158443877551019,18.812193877551017 9.158443877551019,19.50969387755102 9.60844387755102,19.959693877551018 L 10.21594387755102,20.56719387755102 C 10.665943877551019,21.01719387755102 11.363443877551019,21.01719387755102 11.81344387755102,20.56719387755102 L 12.39844387755102,19.959693877551018 C 12.84844387755102,19.50969387755102 12.84844387755102,18.812193877551017 12.39844387755102,18.362193877551018 L 11.790943877551019,17.777193877551017" stroke-linejoin="round"/>', '<path class="dot" d="M 12.790943877551019,12.777193877551019 L 12.790943877551019,12.777193877551019 C 12.34094387755102,12.327193877551018 11.64344387755102,12.327193877551018 11.193443877551019,12.777193877551019 L 10.60844387755102,13.362193877551018 C 10.158443877551019,13.81219387755102 10.158443877551019,14.509693877551019 10.60844387755102,14.959693877551018 L 11.21594387755102,15.567193877551018 C 11.665943877551019,16.01719387755102 12.363443877551019,16.01719387755102 12.81344387755102,15.567193877551018 L 13.39844387755102,14.959693877551018 C 13.84844387755102,14.509693877551019 13.84844387755102,13.81219387755102 13.39844387755102,13.362193877551018 L 12.790943877551019,12.777193877551019" stroke-linejoin="round"/>', '<path class="dot" d="M 12.790943877551019,7.777193877551018 L 12.790943877551019,7.777193877551018 C 12.34094387755102,7.327193877551018 11.64344387755102,7.327193877551018 11.193443877551019,7.777193877551018 L 10.60844387755102,8.362193877551018 C 10.158443877551019,8.812193877551017 10.158443877551019,9.509693877551019 10.60844387755102,9.959693877551018 L 11.21594387755102,10.567193877551018 C 11.665943877551019,11.017193877551017 12.363443877551019,11.017193877551017 12.81344387755102,10.567193877551018 L 13.39844387755102,9.959693877551018 C 13.84844387755102,9.509693877551019 13.84844387755102,8.812193877551017 13.39844387755102,8.362193877551018 L 12.790943877551019,7.777193877551018" stroke-linejoin="round"/>', '<path class="dot" d="M 11.790943877551019,2.7771938775510177 L 11.790943877551019,2.7771938775510177 C 11.34094387755102,2.327193877551018 10.64344387755102,2.3271938775510175 10.193443877551019,2.7771938775510177 L 9.60844387755102,3.362193877551018 C 9.158443877551019,3.8121938775510182 9.158443877551019,4.509693877551018 9.60844387755102,4.959693877551018 L 10.21594387755102,5.567193877551018 C 10.665943877551019,6.017193877551017 11.363443877551019,6.017193877551017 11.81344387755102,5.567193877551018 L 12.39844387755102,4.959693877551018 C 12.84844387755102,4.509693877551018 12.84844387755102,3.8121938775510182 12.39844387755102,3.362193877551018 L 11.790943877551019,2.777193877551018" stroke-linejoin="round"/>', '<path class="dot" d="M 10.790943877551019,0.7771938775510179 L 10.790943877551019,0.7771938775510179 C 10.34094387755102,0.3271938775510179 9.64344387755102,0.3271938775510178 9.193443877551019,0.7771938775510179 L 8.60844387755102,1.3621938775510183 C 8.158443877551019,1.8121938775510182 8.158443877551019,2.509693877551018 8.60844387755102,2.959693877551018 L 9.21594387755102,3.567193877551018 C 9.665943877551019,4.017193877551017 10.363443877551019,4.017193877551017 10.81344387755102,3.567193877551018 L 11.39844387755102,2.959693877551018 C 11.84844387755102,2.509693877551018 11.84844387755102,1.8121938775510182 11.39844387755102,1.362193877551018 L 10.790943877551019,0.7771938775510181" stroke-linejoin="round"/>', '<path class="dot" d="M 8.79094387755102,-0.22280612244898207 L 8.790943877551019,-0.22280612244898207 C 8.34094387755102,-0.6728061224489821 7.64344387755102,-0.6728061224489822 7.1934438775510205,-0.22280612244898207 L 6.608443877551021,0.3621938775510183 C 6.15844387755102,0.8121938775510182 6.15844387755102,1.5096938775510182 6.608443877551021,1.9596938775510184 L 7.21594387755102,2.567193877551018 C 7.66594387755102,3.0171938775510174 8.36344387755102,3.0171938775510174 8.81344387755102,2.567193877551018 L 9.39844387755102,1.9596938775510184 C 9.84844387755102,1.5096938775510182 9.84844387755102,0.8121938775510182 9.39844387755102,0.36219387755101806 L 8.79094387755102,-0.2228061224489819" stroke-linejoin="round"/>', '<path class="dot" d="M 6.790943877551021,-0.22280612244898207 L 6.79094387755102,-0.22280612244898207 C 6.34094387755102,-0.6728061224489821 5.64344387755102,-0.6728061224489822 5.1934438775510205,-0.22280612244898207 L 4.608443877551021,0.3621938775510183 C 4.15844387755102,0.8121938775510182 4.15844387755102,1.5096938775510182 4.608443877551021,1.9596938775510184 L 5.21594387755102,2.567193877551018 C 5.66594387755102,3.0171938775510174 6.3634438775510205,3.0171938775510174 6.81344387755102,2.567193877551018 L 7.398443877551021,1.9596938775510184 C 7.84844387755102,1.5096938775510182 7.84844387755102,0.8121938775510182 7.398443877551021,0.36219387755101806 L 6.790943877551021,-0.2228061224489819" stroke-linejoin="round"/>']
            
                ['<path class="dot" d="M 4.790943577551021,-6.222806122448982 L 4.79094357755102,-6.222806122448982 C 4.34094357755102,-6.672806122448982 3.64344357755102,-6.672806122448982 3.19344357755102,-6.222806122448982 L 2.60844357755102,-5.637806122448982 C 2.1584435775510205,-5.187806122448982 2.15844357755102,-4.490306122448982 2.60844357755102,-4.040306122448982 L 3.21594357755102,-3.4328061224489823 C 3.66594357755102,-2.9828061224489826 4.3634435775510205,-2.9828061224489826 4.81344357755102,-3.4328061224489823 L 5.398443577551021,-4.040306122448982 C 5.84844357755102,-4.490306122448982 5.84844357755102,-5.187806122448982 5.398443577551021,-5.637806122448982 L 4.790943577551021,-6.222806122448982" stroke-linejoin="round"/>', '<path class="dot" d="M 3.7909438775510207,-5.222806122448982 L 3.79094387755102,-5.222806122448982 C 3.3409438775510196,-5.672806122448982 2.64344387755102,-5.672806122448982 2.19344387755102,-5.222806122448982 L 1.60844387755102,-4.637806122448982 C 1.15844387755102,-4.187806122448982 1.15844387755102,-3.490306122448982 1.60844387755102,-3.040306122448982 L 2.2159438775510196,-2.4328061224489823 C 2.66594387755102,-1.9828061224489826 3.3634438775510196,-1.9828061224489826 3.8134438775510198,-2.4328061224489823 L 4.398443877551021,-3.040306122448982 C 4.84844387755102,-3.490306122448982 4.84844387755102,-4.187806122448982 4.398443877551021,-4.637806122448982 L 3.7909438775510207,-5.222806122448982" stroke-linejoin="round"/>', '<path class="dot" d="M 4.790943577551021,-4.222806122448982 L 4.79094357755102,-4.222806122448982 C 4.34094357755102,-4.672806122448982 3.64344357755102,-4.672806122448982 3.19344357755102,-4.222806122448982 L 2.60844357755102,-3.637806122448982 C 2.1584435775510205,-3.1878061224489818 2.15844357755102,-2.490306122448982 2.60844357755102,-2.040306122448982 L 3.21594357755102,-1.4328061224489823 C 3.66594357755102,-0.9828061224489826 4.3634435775510205,-0.9828061224489826 4.81344357755102,-1.4328061224489823 L 5.398443577551021,-2.040306122448982 C 5.84844357755102,-2.490306122448982 5.84844357755102,-3.1878061224489818 5.398443577551021,-3.637806122448982 L 4.790943577551021,-4.222806122448982" stroke-linejoin="round"/>', '<path class="dot" d="M 5.790943877551021,-5.222806122448982 L 5.79094387755102,-5.222806122448982 C 5.34094387755102,-5.672806122448982 4.64344387755102,-5.672806122448982 4.1934438775510205,-5.222806122448982 L 3.60844387755102,-4.637806122448982 C 3.1584438775510204,-4.187806122448982 3.15844387755102,-3.490306122448982 3.60844387755102,-3.040306122448982 L 4.21594387755102,-2.4328061224489823 C 4.66594387755102,-1.9828061224489826 5.3634438775510205,-1.9828061224489826 5.81344387755102,-2.4328061224489823 L 6.398443877551021,-3.040306122448982 C 6.84844387755102,-3.490306122448982 6.84844387755102,-4.187806122448982 6.398443877551021,-4.637806122448982 L 5.790943877551021,-5.222806122448982" stroke-linejoin="round"/>', '<path class="dot" d="M 10.79094487755102,-6.222806122448982 L 10.79094487755102,-6.222806122448982 C 10.34094487755102,-6.672806122448982 9.64344487755102,-6.672806122448982 9.19344487755102,-6.222806122448982 L 8.60844487755102,-5.637806122448982 C 8.15844487755102,-5.187806122448982 8.15844487755102,-4.490306122448982 8.60844487755102,-4.040306122448982 L 9.21594487755102,-3.4328061224489823 C 9.66594487755102,-2.9828061224489826 10.36344487755102,-2.9828061224489826 10.81344487755102,-3.4328061224489823 L 11.398444877551022,-4.040306122448982 C 11.848444877551021,-4.490306122448982 11.848444877551021,-5.187806122448982 11.398444877551022,-5.637806122448982 L 10.79094487755102,-6.222806122448982" stroke-linejoin="round"/>', '<path class="dot" d="M 9.79094377755102,-5.222806122448982 L 9.790943777551018,-5.222806122448982 C 9.340943777551018,-5.672806122448982 8.643443777551019,-5.672806122448982 8.19344377755102,-5.222806122448982 L 7.608443777551019,-4.637806122448982 C 7.158443777551019,-4.187806122448982 7.158443777551019,-3.490306122448982 7.608443777551019,-3.040306122448982 L 8.215943777551018,-2.4328061224489823 C 8.66594377755102,-1.9828061224489826 9.36344377755102,-1.9828061224489826 9.813443777551019,-2.4328061224489823 L 10.39844377755102,-3.040306122448982 C 10.848443777551019,-3.490306122448982 10.848443777551019,-4.187806122448982 10.39844377755102,-4.637806122448982 L 9.79094377755102,-5.222806122448982" stroke-linejoin="round"/>', '<path class="dot" d="M 10.79094487755102,-4.222806122448982 L 10.79094487755102,-4.222806122448982 C 10.34094487755102,-4.672806122448982 9.64344487755102,-4.672806122448982 9.19344487755102,-4.222806122448982 L 8.60844487755102,-3.637806122448982 C 8.15844487755102,-3.1878061224489818 8.15844487755102,-2.490306122448982 8.60844487755102,-2.040306122448982 L 9.21594487755102,-1.4328061224489823 C 9.66594487755102,-0.9828061224489826 10.36344487755102,-0.9828061224489826 10.81344487755102,-1.4328061224489823 L 11.398444877551022,-2.040306122448982 C 11.848444877551021,-2.490306122448982 11.848444877551021,-3.1878061224489818 11.398444877551022,-3.637806122448982 L 10.79094487755102,-4.222806122448982" stroke-linejoin="round"/>', '<path class="dot" d="M 11.790943877551019,-5.222806122448982 L 11.790943877551019,-5.222806122448982 C 11.34094387755102,-5.672806122448982 10.64344387755102,-5.672806122448982 10.193443877551019,-5.222806122448982 L 9.60844387755102,-4.637806122448982 C 9.158443877551019,-4.187806122448982 9.158443877551019,-3.490306122448982 9.60844387755102,-3.040306122448982 L 10.21594387755102,-2.4328061224489823 C 10.665943877551019,-1.9828061224489826 11.363443877551019,-1.9828061224489826 11.81344387755102,-2.4328061224489823 L 12.39844387755102,-3.040306122448982 C 12.84844387755102,-3.490306122448982 12.84844387755102,-4.187806122448982 12.39844387755102,-4.637806122448982 L 11.790943877551019,-5.222806122448982" stroke-linejoin="round"/>', '<path class="dot" d="M 10.79094487755102,-6.222806122448982 L 10.79094487755102,-6.222806122448982 C 10.34094487755102,-6.672806122448982 9.64344487755102,-6.672806122448982 9.19344487755102,-6.222806122448982 L 8.60844487755102,-5.637806122448982 C 8.15844487755102,-5.187806122448982 8.15844487755102,-4.490306122448982 8.60844487755102,-4.040306122448982 L 9.21594487755102,-3.4328061224489823 C 9.66594487755102,-2.9828061224489826 10.36344487755102,-2.9828061224489826 10.81344487755102,-3.4328061224489823 L 11.398444877551022,-4.040306122448982 C 11.848444877551021,-4.490306122448982 11.848444877551021,-5.187806122448982 11.398444877551022,-5.637806122448982 L 10.79094487755102,-6.222806122448982" stroke-linejoin="round"/>']
            
            
            <path d="M 6.0,1.0 L 4.0,2.0 L 3.0,4.0 L 2.0,9.0 L 2.0,14.0 L 3.0,19.0 L 4.0,21.0 L 6.0,22.0 L 8.0,22.0 L 10.0,21.0 L 11.0,19.0 L 12.0,14.0 L 12.0,9.0 L 11.0,4.0 L 10.0,2.0 L 8.0,1.0 L 6.0,1.0" fill="none"
            stroke="black"
            stroke-width="2.5"
            stroke-linecap="round"
            stroke-linejoin="round"
            />
            
            <path d="M 3.9999997,-5.0 L 3.0,-4.0 L 3.9999997,-3.0 L 5.0,-4.0 L 3.9999997,-5.0 M 10.000001000000001,-5.0 L 8.999999899999999,-4.0 L 10.000001000000001,-3.0 L 11.0,-4.0 L 10.000001000000001,-5.0" fill="none"
            stroke="black"
            stroke-width="2.5"
            stroke-linecap="round"
            stroke-linejoin="round"
            />
            
            
        </svg>