<?xml version="1.0"?><!DOCTYPE svg PUBLIC "-//W3C//DTD SVG 1.1//EN" "http://www.w3.org/Graphics/SVG/1.1/DTD/svg11.dtd"><svg xmlns="http://www.w3.org/2000/svg" xmlns:xlink="http://www.w3.org/1999/xlink" width="350" height="1000" viewBox="0 0 10 26" >
            
                ['<path class="dot" d="M 3.5195833233333333,0.1402698864127265 L 3.5195833233333333,0.1402698864127265 C 3.2295833233333333,-0.14973011358727353 2.7800833233333333,-0.1497301135872736 2.4900833233333333,0.1402698864127265 L 2.113083323333333,0.5172698864127266 C 1.8230833233333332,0.8072698864127266 1.8230833233333332,1.2567698864127266 2.113083323333333,1.5467698864127266 L 2.5045833233333332,1.9382698864127264 C 2.794583323333333,2.2282698864127264 3.2440833233333333,2.2282698864127264 3.5340833233333333,1.9382698864127264 L 3.9110833233333335,1.5467698864127266 C 4.201083323333334,1.2567698864127266 4.201083323333334,0.8072698864127267 3.9110833233333335,0.5172698864127265 L 3.5195833233333333,0.14026988641272653" stroke-linejoin="round"/>', '<path class="dot" d="M 7.519583333333333,0.1402698864127265 L 7.519583333333332,0.1402698864127265 C 7.229583333333332,-0.14973011358727353 6.780083333333333,-0.1497301135872736 6.490083333333333,0.1402698864127265 L 6.113083333333333,0.5172698864127266 C 5.823083333333333,0.8072698864127266 5.823083333333333,1.2567698864127266 6.113083333333333,1.5467698864127266 L 6.504583333333333,1.9382698864127264 C 6.794583333333333,2.2282698864127264 7.244083333333332,2.2282698864127264 7.534083333333332,1.9382698864127264 L 7.911083333333333,1.5467698864127266 C 8.201083333333333,1.2567698864127266 8.201083333333333,0.8072698864127267 7.911083333333333,0.5172698864127265 L 7.519583333333333,0.14026988641272653" stroke-linejoin="round"/>', '<path class="dot" d="M 5.519583333333333,5.14027035987303 L 5.519583333333333,5.14027035987303 C 5.229583333333333,4.85027035987303 4.780083333333333,4.85027035987303 4.490083333333333,5.14027035987303 L 4.113083333333333,5.51727035987303 C 3.823083333333333,5.80727035987303 3.823083333333333,6.25677035987303 4.113083333333333,6.54677035987303 L 4.504583333333333,6.93827035987303 C 4.794583333333333,7.228270359873029 5.244083333333333,7.228270359873029 5.534083333333333,6.93827035987303 L 5.911083333333334,6.54677035987303 C 6.201083333333333,6.25677035987303 6.201083333333333,5.80727035987303 5.911083333333334,5.51727035987303 L 5.519583333333333,5.14027035987303" stroke-linejoin="round"/>', '<path class="dot" d="M 6.519583333333333,5.14027035987303 L 6.519583333333332,5.14027035987303 C 6.229583333333332,4.85027035987303 5.780083333333333,4.85027035987303 5.490083333333333,5.14027035987303 L 5.113083333333333,5.51727035987303 C 4.823083333333333,5.80727035987303 4.823083333333333,6.25677035987303 5.113083333333333,6.54677035987303 L 5.504583333333333,6.93827035987303 C 5.794583333333333,7.228270359873029 6.244083333333332,7.228270359873029 6.534083333333332,6.93827035987303 L 6.911083333333333,6.54677035987303 C 7.201083333333333,6.25677035987303 7.201083333333333,5.80727035987303 6.911083333333333,5.51727035987303 L 6.519583333333333,5.14027035987303" stroke-linejoin="round"/>', '<path class="dot" d="M 7.519583333333333,6.14027045987303 L 7.519583333333332,6.14027045987303 C 7.229583333333332,5.85027045987303 6.780083333333333,5.85027045987303 6.490083333333333,6.14027045987303 L 6.113083333333333,6.51727045987303 C 5.823083333333333,6.80727045987303 5.823083333333333,7.25677045987303 6.113083333333333,7.546770459873031 L 6.504583333333333,7.93827045987303 C 6.794583333333333,8.22827045987303 7.244083333333332,8.22827045987303 7.534083333333332,7.93827045987303 L 7.911083333333333,7.546770459873031 C 8.201083333333333,7.25677045987303 8.201083333333333,6.80727045987303 7.911083333333333,6.51727045987303 L 7.519583333333333,6.14027045987303" stroke-linejoin="round"/>', '<path class="dot" d="M 8.519583333333333,8.14027075987303 L 8.519583333333333,8.14027075987303 C 8.229583333333332,7.85027075987303 7.780083333333333,7.85027075987303 7.490083333333333,8.14027075987303 L 7.113083333333333,8.51727075987303 C 6.823083333333333,8.807270759873031 6.823083333333333,9.25677075987303 7.113083333333333,9.54677075987303 L 7.504583333333333,9.93827075987303 C 7.794583333333333,10.22827075987303 8.244083333333332,10.22827075987303 8.534083333333333,9.93827075987303 L 8.911083333333334,9.54677075987303 C 9.201083333333333,9.25677075987303 9.201083333333333,8.807270759873031 8.911083333333334,8.51727075987303 L 8.519583333333333,8.14027075987303" stroke-linejoin="round"/>', '<path class="dot" d="M 8.519583333333333,10.140270859873029 L 8.519583333333333,10.140270859873029 C 8.229583333333332,9.85027085987303 7.780083333333333,9.85027085987303 7.490083333333333,10.140270859873029 L 7.113083333333333,10.51727085987303 C 6.823083333333333,10.807270859873029 6.823083333333333,11.25677085987303 7.113083333333333,11.54677085987303 L 7.504583333333333,11.938270859873029 C 7.794583333333333,12.22827085987303 8.244083333333332,12.22827085987303 8.534083333333333,11.938270859873029 L 8.911083333333334,11.54677085987303 C 9.201083333333333,11.25677085987303 9.201083333333333,10.80727085987303 8.911083333333334,10.51727085987303 L 8.519583333333333,10.140270859873029" stroke-linejoin="round"/>', '<path class="dot" d="M 7.519583333333333,13.140270859873029 L 7.519583333333332,13.140270859873029 C 7.229583333333332,12.85027085987303 6.780083333333333,12.85027085987303 6.490083333333333,13.140270859873029 L 6.113083333333333,13.51727085987303 C 5.823083333333333,13.807270859873029 5.823083333333333,14.25677085987303 6.113083333333333,14.54677085987303 L 6.504583333333333,14.938270859873029 C 6.794583333333333,15.22827085987303 7.244083333333332,15.22827085987303 7.534083333333332,14.938270859873029 L 7.911083333333333,14.54677085987303 C 8.201083333333333,14.25677085987303 8.201083333333333,13.80727085987303 7.911083333333333,13.51727085987303 L 7.519583333333333,13.140270859873029" stroke-linejoin="round"/>', '<path class="dot" d="M 6.519583333333333,14.140270859873029 L 6.519583333333332,14.140270859873029 C 6.229583333333332,13.85027085987303 5.780083333333333,13.85027085987303 5.490083333333333,14.140270859873029 L 5.113083333333333,14.51727085987303 C 4.823083333333333,14.807270859873029 4.823083333333333,15.25677085987303 5.113083333333333,15.54677085987303 L 5.504583333333333,15.938270859873029 C 5.794583333333333,16.228270859873028 6.244083333333332,16.228270859873028 6.534083333333332,15.938270859873029 L 6.911083333333333,15.54677085987303 C 7.201083333333333,15.25677085987303 7.201083333333333,14.80727085987303 6.911083333333333,14.51727085987303 L 6.519583333333333,14.140270859873029" stroke-linejoin="round"/>', '<path class="dot" d="M 4.519583333333333,14.140270859873029 L 4.519583333333333,14.140270859873029 C 4.229583333333333,13.85027085987303 3.7800833333333332,13.85027085987303 3.490083333333333,14.140270859873029 L 3.113083333333333,14.51727085987303 C 2.823083333333333,14.807270859873029 2.823083333333333,15.25677085987303 3.113083333333333,15.54677085987303 L 3.504583333333333,15.938270859873029 C 3.7945833333333328,16.228270859873028 4.244083333333333,16.228270859873028 4.534083333333333,15.938270859873029 L 4.911083333333334,15.54677085987303 C 5.201083333333333,15.25677085987303 5.201083333333333,14.80727085987303 4.911083333333334,14.51727085987303 L 4.519583333333333,14.140270859873029" stroke-linejoin="round"/>', '<path class="dot" d="M 3.5195833233333333,13.140270859873029 L 3.5195833233333333,13.140270859873029 C 3.2295833233333333,12.85027085987303 2.7800833233333333,12.85027085987303 2.4900833233333333,13.140270859873029 L 2.113083323333333,13.51727085987303 C 1.8230833233333332,13.807270859873029 1.8230833233333332,14.25677085987303 2.113083323333333,14.54677085987303 L 2.5045833233333332,14.938270859873029 C 2.794583323333333,15.22827085987303 3.2440833233333333,15.22827085987303 3.5340833233333333,14.938270859873029 L 3.9110833233333335,14.54677085987303 C 4.201083323333334,14.25677085987303 4.201083323333334,13.80727085987303 3.9110833233333335,13.51727085987303 L 3.5195833233333333,13.140270859873029" stroke-linejoin="round"/>', '<path class="dot" d="M 2.5195833333333333,11.140270859873029 L 2.5195833333333333,11.140270859873029 C 2.2295833333333333,10.85027085987303 1.7800833333333332,10.85027085987303 1.4900833333333332,11.140270859873029 L 1.1130833333333332,11.51727085987303 C 0.8230833333333332,11.807270859873029 0.8230833333333331,12.25677085987303 1.1130833333333332,12.54677085987303 L 1.5045833333333332,12.938270859873029 C 1.794583333333333,13.22827085987303 2.244083333333333,13.22827085987303 2.5340833333333332,12.938270859873029 L 2.9110833333333335,12.54677085987303 C 3.2010833333333335,12.25677085987303 3.2010833333333335,11.80727085987303 2.9110833333333335,11.51727085987303 L 2.5195833333333333,11.140270859873029" stroke-linejoin="round"/>']
            
            
            <path d="M 2.99999999,0.9999990530793934 L 7.0,0.9999990530793934 L 5.0,5.999999526539697 L 6.0,5.999999526539697 L 7.0,6.999999626539697 L 8.0,8.999999926539697 L 8.0,11.000000026539697 L 7.0,14.000000026539697 L 6.0,15.000000026539697 L 4.0,15.000000026539697 L 2.99999999,14.000000026539697 L 2.0,12.000000026539697" fill="none"
            stroke="black"
            stroke-width="1.5"
            stroke-linecap="round"
            stroke-linejoin="round"
            />
            
            
        </svg>