<?xml version="1.0" encoding="UTF-8" standalone="no"?>
<svg
   width="10"
   height="26"
   viewBox="0 0 0.4 1.04"
   version="1.1"
   id="svg25"
   xml:space="preserve"
   xmlns="http://www.w3.org/2000/svg"
   xmlns:svg="http://www.w3.org/2000/svg"><defs
   id="defs25" />
            
                ['', '']
            
                ['', '', '', '', '', '', '', '', '', '']
            
                ['', '', '', '', '', '', '', '', '', '']
            
            
            <g
   id="g29"
   transform="matrix(0.03,0,0,0.02857143,0.1961,0.39400001)"
   style="stroke-width:34.1565"><g
     id="g28"
     style="stroke-width:34.1565"><g
       id="g32"
       style="stroke:none;stroke-width:1350.16"
       transform="matrix(0.024,0,0,0.02666667,0.21487991,-2.5116004)"><g
         id="g33"
         style="stroke:none;stroke-width:53441.4"
         transform="matrix(0.02393569,0,0,0.02666667,-5.5608276,-1.1116285)"><g
           id="g34"
           style="stroke:none;stroke-width:2.11247e+06"
           transform="matrix(0.02399997,0,0,0.02666664,-21284.883,51.222335)"><g
             id="g35"
             style="stroke:none;stroke-width:7.46871e+07"
             transform="matrix(0.03,0,0,0.02666667,862957.68,-3880.085)"><g
               id="g1"
               transform="matrix(0.59999999,0,0,0.66666664,2300026.6,10143724)"
               style="stroke-width:1.18091e+08"><path
                 d="m -18427404,-44319849 v 58139684 m 0,-58139684 16118313.1,58139684 M 13809223,-44319849 -2309090.9,13819835 M 13809223,-44319849 v 58139684"
                 style="fill:none;stroke:none;stroke-width:9.44718e+06;stroke-linecap:round;stroke-linejoin:round"
                 id="path1" /></g></g></g></g></g></g></g></svg>
