<?xml version="1.0" encoding="UTF-8" standalone="no"?>
<svg
   xmlns:dc="http://purl.org/dc/elements/1.1/"
   xmlns:cc="http://creativecommons.org/ns#"
   xmlns:rdf="http://www.w3.org/1999/02/22-rdf-syntax-ns#"
   xmlns:svg="http://www.w3.org/2000/svg"
   xmlns="http://www.w3.org/2000/svg"
   xmlns:sodipodi="http://sodipodi.sourceforge.net/DTD/sodipodi-0.dtd"
   xmlns:inkscape="http://www.inkscape.org/namespaces/inkscape"
   data-dec="121"
   width="14"
   height="40"
   version="1.1"
   id="svg9619"
   sodipodi:docname="121.svg"
   inkscape:version="0.92.2 5c3e80d, 2017-08-06">
  <metadata
     id="metadata9625">
    <rdf:RDF>
      <cc:Work
         rdf:about="">
        <dc:format>image/svg+xml</dc:format>
        <dc:type
           rdf:resource="http://purl.org/dc/dcmitype/StillImage" />
        <dc:title></dc:title>
      </cc:Work>
    </rdf:RDF>
  </metadata>
  <defs
     id="defs9623" />
  <sodipodi:namedview
     pagecolor="#ffffff"
     bordercolor="#666666"
     borderopacity="1"
     objecttolerance="10"
     gridtolerance="10"
     guidetolerance="10"
     inkscape:pageopacity="0"
     inkscape:pageshadow="2"
     inkscape:window-width="1425"
     inkscape:window-height="850"
     id="namedview9621"
     showgrid="true"
     showguides="true"
     inkscape:guide-bbox="true"
     inkscape:zoom="16.68772"
     inkscape:cx="-2.2631694"
     inkscape:cy="17.451909"
     inkscape:window-x="9"
     inkscape:window-y="0"
     inkscape:window-maximized="0"
     inkscape:current-layer="svg9619">
    <inkscape:grid
       type="xygrid"
       id="grid10170" />
    <sodipodi:guide
       position="7,18"
       orientation="0,1"
       id="guide10172"
       inkscape:locked="false" />
    <sodipodi:guide
       position="7,32"
       orientation="0,1"
       id="guide10174"
       inkscape:locked="false" />
    <sodipodi:guide
       position="4,11"
       orientation="0,1"
       id="guide10176"
       inkscape:locked="false" />
  </sodipodi:namedview>
  <path
     d="M 7,22 4,28 2,29 H 1"
     style="fill:none;stroke:none;stroke-width:2;stroke-linecap:round;stroke-linejoin:round"
     id="path9617"
     inkscape:connector-curvature="0"
     sodipodi:nodetypes="cccc" />
  <path
     inkscape:connector-curvature="0"
     id="path1216"
     style="fill:none;stroke:none;stroke-width:1.95180011;stroke-linecap:round;stroke-linejoin:round"
     d="M 2,8 7,22 M 12,8 7,22" />
</svg>
