<?xml version="1.0" encoding="UTF-8" standalone="no"?>
<svg
   data-dec="88"
   width="14"
   height="40"
   version="1.1"
   id="svg1"
   xmlns="http://www.w3.org/2000/svg"
   xmlns:svg="http://www.w3.org/2000/svg">
  <defs
     id="defs1" />
  <path
     d="M 2,1 12,22 M 12,1 2,22"
     style="fill:none;stroke:none;stroke-width:2;stroke-linecap:round;stroke-linejoin:round"
     id="path1" />
</svg>
