<?xml version="1.0"?><!DOCTYPE svg PUBLIC "-//W3C//DTD SVG 1.1//EN" "http://www.w3.org/Graphics/SVG/1.1/DTD/svg11.dtd"><svg xmlns="http://www.w3.org/2000/svg" xmlns:xlink="http://www.w3.org/1999/xlink" width="350" height="1000" viewBox="0 0 7 17" >
            
                ['<path class="dot" d="M 4.385,0.31800000000000006 L 4.385,0.31800000000000006 C 4.164999999999999,0.09799999999999998 3.824,0.09799999999999995 3.6039999999999996,0.31800000000000006 L 3.3179999999999996,0.6040000000000002 C 3.0979999999999994,0.8240000000000002 3.0979999999999994,1.1650000000000003 3.3179999999999996,1.3850000000000002 L 3.6149999999999993,1.682 C 3.8349999999999995,1.902 4.176,1.902 4.395999999999999,1.682 L 4.682,1.3850000000000002 C 4.902,1.165 4.902,0.8240000000000002 4.682,0.6040000000000001 L 4.385,0.31800000000000006" stroke-linejoin="round"/>', '<path class="dot" d="M 4.385,10.318 L 4.385,10.318 C 4.164999999999999,10.098 3.824,10.098 3.6039999999999996,10.318 L 3.3179999999999996,10.604000000000001 C 3.0979999999999994,10.824 3.0979999999999994,11.165000000000001 3.3179999999999996,11.385000000000002 L 3.6149999999999993,11.682 C 3.8349999999999995,11.902000000000001 4.176,11.902000000000001 4.395999999999999,11.682 L 4.682,11.385000000000002 C 4.902,11.165000000000001 4.902,10.824 4.682,10.604000000000001 L 4.385,10.318000000000001" stroke-linejoin="round"/>']
            
                ['<path class="dot" d="M 2.385,10.318 L 2.385,10.318 C 2.165,10.098 1.8239999999999998,10.098 1.6039999999999999,10.318 L 1.3179999999999998,10.604000000000001 C 1.0979999999999999,10.824 1.0979999999999996,11.165000000000001 1.3179999999999998,11.385000000000002 L 1.6149999999999998,11.682 C 1.8349999999999997,11.902000000000001 2.176,11.902000000000001 2.396,11.682 L 2.6820000000000004,11.385000000000002 C 2.902,11.165000000000001 2.902,10.824 2.6820000000000004,10.604000000000001 L 2.385,10.318000000000001" stroke-linejoin="round"/>', '<path class="dot" d="M 6.385,10.318 L 6.385,10.318 C 6.164999999999999,10.098 5.824,10.098 5.603999999999999,10.318 L 5.318,10.604000000000001 C 5.098,10.824 5.098,11.165000000000001 5.318,11.385000000000002 L 5.614999999999999,11.682 C 5.834999999999999,11.902000000000001 6.176,11.902000000000001 6.395999999999999,11.682 L 6.682,11.385000000000002 C 6.902,11.165000000000001 6.902,10.824 6.682,10.604000000000001 L 6.385,10.318000000000001" stroke-linejoin="round"/>']
            
                ['<path class="dot" d="M 2.385,0.31800000000000006 L 2.385,0.31800000000000006 C 2.165,0.09799999999999998 1.8239999999999998,0.09799999999999995 1.6039999999999999,0.31800000000000006 L 1.3179999999999998,0.6040000000000002 C 1.0979999999999999,0.8240000000000002 1.0979999999999996,1.1650000000000003 1.3179999999999998,1.3850000000000002 L 1.6149999999999998,1.682 C 1.8349999999999997,1.902 2.176,1.902 2.396,1.682 L 2.6820000000000004,1.3850000000000002 C 2.902,1.165 2.902,0.8240000000000002 2.6820000000000004,0.6040000000000001 L 2.385,0.31800000000000006" stroke-linejoin="round"/>', '<path class="dot" d="M 6.385,0.31800000000000006 L 6.385,0.31800000000000006 C 6.164999999999999,0.09799999999999998 5.824,0.09799999999999995 5.603999999999999,0.31800000000000006 L 5.318,0.6040000000000002 C 5.098,0.8240000000000002 5.098,1.1650000000000003 5.318,1.3850000000000002 L 5.614999999999999,1.682 C 5.834999999999999,1.902 6.176,1.902 6.395999999999999,1.682 L 6.682,1.3850000000000002 C 6.902,1.165 6.902,0.8240000000000002 6.682,0.6040000000000001 L 6.385,0.31800000000000006" stroke-linejoin="round"/>']
            
                ['<path class="dot" d="M 3.385,-1.682 L 3.385,-1.682 C 3.1649999999999996,-1.9020000000000001 2.824,-1.9020000000000001 2.6039999999999996,-1.682 L 2.3179999999999996,-1.396 C 2.0979999999999994,-1.1759999999999997 2.0979999999999994,-0.8349999999999997 2.3179999999999996,-0.6149999999999998 L 2.6149999999999993,-0.31800000000000006 C 2.8349999999999995,-0.09800000000000009 3.1759999999999997,-0.09800000000000009 3.3959999999999995,-0.31800000000000006 L 3.682,-0.6149999999999998 C 3.902,-0.835 3.902,-1.1759999999999997 3.682,-1.396 L 3.385,-1.682" stroke-linejoin="round"/>', '<path class="dot" d="M 5.385,-2.682 L 5.385,-2.682 C 5.164999999999999,-2.902 4.824,-2.902 4.603999999999999,-2.682 L 4.318,-2.396 C 4.098,-2.1759999999999997 4.098,-1.8349999999999997 4.318,-1.6149999999999998 L 4.614999999999999,-1.318 C 4.834999999999999,-1.098 5.176,-1.098 5.395999999999999,-1.318 L 5.682,-1.6149999999999998 C 5.902,-1.835 5.902,-2.1759999999999997 5.682,-2.396 L 5.385,-2.682" stroke-linejoin="round"/>']
            
            
            <path d="M 4.0,1.0 L 4.0,11.0" fill="none"
            stroke="black"
            stroke-width="1"
            stroke-linecap="round"
            stroke-linejoin="round"
            />
            
            <path d="M 2.0,11.0 L 6.0,11.0" fill="none"
            stroke="black"
            stroke-width="1"
            stroke-linecap="round"
            stroke-linejoin="round"
            />
            
            <path d="M 2.0,1.0 L 6.0,1.0" fill="none"
            stroke="black"
            stroke-width="1"
            stroke-linecap="round"
            stroke-linejoin="round"
            />
            
            <path d="M 3.0,-1.0 L 5.0,-2.0" fill="none"
            stroke="black"
            stroke-width="1"
            stroke-linecap="round"
            stroke-linejoin="round"
            />
            
            
        </svg>