<?xml version="1.0"?><!DOCTYPE svg PUBLIC "-//W3C//DTD SVG 1.1//EN" "http://www.w3.org/Graphics/SVG/1.1/DTD/svg11.dtd"><svg xmlns="http://www.w3.org/2000/svg" xmlns:xlink="http://www.w3.org/1999/xlink" width="350" height="1000" viewBox="0 0 14 40" >
            
                ['<path class="dot" d="M 3.7909438775510207,6.777193877551018 L 3.79094387755102,6.777193877551018 C 3.3409438775510196,6.327193877551018 2.64344387755102,6.327193877551018 2.19344387755102,6.777193877551018 L 1.60844387755102,7.362193877551018 C 1.15844387755102,7.812193877551018 1.15844387755102,8.509693877551019 1.60844387755102,8.959693877551018 L 2.2159438775510196,9.567193877551018 C 2.66594387755102,10.017193877551017 3.3634438775510196,10.017193877551017 3.8134438775510198,9.567193877551018 L 4.398443877551021,8.959693877551018 C 4.84844387755102,8.509693877551019 4.84844387755102,7.812193877551018 4.398443877551021,7.362193877551018 L 3.7909438775510207,6.777193877551018" stroke-linejoin="round"/>', '<path class="dot" d="M 2.7909438775510207,7.777193877551018 L 2.79094387755102,7.777193877551018 C 2.3409438775510196,7.327193877551018 1.6434438775510198,7.327193877551018 1.19344387755102,7.777193877551018 L 0.6084438775510199,8.362193877551018 C 0.15844387755101996,8.812193877551017 0.15844387755101985,9.509693877551019 0.6084438775510199,9.959693877551018 L 1.2159438775510198,10.567193877551018 C 1.6659438775510198,11.017193877551017 2.3634438775510196,11.017193877551017 2.8134438775510198,10.567193877551018 L 3.3984438775510206,9.959693877551018 C 3.84844387755102,9.509693877551019 3.84844387755102,8.812193877551017 3.3984438775510206,8.362193877551018 L 2.7909438775510207,7.777193877551018" stroke-linejoin="round"/>', '<path class="dot" d="M 1.7909438775510205,12.777193877551019 L 1.7909438775510196,12.777193877551019 C 1.3409438775510198,12.327193877551018 0.6434438775510198,12.327193877551018 0.19344387755102,12.777193877551019 L -0.39155612244898,13.362193877551018 C -0.84155612244898,13.81219387755102 -0.8415561224489801,14.509693877551019 -0.39155612244898,14.959693877551018 L 0.21594387755101985,15.567193877551018 C 0.6659438775510198,16.01719387755102 1.3634438775510198,16.01719387755102 1.8134438775510195,15.567193877551018 L 2.3984438775510206,14.959693877551018 C 2.84844387755102,14.509693877551019 2.84844387755102,13.81219387755102 2.3984438775510206,13.362193877551018 L 1.7909438775510205,12.777193877551019" stroke-linejoin="round"/>', '<path class="dot" d="M 1.7909438775510205,14.777193877551019 L 1.7909438775510196,14.777193877551019 C 1.3409438775510198,14.327193877551018 0.6434438775510198,14.327193877551018 0.19344387755102,14.777193877551019 L -0.39155612244898,15.362193877551018 C -0.84155612244898,15.81219387755102 -0.8415561224489801,16.50969387755102 -0.39155612244898,16.959693877551018 L 0.21594387755101985,17.56719387755102 C 0.6659438775510198,18.01719387755102 1.3634438775510198,18.01719387755102 1.8134438775510195,17.56719387755102 L 2.3984438775510206,16.959693877551018 C 2.84844387755102,16.50969387755102 2.84844387755102,15.81219387755102 2.3984438775510206,15.362193877551018 L 1.7909438775510205,14.777193877551019" stroke-linejoin="round"/>', '<path class="dot" d="M 2.7909438775510207,19.777193877551017 L 2.79094387755102,19.777193877551017 C 2.3409438775510196,19.327193877551018 1.6434438775510198,19.327193877551018 1.19344387755102,19.777193877551017 L 0.6084438775510199,20.362193877551018 C 0.15844387755101996,20.812193877551017 0.15844387755101985,21.50969387755102 0.6084438775510199,21.959693877551018 L 1.2159438775510198,22.56719387755102 C 1.6659438775510198,23.01719387755102 2.3634438775510196,23.01719387755102 2.8134438775510198,22.56719387755102 L 3.3984438775510206,21.959693877551018 C 3.84844387755102,21.50969387755102 3.84844387755102,20.812193877551017 3.3984438775510206,20.362193877551018 L 2.7909438775510207,19.777193877551017" stroke-linejoin="round"/>', '<path class="dot" d="M 3.7909438775510207,20.777193877551017 L 3.79094387755102,20.777193877551017 C 3.3409438775510196,20.327193877551018 2.64344387755102,20.327193877551018 2.19344387755102,20.777193877551017 L 1.60844387755102,21.362193877551018 C 1.15844387755102,21.812193877551017 1.15844387755102,22.50969387755102 1.60844387755102,22.959693877551018 L 2.2159438775510196,23.56719387755102 C 2.66594387755102,24.01719387755102 3.3634438775510196,24.01719387755102 3.8134438775510198,23.56719387755102 L 4.398443877551021,22.959693877551018 C 4.84844387755102,22.50969387755102 4.84844387755102,21.812193877551017 4.398443877551021,21.362193877551018 L 3.7909438775510207,20.777193877551017" stroke-linejoin="round"/>', '<path class="dot" d="M 5.790943877551021,20.777193877551017 L 5.79094387755102,20.777193877551017 C 5.34094387755102,20.327193877551018 4.64344387755102,20.327193877551018 4.1934438775510205,20.777193877551017 L 3.60844387755102,21.362193877551018 C 3.1584438775510204,21.812193877551017 3.15844387755102,22.50969387755102 3.60844387755102,22.959693877551018 L 4.21594387755102,23.56719387755102 C 4.66594387755102,24.01719387755102 5.3634438775510205,24.01719387755102 5.81344387755102,23.56719387755102 L 6.398443877551021,22.959693877551018 C 6.84844387755102,22.50969387755102 6.84844387755102,21.812193877551017 6.398443877551021,21.362193877551018 L 5.790943877551021,20.777193877551017" stroke-linejoin="round"/>', '<path class="dot" d="M 6.790943877551021,19.777193877551017 L 6.79094387755102,19.777193877551017 C 6.34094387755102,19.327193877551018 5.64344387755102,19.327193877551018 5.1934438775510205,19.777193877551017 L 4.608443877551021,20.362193877551018 C 4.15844387755102,20.812193877551017 4.15844387755102,21.50969387755102 4.608443877551021,21.959693877551018 L 5.21594387755102,22.56719387755102 C 5.66594387755102,23.01719387755102 6.3634438775510205,23.01719387755102 6.81344387755102,22.56719387755102 L 7.398443877551021,21.959693877551018 C 7.84844387755102,21.50969387755102 7.84844387755102,20.812193877551017 7.398443877551021,20.362193877551018 L 6.790943877551021,19.777193877551017" stroke-linejoin="round"/>', '<path class="dot" d="M 7.790943877551021,14.777193877551019 L 7.79094387755102,14.777193877551019 C 7.34094387755102,14.327193877551018 6.64344387755102,14.327193877551018 6.1934438775510205,14.777193877551019 L 5.608443877551021,15.362193877551018 C 5.15844387755102,15.81219387755102 5.15844387755102,16.50969387755102 5.608443877551021,16.959693877551018 L 6.21594387755102,17.56719387755102 C 6.66594387755102,18.01719387755102 7.3634438775510205,18.01719387755102 7.81344387755102,17.56719387755102 L 8.39844387755102,16.959693877551018 C 8.84844387755102,16.50969387755102 8.84844387755102,15.81219387755102 8.39844387755102,15.362193877551018 L 7.790943877551021,14.777193877551019" stroke-linejoin="round"/>', '<path class="dot" d="M 7.790943877551021,12.777193877551019 L 7.79094387755102,12.777193877551019 C 7.34094387755102,12.327193877551018 6.64344387755102,12.327193877551018 6.1934438775510205,12.777193877551019 L 5.608443877551021,13.362193877551018 C 5.15844387755102,13.81219387755102 5.15844387755102,14.509693877551019 5.608443877551021,14.959693877551018 L 6.21594387755102,15.567193877551018 C 6.66594387755102,16.01719387755102 7.3634438775510205,16.01719387755102 7.81344387755102,15.567193877551018 L 8.39844387755102,14.959693877551018 C 8.84844387755102,14.509693877551019 8.84844387755102,13.81219387755102 8.39844387755102,13.362193877551018 L 7.790943877551021,12.777193877551019" stroke-linejoin="round"/>', '<path class="dot" d="M 6.790943877551021,7.777193877551018 L 6.79094387755102,7.777193877551018 C 6.34094387755102,7.327193877551018 5.64344387755102,7.327193877551018 5.1934438775510205,7.777193877551018 L 4.608443877551021,8.362193877551018 C 4.15844387755102,8.812193877551017 4.15844387755102,9.509693877551019 4.608443877551021,9.959693877551018 L 5.21594387755102,10.567193877551018 C 5.66594387755102,11.017193877551017 6.3634438775510205,11.017193877551017 6.81344387755102,10.567193877551018 L 7.398443877551021,9.959693877551018 C 7.84844387755102,9.509693877551019 7.84844387755102,8.812193877551017 7.398443877551021,8.362193877551018 L 6.790943877551021,7.777193877551018" stroke-linejoin="round"/>', '<path class="dot" d="M 5.790943877551021,6.777193877551018 L 5.79094387755102,6.777193877551018 C 5.34094387755102,6.327193877551018 4.64344387755102,6.327193877551018 4.1934438775510205,6.777193877551018 L 3.60844387755102,7.362193877551018 C 3.1584438775510204,7.812193877551018 3.15844387755102,8.509693877551019 3.60844387755102,8.959693877551018 L 4.21594387755102,9.567193877551018 C 4.66594387755102,10.017193877551017 5.3634438775510205,10.017193877551017 5.81344387755102,9.567193877551018 L 6.398443877551021,8.959693877551018 C 6.84844387755102,8.509693877551019 6.84844387755102,7.812193877551018 6.398443877551021,7.362193877551018 L 5.790943877551021,6.777193877551018" stroke-linejoin="round"/>', '<path class="dot" d="M 7.790943877551021,12.777193877551019 L 7.79094387755102,12.777193877551019 C 7.34094387755102,12.327193877551018 6.64344387755102,12.327193877551018 6.1934438775510205,12.777193877551019 L 5.608443877551021,13.362193877551018 C 5.15844387755102,13.81219387755102 5.15844387755102,14.509693877551019 5.608443877551021,14.959693877551018 L 6.21594387755102,15.567193877551018 C 6.66594387755102,16.01719387755102 7.3634438775510205,16.01719387755102 7.81344387755102,15.567193877551018 L 8.39844387755102,14.959693877551018 C 8.84844387755102,14.509693877551019 8.84844387755102,13.81219387755102 8.39844387755102,13.362193877551018 L 7.790943877551021,12.777193877551019" stroke-linejoin="round"/>', '<path class="dot" d="M 13.790943877551019,12.777193877551019 L 13.790943877551019,12.777193877551019 C 13.34094387755102,12.327193877551018 12.64344387755102,12.327193877551018 12.193443877551019,12.777193877551019 L 11.60844387755102,13.362193877551018 C 11.158443877551019,13.81219387755102 11.158443877551019,14.509693877551019 11.60844387755102,14.959693877551018 L 12.21594387755102,15.567193877551018 C 12.665943877551019,16.01719387755102 13.363443877551019,16.01719387755102 13.81344387755102,15.567193877551018 L 14.39844387755102,14.959693877551018 C 14.84844387755102,14.509693877551019 14.84844387755102,13.81219387755102 14.39844387755102,13.362193877551018 L 13.790943877551019,12.777193877551019" stroke-linejoin="round"/>', '<path class="dot" d="M 13.790943877551019,10.777193877551019 L 13.790943877551019,10.777193877551019 C 13.34094387755102,10.327193877551018 12.64344387755102,10.327193877551018 12.193443877551019,10.777193877551019 L 11.60844387755102,11.362193877551018 C 11.158443877551019,11.81219387755102 11.158443877551019,12.509693877551019 11.60844387755102,12.959693877551018 L 12.21594387755102,13.567193877551018 C 12.665943877551019,14.01719387755102 13.363443877551019,14.01719387755102 13.81344387755102,13.567193877551018 L 14.39844387755102,12.959693877551018 C 14.84844387755102,12.509693877551019 14.84844387755102,11.81219387755102 14.39844387755102,11.362193877551018 L 13.790943877551019,10.777193877551019" stroke-linejoin="round"/>', '<path class="dot" d="M 12.790943877551019,7.777193877551018 L 12.790943877551019,7.777193877551018 C 12.34094387755102,7.327193877551018 11.64344387755102,7.327193877551018 11.193443877551019,7.777193877551018 L 10.60844387755102,8.362193877551018 C 10.158443877551019,8.812193877551017 10.158443877551019,9.509693877551019 10.60844387755102,9.959693877551018 L 11.21594387755102,10.567193877551018 C 11.665943877551019,11.017193877551017 12.363443877551019,11.017193877551017 12.81344387755102,10.567193877551018 L 13.39844387755102,9.959693877551018 C 13.84844387755102,9.509693877551019 13.84844387755102,8.812193877551017 13.39844387755102,8.362193877551018 L 12.790943877551019,7.777193877551018" stroke-linejoin="round"/>', '<path class="dot" d="M 11.790943877551019,6.777193877551018 L 11.790943877551019,6.777193877551018 C 11.34094387755102,6.327193877551018 10.64344387755102,6.327193877551018 10.193443877551019,6.777193877551018 L 9.60844387755102,7.362193877551018 C 9.158443877551019,7.812193877551018 9.158443877551019,8.509693877551019 9.60844387755102,8.959693877551018 L 10.21594387755102,9.567193877551018 C 10.665943877551019,10.017193877551017 11.363443877551019,10.017193877551017 11.81344387755102,9.567193877551018 L 12.39844387755102,8.959693877551018 C 12.84844387755102,8.509693877551019 12.84844387755102,7.812193877551018 12.39844387755102,7.362193877551018 L 11.790943877551019,6.777193877551018" stroke-linejoin="round"/>', '<path class="dot" d="M 9.79094387755102,6.777193877551018 L 9.790943877551019,6.777193877551018 C 9.34094387755102,6.327193877551018 8.64344387755102,6.327193877551018 8.19344387755102,6.777193877551018 L 7.608443877551021,7.362193877551018 C 7.15844387755102,7.812193877551018 7.15844387755102,8.509693877551019 7.608443877551021,8.959693877551018 L 8.21594387755102,9.567193877551018 C 8.66594387755102,10.017193877551017 9.36344387755102,10.017193877551017 9.81344387755102,9.567193877551018 L 10.39844387755102,8.959693877551018 C 10.84844387755102,8.509693877551019 10.84844387755102,7.812193877551018 10.39844387755102,7.362193877551018 L 9.79094387755102,6.777193877551018" stroke-linejoin="round"/>', '<path class="dot" d="M 8.79094387755102,7.777193877551018 L 8.790943877551019,7.777193877551018 C 8.34094387755102,7.327193877551018 7.64344387755102,7.327193877551018 7.1934438775510205,7.777193877551018 L 6.608443877551021,8.362193877551018 C 6.15844387755102,8.812193877551017 6.15844387755102,9.509693877551019 6.608443877551021,9.959693877551018 L 7.21594387755102,10.567193877551018 C 7.66594387755102,11.017193877551017 8.36344387755102,11.017193877551017 8.81344387755102,10.567193877551018 L 9.39844387755102,9.959693877551018 C 9.84844387755102,9.509693877551019 9.84844387755102,8.812193877551017 9.39844387755102,8.362193877551018 L 8.79094387755102,7.777193877551018" stroke-linejoin="round"/>', '<path class="dot" d="M 7.790943877551021,12.777193877551019 L 7.79094387755102,12.777193877551019 C 7.34094387755102,12.327193877551018 6.64344387755102,12.327193877551018 6.1934438775510205,12.777193877551019 L 5.608443877551021,13.362193877551018 C 5.15844387755102,13.81219387755102 5.15844387755102,14.509693877551019 5.608443877551021,14.959693877551018 L 6.21594387755102,15.567193877551018 C 6.66594387755102,16.01719387755102 7.3634438775510205,16.01719387755102 7.81344387755102,15.567193877551018 L 8.39844387755102,14.959693877551018 C 8.84844387755102,14.509693877551019 8.84844387755102,13.81219387755102 8.39844387755102,13.362193877551018 L 7.790943877551021,12.777193877551019" stroke-linejoin="round"/>', '<path class="dot" d="M 7.790943877551021,14.777193877551019 L 7.79094387755102,14.777193877551019 C 7.34094387755102,14.327193877551018 6.64344387755102,14.327193877551018 6.1934438775510205,14.777193877551019 L 5.608443877551021,15.362193877551018 C 5.15844387755102,15.81219387755102 5.15844387755102,16.50969387755102 5.608443877551021,16.959693877551018 L 6.21594387755102,17.56719387755102 C 6.66594387755102,18.01719387755102 7.3634438775510205,18.01719387755102 7.81344387755102,17.56719387755102 L 8.39844387755102,16.959693877551018 C 8.84844387755102,16.50969387755102 8.84844387755102,15.81219387755102 8.39844387755102,15.362193877551018 L 7.790943877551021,14.777193877551019" stroke-linejoin="round"/>', '<path class="dot" d="M 8.79094387755102,19.777193877551017 L 8.790943877551019,19.777193877551017 C 8.34094387755102,19.327193877551018 7.64344387755102,19.327193877551018 7.1934438775510205,19.777193877551017 L 6.608443877551021,20.362193877551018 C 6.15844387755102,20.812193877551017 6.15844387755102,21.50969387755102 6.608443877551021,21.959693877551018 L 7.21594387755102,22.56719387755102 C 7.66594387755102,23.01719387755102 8.36344387755102,23.01719387755102 8.81344387755102,22.56719387755102 L 9.39844387755102,21.959693877551018 C 9.84844387755102,21.50969387755102 9.84844387755102,20.812193877551017 9.39844387755102,20.362193877551018 L 8.79094387755102,19.777193877551017" stroke-linejoin="round"/>', '<path class="dot" d="M 9.79094387755102,20.777193877551017 L 9.790943877551019,20.777193877551017 C 9.34094387755102,20.327193877551018 8.64344387755102,20.327193877551018 8.19344387755102,20.777193877551017 L 7.608443877551021,21.362193877551018 C 7.15844387755102,21.812193877551017 7.15844387755102,22.50969387755102 7.608443877551021,22.959693877551018 L 8.21594387755102,23.56719387755102 C 8.66594387755102,24.01719387755102 9.36344387755102,24.01719387755102 9.81344387755102,23.56719387755102 L 10.39844387755102,22.959693877551018 C 10.84844387755102,22.50969387755102 10.84844387755102,21.812193877551017 10.39844387755102,21.362193877551018 L 9.79094387755102,20.777193877551017" stroke-linejoin="round"/>', '<path class="dot" d="M 11.790943877551019,20.777193877551017 L 11.790943877551019,20.777193877551017 C 11.34094387755102,20.327193877551018 10.64344387755102,20.327193877551018 10.193443877551019,20.777193877551017 L 9.60844387755102,21.362193877551018 C 9.158443877551019,21.812193877551017 9.158443877551019,22.50969387755102 9.60844387755102,22.959693877551018 L 10.21594387755102,23.56719387755102 C 10.665943877551019,24.01719387755102 11.363443877551019,24.01719387755102 11.81344387755102,23.56719387755102 L 12.39844387755102,22.959693877551018 C 12.84844387755102,22.50969387755102 12.84844387755102,21.812193877551017 12.39844387755102,21.362193877551018 L 11.790943877551019,20.777193877551017" stroke-linejoin="round"/>', '<path class="dot" d="M 12.790943877551019,19.777193877551017 L 12.790943877551019,19.777193877551017 C 12.34094387755102,19.327193877551018 11.64344387755102,19.327193877551018 11.193443877551019,19.777193877551017 L 10.60844387755102,20.362193877551018 C 10.158443877551019,20.812193877551017 10.158443877551019,21.50969387755102 10.60844387755102,21.959693877551018 L 11.21594387755102,22.56719387755102 C 11.665943877551019,23.01719387755102 12.363443877551019,23.01719387755102 12.81344387755102,22.56719387755102 L 13.39844387755102,21.959693877551018 C 13.84844387755102,21.50969387755102 13.84844387755102,20.812193877551017 13.39844387755102,20.362193877551018 L 12.790943877551019,19.777193877551017" stroke-linejoin="round"/>', '<path class="dot" d="M 13.790943877551019,17.777193877551017 L 13.790943877551019,17.777193877551017 C 13.34094387755102,17.327193877551018 12.64344387755102,17.327193877551018 12.193443877551019,17.777193877551017 L 11.60844387755102,18.362193877551018 C 11.158443877551019,18.812193877551017 11.158443877551019,19.50969387755102 11.60844387755102,19.959693877551018 L 12.21594387755102,20.56719387755102 C 12.665943877551019,21.01719387755102 13.363443877551019,21.01719387755102 13.81344387755102,20.56719387755102 L 14.39844387755102,19.959693877551018 C 14.84844387755102,19.50969387755102 14.84844387755102,18.812193877551017 14.39844387755102,18.362193877551018 L 13.790943877551019,17.777193877551017" stroke-linejoin="round"/>']
            
            
            <path d="M 3.0,8.0 L 2.0,9.0 L 1.0,14.0 L 1.0,16.0 L 2.0,21.0 L 3.0,22.0 L 5.0,22.0 L 6.0,21.0 L 7.0,16.0 L 7.0,14.0 L 6.0,9.0 L 5.0,8.0 L 3.0,8.0 M 7.0,14.0 L 13.0,14.0 L 13.0,12.0 L 12.0,9.0 L 11.0,8.0 L 9.0,8.0 L 8.0,9.0 L 7.0,14.0 L 7.0,16.0 L 8.0,21.0 L 9.0,22.0 L 11.0,22.0 L 12.0,21.0 L 13.0,19.0" fill="none"
            stroke="black"
            stroke-width="2.5"
            stroke-linecap="round"
            stroke-linejoin="round"
            />
            
            
        </svg>