<?xml version="1.0" encoding="UTF-8" standalone="no"?>
<svg
   width="6"
   height="10"
   viewBox="0 0 6 10"
   version="1.1"
   id="svg25"
   sodipodi:docname="m-excpt.svg"
   inkscape:version="1.3.1 (9b9bdc1480, 2023-11-25, custom)"
   xml:space="preserve"
   xmlns:inkscape="http://www.inkscape.org/namespaces/inkscape"
   xmlns:sodipodi="http://sodipodi.sourceforge.net/DTD/sodipodi-0.dtd"
   xmlns="http://www.w3.org/2000/svg"
   xmlns:svg="http://www.w3.org/2000/svg"><defs
   id="defs25" /><sodipodi:namedview
   id="namedview25"
   pagecolor="#ffffff"
   bordercolor="#666666"
   borderopacity="1.0"
   inkscape:showpageshadow="2"
   inkscape:pageopacity="0.0"
   inkscape:pagecheckerboard="0"
   inkscape:deskcolor="#d1d1d1"
   showgrid="true"
   inkscape:zoom="45.254834"
   inkscape:cx="-6.22033"
   inkscape:cy="4.9497475"
   inkscape:window-width="1878"
   inkscape:window-height="1016"
   inkscape:window-x="0"
   inkscape:window-y="0"
   inkscape:window-maximized="1"
   inkscape:current-layer="svg25"
   showguides="true"><inkscape:grid
     id="grid25"
     units="px"
     originx="0"
     originy="0"
     spacingx="1"
     spacingy="1"
     empcolor="#0099e5"
     empopacity="0.30196078"
     color="#0099e5"
     opacity="0.14901961"
     empspacing="5"
     dotted="false"
     gridanglex="30"
     gridanglez="30"
     visible="true" /><sodipodi:guide
     position="-0.065287397,0.64000001"
     orientation="0,-1"
     id="guide29"
     inkscape:locked="false" /><sodipodi:guide
     position="-0.22187149,1.04"
     orientation="0,-1"
     id="guide30"
     inkscape:locked="false" /><sodipodi:guide
     position="0.10495839,1.2"
     orientation="0,-1"
     id="guide31"
     inkscape:locked="false" /><sodipodi:guide
     position="0.097602094,0.48000002"
     orientation="0,-1"
     id="guide32"
     inkscape:locked="false" /></sodipodi:namedview>
            
                ['', '']
            
                ['', '', '', '', '', '', '', '', '', '']
            
                ['', '', '', '', '', '', '', '', '', '']
            
            
            <path
   d="M 0,2.9999999 0.99999979,-2.5331976e-7 H 1.9999998 L 2.9999999,2.9999999 v 7 m 0,-7 1,-3.00000015331976 h 1 L 6,2.9999999 v 7"
   style="fill:none;stroke:black;stroke-width:0.5;stroke-linecap:round;stroke-linejoin:round"
   id="path7741"
   inkscape:connector-curvature="0"
   sodipodi:nodetypes="cccccccccc" /></svg>
