<?xml version="1.0" encoding="UTF-8" standalone="no"?>
<svg
   width="2"
   height="14"
   viewBox="0 0 2 14"
   version="1.1"
   id="svg25"
   sodipodi:docname="un.svg"
   inkscape:version="1.3.2 (091e20ef0f, 2023-11-25, custom)"
   xml:space="preserve"
   xmlns:inkscape="http://www.inkscape.org/namespaces/inkscape"
   xmlns:sodipodi="http://sodipodi.sourceforge.net/DTD/sodipodi-0.dtd"
   xmlns="http://www.w3.org/2000/svg"
   xmlns:svg="http://www.w3.org/2000/svg"><defs
   id="defs25" /><sodipodi:namedview
   id="namedview25"
   pagecolor="#ffffff"
   bordercolor="#666666"
   borderopacity="1.0"
   inkscape:showpageshadow="2"
   inkscape:pageopacity="0.0"
   inkscape:pagecheckerboard="0"
   inkscape:deskcolor="#d1d1d1"
   showgrid="true"
   inkscape:zoom="46.089852"
   inkscape:cx="-8.1579781"
   inkscape:cy="8.0711911"
   inkscape:window-width="2048"
   inkscape:window-height="1083"
   inkscape:window-x="0"
   inkscape:window-y="0"
   inkscape:window-maximized="1"
   inkscape:current-layer="svg25"
   showguides="true"><inkscape:grid
     id="grid25"
     units="px"
     originx="0"
     originy="0"
     spacingx="1"
     spacingy="1"
     empcolor="#0099e5"
     empopacity="0.30196078"
     color="#0099e5"
     opacity="0.14901961"
     empspacing="5"
     dotted="false"
     gridanglex="30"
     gridanglez="30"
     visible="true" /><sodipodi:guide
     position="-0.1452874,0.47999995"
     orientation="0,-1"
     id="guide29"
     inkscape:locked="false" /><sodipodi:guide
     position="-0.30187149,0.87999994"
     orientation="0,-1"
     id="guide30"
     inkscape:locked="false" /><sodipodi:guide
     position="0.024958396,1.0399999"
     orientation="0,-1"
     id="guide31"
     inkscape:locked="false" /><sodipodi:guide
     position="0.017602096,0.31999996"
     orientation="0,-1"
     id="guide32"
     inkscape:locked="false" /></sodipodi:namedview>
            
                ['', '']
            
                ['', '', '', '', '', '', '', '', '', '']
            
                ['', '', '', '', '', '', '', '', '', '']
            
            
            <path
   d="m 0,3.0000003 1,-1 L 2,0 v 14"
   style="fill:none;stroke:none;stroke-width:0.07529;stroke-linecap:round;stroke-linejoin:round"
   id="path2"
   inkscape:connector-curvature="0"
   sodipodi:nodetypes="cccc" /></svg>
