<?xml version="1.0" encoding="UTF-8" standalone="no"?>
<svg
   width="2"
   height="4"
   viewBox="0 0 0.08 0.16"
   version="1.1"
   id="svg25"
   xml:space="preserve"
   sodipodi:docname="q-cap-excpt.svg"
   inkscape:version="1.3.1 (9b9bdc1480, 2023-11-25, custom)"
   xmlns:inkscape="http://www.inkscape.org/namespaces/inkscape"
   xmlns:sodipodi="http://sodipodi.sourceforge.net/DTD/sodipodi-0.dtd"
   xmlns="http://www.w3.org/2000/svg"
   xmlns:svg="http://www.w3.org/2000/svg"><sodipodi:namedview
   id="namedview1"
   pagecolor="#ffffff"
   bordercolor="#999999"
   borderopacity="1"
   inkscape:showpageshadow="2"
   inkscape:pageopacity="0"
   inkscape:pagecheckerboard="0"
   inkscape:deskcolor="#d1d1d1"
   showgrid="true"
   showguides="true"
   inkscape:zoom="44.384549"
   inkscape:cx="0.75476716"
   inkscape:cy="-1.3743521"
   inkscape:window-width="1878"
   inkscape:window-height="1016"
   inkscape:window-x="0"
   inkscape:window-y="0"
   inkscape:window-maximized="1"
   inkscape:current-layer="g35"><inkscape:grid
     id="grid1"
     units="px"
     originx="-0.16"
     originy="-0.31999999"
     spacingx="0.04"
     spacingy="0.04"
     empcolor="#0099e5"
     empopacity="0.30196078"
     color="#0099e5"
     opacity="0.14901961"
     empspacing="5"
     dotted="false"
     gridanglex="30"
     gridanglez="30"
     visible="true" /><sodipodi:guide
     position="-0.080000008,0.95999999"
     orientation="0,-1"
     id="guide1"
     inkscape:locked="false" /><sodipodi:guide
     position="-0.12,0.83999999"
     orientation="0,-1"
     id="guide2"
     inkscape:locked="false" /><sodipodi:guide
     position="-0.13578431,0.56"
     orientation="0,-1"
     id="guide3"
     inkscape:locked="false" /><sodipodi:guide
     position="-0.13960784,0.44"
     orientation="0,-1"
     id="guide4"
     inkscape:locked="false" /></sodipodi:namedview><defs
   id="defs25" />
            
                ['', '']
            
                ['', '', '', '', '', '', '', '', '', '']
            
                ['', '', '', '', '', '', '', '', '', '']
            
            
            <g
   id="g29"
   transform="matrix(0.02142857,0,0,0.02040816,0.00292856,-0.02714285)"
   style="stroke-width:34.1565"><g
     id="g28"
     style="stroke-width:34.1565"><g
       id="g32"
       style="stroke:none;stroke-width:1350.16"
       transform="matrix(0.024,0,0,0.02666667,0.21487991,-2.5116004)"><g
         id="g33"
         style="stroke:none;stroke-width:53441.4"
         transform="matrix(0.02393569,0,0,0.02666667,-5.5608276,-1.1116285)"><g
           id="g34"
           style="stroke:none;stroke-width:2.11247e+06"
           transform="matrix(0.02399997,0,0,0.02666664,-21284.883,51.222335)"><g
             id="g35"
             style="stroke:none;stroke-width:7.46871e+07"
             transform="matrix(0.03,0,0,0.02666667,862957.68,-3880.085)"><g
               id="g2"
               transform="matrix(0.35919794,0,0,0.39910882,17204685,-1621876.9)"
               style="stroke-width:1.97257e+08"><path
                 d="m -47146273,23429423 25128919,38846343"
                 style="fill:none;stroke:none;stroke-width:1.57805e+07;stroke-linecap:round;stroke-linejoin:round"
                 id="path1-1"
                 sodipodi:nodetypes="cc" /></g></g></g></g></g></g></g></svg>
