<?xml version="1.0"?><!DOCTYPE svg PUBLIC "-//W3C//DTD SVG 1.1//EN" "http://www.w3.org/Graphics/SVG/1.1/DTD/svg11.dtd"><svg xmlns="http://www.w3.org/2000/svg" xmlns:xlink="http://www.w3.org/1999/xlink" width="350" height="1000" viewBox="0 0 14 40" >
            
                ['<path class="dot" d="M 7.790943877551021,-0.22280612244898207 L 7.79094387755102,-0.22280612244898207 C 7.34094387755102,-0.6728061224489821 6.64344387755102,-0.6728061224489822 6.1934438775510205,-0.22280612244898207 L 5.608443877551021,0.3621938775510183 C 5.15844387755102,0.8121938775510182 5.15844387755102,1.5096938775510182 5.608443877551021,1.9596938775510184 L 6.21594387755102,2.567193877551018 C 6.66594387755102,3.0171938775510174 7.3634438775510205,3.0171938775510174 7.81344387755102,2.567193877551018 L 8.39844387755102,1.9596938775510184 C 8.84844387755102,1.5096938775510182 8.84844387755102,0.8121938775510182 8.39844387755102,0.36219387755101806 L 7.790943877551021,-0.2228061224489819" stroke-linejoin="round"/>', '<path class="dot" d="M 5.790943877551021,-0.22280612244898207 L 5.79094387755102,-0.22280612244898207 C 5.34094387755102,-0.6728061224489821 4.64344387755102,-0.6728061224489822 4.1934438775510205,-0.22280612244898207 L 3.60844387755102,0.3621938775510183 C 3.1584438775510204,0.8121938775510182 3.15844387755102,1.5096938775510182 3.60844387755102,1.9596938775510184 L 4.21594387755102,2.567193877551018 C 4.66594387755102,3.0171938775510174 5.3634438775510205,3.0171938775510174 5.81344387755102,2.567193877551018 L 6.398443877551021,1.9596938775510184 C 6.84844387755102,1.5096938775510182 6.84844387755102,0.8121938775510182 6.398443877551021,0.36219387755101806 L 5.790943877551021,-0.2228061224489819" stroke-linejoin="round"/>', '<path class="dot" d="M 4.790943877551021,0.7771938775510179 L 4.79094387755102,0.7771938775510179 C 4.34094387755102,0.3271938775510179 3.64344387755102,0.3271938775510178 3.19344387755102,0.7771938775510179 L 2.60844387755102,1.3621938775510183 C 2.1584438775510204,1.8121938775510182 2.15844387755102,2.509693877551018 2.60844387755102,2.959693877551018 L 3.21594387755102,3.567193877551018 C 3.66594387755102,4.017193877551017 4.3634438775510205,4.017193877551017 4.81344387755102,3.567193877551018 L 5.398443877551021,2.959693877551018 C 5.84844387755102,2.509693877551018 5.84844387755102,1.8121938775510182 5.398443877551021,1.362193877551018 L 4.790943877551021,0.7771938775510181" stroke-linejoin="round"/>', '<path class="dot" d="M 3.7909438775510207,2.7771938775510177 L 3.79094387755102,2.7771938775510177 C 3.3409438775510196,2.327193877551018 2.64344387755102,2.3271938775510175 2.19344387755102,2.7771938775510177 L 1.60844387755102,3.362193877551018 C 1.15844387755102,3.8121938775510182 1.15844387755102,4.509693877551018 1.60844387755102,4.959693877551018 L 2.2159438775510196,5.567193877551018 C 2.66594387755102,6.017193877551017 3.3634438775510196,6.017193877551017 3.8134438775510198,5.567193877551018 L 4.398443877551021,4.959693877551018 C 4.84844387755102,4.509693877551018 4.84844387755102,3.8121938775510182 4.398443877551021,3.362193877551018 L 3.7909438775510207,2.777193877551018" stroke-linejoin="round"/>', '<path class="dot" d="M 2.7909438775510207,7.777193877551018 L 2.79094387755102,7.777193877551018 C 2.3409438775510196,7.327193877551018 1.6434438775510198,7.327193877551018 1.19344387755102,7.777193877551018 L 0.6084438775510199,8.362193877551018 C 0.15844387755101996,8.812193877551017 0.15844387755101985,9.509693877551019 0.6084438775510199,9.959693877551018 L 1.2159438775510198,10.567193877551018 C 1.6659438775510198,11.017193877551017 2.3634438775510196,11.017193877551017 2.8134438775510198,10.567193877551018 L 3.3984438775510206,9.959693877551018 C 3.84844387755102,9.509693877551019 3.84844387755102,8.812193877551017 3.3984438775510206,8.362193877551018 L 2.7909438775510207,7.777193877551018" stroke-linejoin="round"/>', '<path class="dot" d="M 2.7909438775510207,12.777193877551019 L 2.79094387755102,12.777193877551019 C 2.3409438775510196,12.327193877551018 1.6434438775510198,12.327193877551018 1.19344387755102,12.777193877551019 L 0.6084438775510199,13.362193877551018 C 0.15844387755101996,13.81219387755102 0.15844387755101985,14.509693877551019 0.6084438775510199,14.959693877551018 L 1.2159438775510198,15.567193877551018 C 1.6659438775510198,16.01719387755102 2.3634438775510196,16.01719387755102 2.8134438775510198,15.567193877551018 L 3.3984438775510206,14.959693877551018 C 3.84844387755102,14.509693877551019 3.84844387755102,13.81219387755102 3.3984438775510206,13.362193877551018 L 2.7909438775510207,12.777193877551019" stroke-linejoin="round"/>', '<path class="dot" d="M 3.7909438775510207,17.777193877551017 L 3.79094387755102,17.777193877551017 C 3.3409438775510196,17.327193877551018 2.64344387755102,17.327193877551018 2.19344387755102,17.777193877551017 L 1.60844387755102,18.362193877551018 C 1.15844387755102,18.812193877551017 1.15844387755102,19.50969387755102 1.60844387755102,19.959693877551018 L 2.2159438775510196,20.56719387755102 C 2.66594387755102,21.01719387755102 3.3634438775510196,21.01719387755102 3.8134438775510198,20.56719387755102 L 4.398443877551021,19.959693877551018 C 4.84844387755102,19.50969387755102 4.84844387755102,18.812193877551017 4.398443877551021,18.362193877551018 L 3.7909438775510207,17.777193877551017" stroke-linejoin="round"/>', '<path class="dot" d="M 4.790943877551021,19.777193877551017 L 4.79094387755102,19.777193877551017 C 4.34094387755102,19.327193877551018 3.64344387755102,19.327193877551018 3.19344387755102,19.777193877551017 L 2.60844387755102,20.362193877551018 C 2.1584438775510204,20.812193877551017 2.15844387755102,21.50969387755102 2.60844387755102,21.959693877551018 L 3.21594387755102,22.56719387755102 C 3.66594387755102,23.01719387755102 4.3634438775510205,23.01719387755102 4.81344387755102,22.56719387755102 L 5.398443877551021,21.959693877551018 C 5.84844387755102,21.50969387755102 5.84844387755102,20.812193877551017 5.398443877551021,20.362193877551018 L 4.790943877551021,19.777193877551017" stroke-linejoin="round"/>', '<path class="dot" d="M 5.790943877551021,20.777193877551017 L 5.79094387755102,20.777193877551017 C 5.34094387755102,20.327193877551018 4.64344387755102,20.327193877551018 4.1934438775510205,20.777193877551017 L 3.60844387755102,21.362193877551018 C 3.1584438775510204,21.812193877551017 3.15844387755102,22.50969387755102 3.60844387755102,22.959693877551018 L 4.21594387755102,23.56719387755102 C 4.66594387755102,24.01719387755102 5.3634438775510205,24.01719387755102 5.81344387755102,23.56719387755102 L 6.398443877551021,22.959693877551018 C 6.84844387755102,22.50969387755102 6.84844387755102,21.812193877551017 6.398443877551021,21.362193877551018 L 5.790943877551021,20.777193877551017" stroke-linejoin="round"/>', '<path class="dot" d="M 7.790943877551021,-0.22280612244898207 L 7.79094387755102,-0.22280612244898207 C 7.34094387755102,-0.6728061224489821 6.64344387755102,-0.6728061224489822 6.1934438775510205,-0.22280612244898207 L 5.608443877551021,0.3621938775510183 C 5.15844387755102,0.8121938775510182 5.15844387755102,1.5096938775510182 5.608443877551021,1.9596938775510184 L 6.21594387755102,2.567193877551018 C 6.66594387755102,3.0171938775510174 7.3634438775510205,3.0171938775510174 7.81344387755102,2.567193877551018 L 8.39844387755102,1.9596938775510184 C 8.84844387755102,1.5096938775510182 8.84844387755102,0.8121938775510182 8.39844387755102,0.36219387755101806 L 7.790943877551021,-0.2228061224489819" stroke-linejoin="round"/>', '<path class="dot" d="M 7.790943877551021,-0.22280612244898207 L 7.79094387755102,-0.22280612244898207 C 7.34094387755102,-0.6728061224489821 6.64344387755102,-0.6728061224489822 6.1934438775510205,-0.22280612244898207 L 5.608443877551021,0.3621938775510183 C 5.15844387755102,0.8121938775510182 5.15844387755102,1.5096938775510182 5.608443877551021,1.9596938775510184 L 6.21594387755102,2.567193877551018 C 6.66594387755102,3.0171938775510174 7.3634438775510205,3.0171938775510174 7.81344387755102,2.567193877551018 L 8.39844387755102,1.9596938775510184 C 8.84844387755102,1.5096938775510182 8.84844387755102,0.8121938775510182 8.39844387755102,0.36219387755101806 L 7.790943877551021,-0.2228061224489819" stroke-linejoin="round"/>', '<path class="dot" d="M 7.790943877551021,9.777193877551019 L 7.79094387755102,9.777193877551019 C 7.34094387755102,9.327193877551018 6.64344387755102,9.327193877551018 6.1934438775510205,9.777193877551019 L 5.608443877551021,10.362193877551018 C 5.15844387755102,10.81219387755102 5.15844387755102,11.509693877551019 5.608443877551021,11.959693877551018 L 6.21594387755102,12.567193877551018 C 6.66594387755102,13.01719387755102 7.3634438775510205,13.01719387755102 7.81344387755102,12.567193877551018 L 8.39844387755102,11.959693877551018 C 8.84844387755102,11.509693877551019 8.84844387755102,10.81219387755102 8.39844387755102,10.362193877551018 L 7.790943877551021,9.777193877551019" stroke-linejoin="round"/>', '<path class="dot" d="M 7.790943877551021,20.777193877551017 L 7.79094387755102,20.777193877551017 C 7.34094387755102,20.327193877551018 6.64344387755102,20.327193877551018 6.1934438775510205,20.777193877551017 L 5.608443877551021,21.362193877551018 C 5.15844387755102,21.812193877551017 5.15844387755102,22.50969387755102 5.608443877551021,22.959693877551018 L 6.21594387755102,23.56719387755102 C 6.66594387755102,24.01719387755102 7.3634438775510205,24.01719387755102 7.81344387755102,23.56719387755102 L 8.39844387755102,22.959693877551018 C 8.84844387755102,22.50969387755102 8.84844387755102,21.812193877551017 8.39844387755102,21.362193877551018 L 7.790943877551021,20.777193877551017" stroke-linejoin="round"/>', '<path class="dot" d="M 12.790943877551019,20.777193877551017 L 12.790943877551019,20.777193877551017 C 12.34094387755102,20.327193877551018 11.64344387755102,20.327193877551018 11.193443877551019,20.777193877551017 L 10.60844387755102,21.362193877551018 C 10.158443877551019,21.812193877551017 10.158443877551019,22.50969387755102 10.60844387755102,22.959693877551018 L 11.21594387755102,23.56719387755102 C 11.665943877551019,24.01719387755102 12.363443877551019,24.01719387755102 12.81344387755102,23.56719387755102 L 13.39844387755102,22.959693877551018 C 13.84844387755102,22.50969387755102 13.84844387755102,21.812193877551017 13.39844387755102,21.362193877551018 L 12.790943877551019,20.777193877551017" stroke-linejoin="round"/>']
            
            
            <path d="M 7.0,1.0 L 5.0,1.0 L 4.0,2.0 L 3.0,4.0 L 2.0,9.0 L 2.0,14.0 L 3.0,19.0 L 4.0,21.0 L 5.0,22.0 L 7.0,22.0 M 7.0,1.0 L 7.0,22.0 M 7.0,1.0 L 12.0,1.0 M 7.0,11.0 L 10.0,11.0 M 7.0,22.0 L 12.0,22.0" fill="none"
            stroke="black"
            stroke-width="2.5"
            stroke-linecap="round"
            stroke-linejoin="round"
            />
            
            
        </svg>