<?xml version="1.0"?><!DOCTYPE svg PUBLIC "-//W3C//DTD SVG 1.1//EN" "http://www.w3.org/Graphics/SVG/1.1/DTD/svg11.dtd"><svg xmlns="http://www.w3.org/2000/svg" xmlns:xlink="http://www.w3.org/1999/xlink" width="350" height="1000" viewBox="0 0 14 40" >
            
                ['<path class="dot" d="M 7.790943877551021,-0.22280612244898207 L 7.79094387755102,-0.22280612244898207 C 7.34094387755102,-0.6728061224489821 6.64344387755102,-0.6728061224489822 6.1934438775510205,-0.22280612244898207 L 5.608443877551021,0.3621938775510183 C 5.15844387755102,0.8121938775510182 5.15844387755102,1.5096938775510182 5.608443877551021,1.9596938775510184 L 6.21594387755102,2.567193877551018 C 6.66594387755102,3.0171938775510174 7.3634438775510205,3.0171938775510174 7.81344387755102,2.567193877551018 L 8.39844387755102,1.9596938775510184 C 8.84844387755102,1.5096938775510182 8.84844387755102,0.8121938775510182 8.39844387755102,0.36219387755101806 L 7.790943877551021,-0.2228061224489819" stroke-linejoin="round"/>', '<path class="dot" d="M 7.790943877551021,27.777193877551017 L 7.79094387755102,27.777193877551017 C 7.34094387755102,27.327193877551018 6.64344387755102,27.327193877551018 6.1934438775510205,27.777193877551017 L 5.608443877551021,28.362193877551018 C 5.15844387755102,28.812193877551017 5.15844387755102,29.50969387755102 5.608443877551021,29.959693877551018 L 6.21594387755102,30.56719387755102 C 6.66594387755102,31.01719387755102 7.3634438775510205,31.01719387755102 7.81344387755102,30.56719387755102 L 8.39844387755102,29.959693877551018 C 8.84844387755102,29.50969387755102 8.84844387755102,28.812193877551017 8.39844387755102,28.362193877551018 L 7.790943877551021,27.777193877551017" stroke-linejoin="round"/>']
            
            
            <path d="M 7.0,1.0 L 7.0,29.0" fill="none"
            stroke="black"
            stroke-width="2.5"
            stroke-linecap="round"
            stroke-linejoin="round"
            />
            
            
        </svg>