<?xml version="1.0" encoding="UTF-8" standalone="no"?>
<svg
   xmlns:dc="http://purl.org/dc/elements/1.1/"
   xmlns:cc="http://creativecommons.org/ns#"
   xmlns:rdf="http://www.w3.org/1999/02/22-rdf-syntax-ns#"
   xmlns:svg="http://www.w3.org/2000/svg"
   xmlns="http://www.w3.org/2000/svg"
   xmlns:sodipodi="http://sodipodi.sourceforge.net/DTD/sodipodi-0.dtd"
   xmlns:inkscape="http://www.inkscape.org/namespaces/inkscape"
   data-dec="121"
   width="10"
   height="26"
   version="1.1"
   id="svg9619"
   sodipodi:docname="y-excpt.svg"
   inkscape:version="0.92.2 5c3e80d, 2017-08-06">
  <metadata
     id="metadata9625">
    <rdf:RDF>
      <cc:Work
         rdf:about="">
        <dc:format>image/svg+xml</dc:format>
        <dc:type
           rdf:resource="http://purl.org/dc/dcmitype/StillImage" />
        <dc:title></dc:title>
      </cc:Work>
    </rdf:RDF>
  </metadata>
  <defs
     id="defs9623" />
  <sodipodi:namedview
     pagecolor="#ffffff"
     bordercolor="#666666"
     borderopacity="1"
     objecttolerance="10"
     gridtolerance="10"
     guidetolerance="10"
     inkscape:pageopacity="0"
     inkscape:pageshadow="2"
     inkscape:window-width="1389"
     inkscape:window-height="781"
     id="namedview9621"
     showgrid="true"
     showguides="true"
     inkscape:guide-bbox="true"
     inkscape:zoom="33.37544"
     inkscape:cx="3.7829129"
     inkscape:cy="23.423648"
     inkscape:window-x="53"
     inkscape:window-y="84"
     inkscape:window-maximized="0"
     inkscape:current-layer="svg9619">
    <inkscape:grid
       type="xygrid"
       id="grid10170" />
    <sodipodi:guide
       position="12,11"
       orientation="0,1"
       id="guide10172"
       inkscape:locked="false" />
    <sodipodi:guide
       position="13,21"
       orientation="0,1"
       id="guide10174"
       inkscape:locked="false" />
    <sodipodi:guide
       position="14,7"
       orientation="0,1"
       id="guide10176"
       inkscape:locked="false" />
    <sodipodi:guide
       position="12,25"
       orientation="0,1"
       id="guide3045"
       inkscape:locked="false" />
  </sodipodi:namedview>
  <path
     d="M 3,0 2,3 1,4 H 0"
     style="fill:none;stroke:none;stroke-width:1.42857134;stroke-linecap:round;stroke-linejoin:round"
     id="path9617"
     inkscape:connector-curvature="0"
     sodipodi:nodetypes="cccc" />
</svg>
