<?xml version="1.0"?><!DOCTYPE svg PUBLIC "-//W3C//DTD SVG 1.1//EN" "http://www.w3.org/Graphics/SVG/1.1/DTD/svg11.dtd"><svg xmlns="http://www.w3.org/2000/svg" xmlns:xlink="http://www.w3.org/1999/xlink" width="350" height="1000" viewBox="0 0 7 17" >
            
                ['<path class="dot" d="M 3.385,0.31800000000000006 L 3.385,0.31800000000000006 C 3.1649999999999996,0.09799999999999998 2.824,0.09799999999999995 2.6039999999999996,0.31800000000000006 L 2.3179999999999996,0.6040000000000002 C 2.0979999999999994,0.8240000000000002 2.0979999999999994,1.1650000000000003 2.3179999999999996,1.3850000000000002 L 2.6149999999999993,1.682 C 2.8349999999999995,1.902 3.1759999999999997,1.902 3.3959999999999995,1.682 L 3.682,1.3850000000000002 C 3.902,1.165 3.902,0.8240000000000002 3.682,0.6040000000000001 L 3.385,0.31800000000000006" stroke-linejoin="round"/>', '<path class="dot" d="M 2.385,1.318 L 2.385,1.318 C 2.165,1.0979999999999999 1.8239999999999998,1.0979999999999999 1.6039999999999999,1.318 L 1.3179999999999998,1.604 C 1.0979999999999999,1.8240000000000003 1.0979999999999996,2.165 1.3179999999999998,2.3850000000000002 L 1.6149999999999998,2.682 C 1.8349999999999997,2.902 2.176,2.902 2.396,2.682 L 2.6820000000000004,2.3850000000000002 C 2.902,2.165 2.902,1.8240000000000003 2.6820000000000004,1.604 L 2.385,1.318" stroke-linejoin="round"/>', '<path class="dot" d="M 1.385,0.31800000000000006 L 1.3849999999999998,0.31800000000000006 C 1.1649999999999998,0.09799999999999998 0.8239999999999998,0.09799999999999995 0.6039999999999999,0.31800000000000006 L 0.31799999999999984,0.6040000000000002 C 0.09799999999999975,0.8240000000000002 0.09799999999999973,1.1650000000000003 0.31799999999999984,1.3850000000000002 L 0.6149999999999998,1.682 C 0.8349999999999997,1.902 1.176,1.902 1.3959999999999997,1.682 L 1.6820000000000002,1.3850000000000002 C 1.9020000000000001,1.165 1.9020000000000001,0.8240000000000002 1.6820000000000002,0.6040000000000001 L 1.385,0.31800000000000006" stroke-linejoin="round"/>', '<path class="dot" d="M 2.385,-0.6819999999999999 L 2.385,-0.6819999999999999 C 2.165,-0.902 1.8239999999999998,-0.902 1.6039999999999999,-0.6819999999999999 L 1.3179999999999998,-0.3959999999999998 C 1.0979999999999999,-0.17599999999999982 1.0979999999999996,0.16500000000000026 1.3179999999999998,0.38500000000000023 L 1.6149999999999998,0.6819999999999999 C 1.8349999999999997,0.9019999999999999 2.176,0.9019999999999999 2.396,0.6819999999999999 L 2.6820000000000004,0.38500000000000023 C 2.902,0.16500000000000004 2.902,-0.17599999999999982 2.6820000000000004,-0.3959999999999999 L 2.385,-0.6819999999999999" stroke-linejoin="round"/>', '<path class="dot" d="M 3.385,0.31800000000000006 L 3.385,0.31800000000000006 C 3.1649999999999996,0.09799999999999998 2.824,0.09799999999999995 2.6039999999999996,0.31800000000000006 L 2.3179999999999996,0.6040000000000002 C 2.0979999999999994,0.8240000000000002 2.0979999999999994,1.1650000000000003 2.3179999999999996,1.3850000000000002 L 2.6149999999999993,1.682 C 2.8349999999999995,1.902 3.1759999999999997,1.902 3.3959999999999995,1.682 L 3.682,1.3850000000000002 C 3.902,1.165 3.902,0.8240000000000002 3.682,0.6040000000000001 L 3.385,0.31800000000000006" stroke-linejoin="round"/>', '<path class="dot" d="M 3.385,2.318 L 3.385,2.318 C 3.1649999999999996,2.098 2.824,2.098 2.6039999999999996,2.318 L 2.3179999999999996,2.604 C 2.0979999999999994,2.8240000000000003 2.0979999999999994,3.165 2.3179999999999996,3.3850000000000002 L 2.6149999999999993,3.682 C 2.8349999999999995,3.902 3.1759999999999997,3.902 3.3959999999999995,3.682 L 3.682,3.3850000000000002 C 3.902,3.165 3.902,2.8240000000000003 3.682,2.604 L 3.385,2.318" stroke-linejoin="round"/>', '<path class="dot" d="M 1.385,4.3180000000000005 L 1.3849999999999998,4.3180000000000005 C 1.1649999999999998,4.098000000000001 0.8239999999999998,4.098000000000001 0.6039999999999999,4.3180000000000005 L 0.31799999999999984,4.604000000000001 C 0.09799999999999975,4.824000000000001 0.09799999999999973,5.165000000000001 0.31799999999999984,5.385000000000001 L 0.6149999999999998,5.682 C 0.8349999999999997,5.902 1.176,5.902 1.3959999999999997,5.682 L 1.6820000000000002,5.385000000000001 C 1.9020000000000001,5.165000000000001 1.9020000000000001,4.824000000000001 1.6820000000000002,4.604000000000001 L 1.385,4.3180000000000005" stroke-linejoin="round"/>']
            
                ['<path class="dot" d="M 7.385,0.31800000000000006 L 7.385,0.31800000000000006 C 7.164999999999999,0.09799999999999998 6.824,0.09799999999999995 6.603999999999999,0.31800000000000006 L 6.318,0.6040000000000002 C 6.098,0.8240000000000002 6.098,1.1650000000000003 6.318,1.3850000000000002 L 6.614999999999999,1.682 C 6.834999999999999,1.902 7.176,1.902 7.395999999999999,1.682 L 7.682,1.3850000000000002 C 7.902,1.165 7.902,0.8240000000000002 7.682,0.6040000000000001 L 7.385,0.31800000000000006" stroke-linejoin="round"/>', '<path class="dot" d="M 6.385,1.318 L 6.385,1.318 C 6.164999999999999,1.0979999999999999 5.824,1.0979999999999999 5.603999999999999,1.318 L 5.318,1.604 C 5.098,1.8240000000000003 5.098,2.165 5.318,2.3850000000000002 L 5.614999999999999,2.682 C 5.834999999999999,2.902 6.176,2.902 6.395999999999999,2.682 L 6.682,2.3850000000000002 C 6.902,2.165 6.902,1.8240000000000003 6.682,1.604 L 6.385,1.318" stroke-linejoin="round"/>', '<path class="dot" d="M 5.385,0.31800000000000006 L 5.385,0.31800000000000006 C 5.164999999999999,0.09799999999999998 4.824,0.09799999999999995 4.603999999999999,0.31800000000000006 L 4.318,0.6040000000000002 C 4.098,0.8240000000000002 4.098,1.1650000000000003 4.318,1.3850000000000002 L 4.614999999999999,1.682 C 4.834999999999999,1.902 5.176,1.902 5.395999999999999,1.682 L 5.682,1.3850000000000002 C 5.902,1.165 5.902,0.8240000000000002 5.682,0.6040000000000001 L 5.385,0.31800000000000006" stroke-linejoin="round"/>', '<path class="dot" d="M 6.385,-0.6819999999999999 L 6.385,-0.6819999999999999 C 6.164999999999999,-0.902 5.824,-0.902 5.603999999999999,-0.6819999999999999 L 5.318,-0.3959999999999998 C 5.098,-0.17599999999999982 5.098,0.16500000000000026 5.318,0.38500000000000023 L 5.614999999999999,0.6819999999999999 C 5.834999999999999,0.9019999999999999 6.176,0.9019999999999999 6.395999999999999,0.6819999999999999 L 6.682,0.38500000000000023 C 6.902,0.16500000000000004 6.902,-0.17599999999999982 6.682,-0.3959999999999999 L 6.385,-0.6819999999999999" stroke-linejoin="round"/>', '<path class="dot" d="M 7.385,0.31800000000000006 L 7.385,0.31800000000000006 C 7.164999999999999,0.09799999999999998 6.824,0.09799999999999995 6.603999999999999,0.31800000000000006 L 6.318,0.6040000000000002 C 6.098,0.8240000000000002 6.098,1.1650000000000003 6.318,1.3850000000000002 L 6.614999999999999,1.682 C 6.834999999999999,1.902 7.176,1.902 7.395999999999999,1.682 L 7.682,1.3850000000000002 C 7.902,1.165 7.902,0.8240000000000002 7.682,0.6040000000000001 L 7.385,0.31800000000000006" stroke-linejoin="round"/>', '<path class="dot" d="M 7.385,2.318 L 7.385,2.318 C 7.164999999999999,2.098 6.824,2.098 6.603999999999999,2.318 L 6.318,2.604 C 6.098,2.8240000000000003 6.098,3.165 6.318,3.3850000000000002 L 6.614999999999999,3.682 C 6.834999999999999,3.902 7.176,3.902 7.395999999999999,3.682 L 7.682,3.3850000000000002 C 7.902,3.165 7.902,2.8240000000000003 7.682,2.604 L 7.385,2.318" stroke-linejoin="round"/>', '<path class="dot" d="M 5.385,4.3180000000000005 L 5.385,4.3180000000000005 C 5.164999999999999,4.098000000000001 4.824,4.098000000000001 4.603999999999999,4.3180000000000005 L 4.318,4.604000000000001 C 4.098,4.824000000000001 4.098,5.165000000000001 4.318,5.385000000000001 L 4.614999999999999,5.682 C 4.834999999999999,5.902 5.176,5.902 5.395999999999999,5.682 L 5.682,5.385000000000001 C 5.902,5.165000000000001 5.902,4.824000000000001 5.682,4.604000000000001 L 5.385,4.3180000000000005" stroke-linejoin="round"/>']
            
            
            <path d="M 3.0,1.0 L 2.0,2.0 L 1.0,1.0 L 2.0,0.0 L 3.0,1.0 L 3.0,3.0 L 1.0,5.0" fill="none"
            stroke="black"
            stroke-width="1"
            stroke-linecap="round"
            stroke-linejoin="round"
            />
            
            <path d="M 7.0,1.0 L 6.0,2.0 L 5.0,1.0 L 6.0,0.0 L 7.0,1.0 L 7.0,3.0 L 5.0,5.0" fill="none"
            stroke="black"
            stroke-width="1"
            stroke-linecap="round"
            stroke-linejoin="round"
            />
            
            
        </svg>