<?xml version="1.0"?><!DOCTYPE svg PUBLIC "-//W3C//DTD SVG 1.1//EN" "http://www.w3.org/Graphics/SVG/1.1/DTD/svg11.dtd"><svg xmlns="http://www.w3.org/2000/svg" xmlns:xlink="http://www.w3.org/1999/xlink" width="350" height="1000" viewBox="0 0 7 17" >
            
                ['<path class="dot" d="M 4.385,0.31800000000000006 L 4.385,0.31800000000000006 C 4.164999999999999,0.09799999999999998 3.824,0.09799999999999995 3.6039999999999996,0.31800000000000006 L 3.3179999999999996,0.6040000000000002 C 3.0979999999999994,0.8240000000000002 3.0979999999999994,1.1650000000000003 3.3179999999999996,1.3850000000000002 L 3.6149999999999993,1.682 C 3.8349999999999995,1.902 4.176,1.902 4.395999999999999,1.682 L 4.682,1.3850000000000002 C 4.902,1.165 4.902,0.8240000000000002 4.682,0.6040000000000001 L 4.385,0.31800000000000006" stroke-linejoin="round"/>', '<path class="dot" d="M 4.385,9.318 L 4.385,9.318 C 4.164999999999999,9.098 3.824,9.098 3.6039999999999996,9.318 L 3.3179999999999996,9.604000000000001 C 3.0979999999999994,9.824 3.0979999999999994,10.165000000000001 3.3179999999999996,10.385000000000002 L 3.6149999999999993,10.682 C 3.8349999999999995,10.902000000000001 4.176,10.902000000000001 4.395999999999999,10.682 L 4.682,10.385000000000002 C 4.902,10.165000000000001 4.902,9.824 4.682,9.604000000000001 L 4.385,9.318000000000001" stroke-linejoin="round"/>', '<path class="dot" d="M 5.3850001,10.318 L 5.3850001,10.318 C 5.1650001,10.098 4.8240001,10.098 4.6040000999999995,10.318 L 4.3180001,10.604000000000001 C 4.0980001,10.824 4.0980001,11.165000000000001 4.3180001,11.385000000000002 L 4.6150001,11.682 C 4.8350001,11.902000000000001 5.1760000999999995,11.902000000000001 5.3960001,11.682 L 5.6820001,11.385000000000002 C 5.9020001,11.165000000000001 5.9020001,10.824 5.6820001,10.604000000000001 L 5.3850001,10.318000000000001" stroke-linejoin="round"/>', '<path class="dot" d="M 6.385,10.318 L 6.385,10.318 C 6.164999999999999,10.098 5.824,10.098 5.603999999999999,10.318 L 5.318,10.604000000000001 C 5.098,10.824 5.098,11.165000000000001 5.318,11.385000000000002 L 5.614999999999999,11.682 C 5.834999999999999,11.902000000000001 6.176,11.902000000000001 6.395999999999999,11.682 L 6.682,11.385000000000002 C 6.902,11.165000000000001 6.902,10.824 6.682,10.604000000000001 L 6.385,10.318000000000001" stroke-linejoin="round"/>']
            
                ['<path class="dot" d="M 2.385,3.318 L 2.385,3.318 C 2.165,3.098 1.8239999999999998,3.098 1.6039999999999999,3.318 L 1.3179999999999998,3.604 C 1.0979999999999999,3.8240000000000003 1.0979999999999996,4.165 1.3179999999999998,4.385 L 1.6149999999999998,4.682 C 1.8349999999999997,4.902 2.176,4.902 2.396,4.682 L 2.6820000000000004,4.385 C 2.902,4.165 2.902,3.8240000000000003 2.6820000000000004,3.604 L 2.385,3.318" stroke-linejoin="round"/>', '<path class="dot" d="M 6.385,3.318 L 6.385,3.318 C 6.164999999999999,3.098 5.824,3.098 5.603999999999999,3.318 L 5.318,3.604 C 5.098,3.8240000000000003 5.098,4.165 5.318,4.385 L 5.614999999999999,4.682 C 5.834999999999999,4.902 6.176,4.902 6.395999999999999,4.682 L 6.682,4.385 C 6.902,4.165 6.902,3.8240000000000003 6.682,3.604 L 6.385,3.318" stroke-linejoin="round"/>']
            
            
            <path d="M 4.0,1.0 L 4.0,10.0 L 5.0000001,11.0 L 6.0,11.0" fill="none"
            stroke="black"
            stroke-width="1"
            stroke-linecap="round"
            stroke-linejoin="round"
            />
            
            <path d="M 2.0,4.0 L 6.0,4.0" fill="none"
            stroke="black"
            stroke-width="1"
            stroke-linecap="round"
            stroke-linejoin="round"
            />
            
            
        </svg>