<?xml version="1.0"?><!DOCTYPE svg PUBLIC "-//W3C//DTD SVG 1.1//EN" "http://www.w3.org/Graphics/SVG/1.1/DTD/svg11.dtd"><svg xmlns="http://www.w3.org/2000/svg" xmlns:xlink="http://www.w3.org/1999/xlink" width="350" height="1000" viewBox="0 0 14 40" >
            
                ['<path class="dot" d="M 11.790943777551018,-0.22280612244898207 L 11.790943777551018,-0.22280612244898207 C 11.340943777551018,-0.6728061224489821 10.643443777551019,-0.6728061224489822 10.193443777551018,-0.22280612244898207 L 9.608443777551019,0.3621938775510183 C 9.158443777551017,0.8121938775510182 9.158443777551017,1.5096938775510182 9.608443777551019,1.9596938775510184 L 10.215943777551018,2.567193877551018 C 10.665943777551018,3.0171938775510174 11.363443777551018,3.0171938775510174 11.813443777551019,2.567193877551018 L 12.39844377755102,1.9596938775510184 C 12.848443777551019,1.5096938775510182 12.848443777551019,0.8121938775510182 12.39844377755102,0.36219387755101806 L 11.790943777551018,-0.2228061224489819" stroke-linejoin="round"/>', '<path class="dot" d="M 3.7909438775510207,4.777193877551018 L 3.79094387755102,4.777193877551018 C 3.3409438775510196,4.327193877551018 2.64344387755102,4.327193877551018 2.19344387755102,4.777193877551018 L 1.60844387755102,5.362193877551018 C 1.15844387755102,5.812193877551018 1.15844387755102,6.509693877551018 1.60844387755102,6.959693877551018 L 2.2159438775510196,7.567193877551018 C 2.66594387755102,8.017193877551017 3.3634438775510196,8.017193877551017 3.8134438775510198,7.567193877551018 L 4.398443877551021,6.959693877551018 C 4.84844387755102,6.509693877551018 4.84844387755102,5.812193877551018 4.398443877551021,5.362193877551018 L 3.7909438775510207,4.777193877551018" stroke-linejoin="round"/>']
            
            
            <path d="M 10.999999899999999,1.0 L 3.0,6.0" fill="none"
            stroke="black"
            stroke-width="2.5"
            stroke-linecap="round"
            stroke-linejoin="round"
            />
            
            
        </svg>