<?xml version="1.0"?><!DOCTYPE svg PUBLIC "-//W3C//DTD SVG 1.1//EN" "http://www.w3.org/Graphics/SVG/1.1/DTD/svg11.dtd"><svg xmlns="http://www.w3.org/2000/svg" xmlns:xlink="http://www.w3.org/1999/xlink" width="350" height="1000" viewBox="0 0 10 26" >
            
                ['<path class="dot" d="M 7.519583333333333,0.14027123333333244 L 7.519583333333332,0.14027123333333244 C 7.229583333333332,-0.1497287666666676 6.780083333333333,-0.14972876666666765 6.490083333333333,0.14027123333333244 L 6.113083333333333,0.5172712333333326 C 5.823083333333333,0.8072712333333325 5.823083333333333,1.2567712333333325 6.113083333333333,1.5467712333333326 L 6.504583333333333,1.9382712333333323 C 6.794583333333333,2.2282712333333325 7.244083333333332,2.2282712333333325 7.534083333333332,1.9382712333333323 L 7.911083333333333,1.5467712333333326 C 8.201083333333333,1.2567712333333325 8.201083333333333,0.8072712333333326 7.911083333333333,0.5172712333333325 L 7.519583333333333,0.14027123333333247" stroke-linejoin="round"/>', '<path class="dot" d="M 3.5195833333333333,2.1402708333333322 L 3.5195833333333333,2.1402708333333322 C 3.2295833333333333,1.8502708333333322 2.7800833333333332,1.8502708333333322 2.490083333333333,2.1402708333333322 L 2.113083333333333,2.5172708333333325 C 1.8230833333333332,2.807270833333332 1.8230833333333332,3.2567708333333325 2.113083333333333,3.5467708333333325 L 2.504583333333333,3.9382708333333323 C 2.7945833333333328,4.228270833333332 3.244083333333333,4.228270833333332 3.5340833333333332,3.9382708333333323 L 3.9110833333333335,3.5467708333333325 C 4.201083333333333,3.2567708333333325 4.201083333333333,2.8072708333333325 3.9110833333333335,2.517270833333332 L 3.5195833333333333,2.1402708333333322" stroke-linejoin="round"/>']
            
            
            <path d="M 7.0,1.0000003999999993 L 3.0,2.999999999999999" fill="none"
            stroke="black"
            stroke-width="1.5"
            stroke-linecap="round"
            stroke-linejoin="round"
            />
            
            
        </svg>