<?xml version="1.0"?><!DOCTYPE svg PUBLIC "-//W3C//DTD SVG 1.1//EN" "http://www.w3.org/Graphics/SVG/1.1/DTD/svg11.dtd"><svg xmlns="http://www.w3.org/2000/svg" xmlns:xlink="http://www.w3.org/1999/xlink" width="350" height="1000" viewBox="0 0 7 17" >
            
                ['<path class="dot" d="M 7.385,5.3180000000000005 L 7.385,5.3180000000000005 C 7.164999999999999,5.098000000000001 6.824,5.098000000000001 6.603999999999999,5.3180000000000005 L 6.318,5.604000000000001 C 6.098,5.824000000000001 6.098,6.165000000000001 6.318,6.385000000000001 L 6.614999999999999,6.682 C 6.834999999999999,6.902 7.176,6.902 7.395999999999999,6.682 L 7.682,6.385000000000001 C 7.902,6.165000000000001 7.902,5.824000000000001 7.682,5.604000000000001 L 7.385,5.3180000000000005" stroke-linejoin="round"/>', '<path class="dot" d="M 7.385,4.3180000000000005 L 7.385,4.3180000000000005 C 7.164999999999999,4.098000000000001 6.824,4.098000000000001 6.603999999999999,4.3180000000000005 L 6.318,4.604000000000001 C 6.098,4.824000000000001 6.098,5.165000000000001 6.318,5.385000000000001 L 6.614999999999999,5.682 C 6.834999999999999,5.902 7.176,5.902 7.395999999999999,5.682 L 7.682,5.385000000000001 C 7.902,5.165000000000001 7.902,4.824000000000001 7.682,4.604000000000001 L 7.385,4.3180000000000005" stroke-linejoin="round"/>', '<path class="dot" d="M 6.385,3.318 L 6.385,3.318 C 6.164999999999999,3.098 5.824,3.098 5.603999999999999,3.318 L 5.318,3.604 C 5.098,3.8240000000000003 5.098,4.165 5.318,4.385 L 5.614999999999999,4.682 C 5.834999999999999,4.902 6.176,4.902 6.395999999999999,4.682 L 6.682,4.385 C 6.902,4.165 6.902,3.8240000000000003 6.682,3.604 L 6.385,3.318" stroke-linejoin="round"/>', '<path class="dot" d="M 5.385,4.3180000000000005 L 5.385,4.3180000000000005 C 5.164999999999999,4.098000000000001 4.824,4.098000000000001 4.603999999999999,4.3180000000000005 L 4.318,4.604000000000001 C 4.098,4.824000000000001 4.098,5.165000000000001 4.318,5.385000000000001 L 4.614999999999999,5.682 C 4.834999999999999,5.902 5.176,5.902 5.395999999999999,5.682 L 5.682,5.385000000000001 C 5.902,5.165000000000001 5.902,4.824000000000001 5.682,4.604000000000001 L 5.385,4.3180000000000005" stroke-linejoin="round"/>', '<path class="dot" d="M 4.385,9.318 L 4.385,9.318 C 4.164999999999999,9.098 3.824,9.098 3.6039999999999996,9.318 L 3.3179999999999996,9.604000000000001 C 3.0979999999999994,9.824 3.0979999999999994,10.165000000000001 3.3179999999999996,10.385000000000002 L 3.6149999999999993,10.682 C 3.8349999999999995,10.902000000000001 4.176,10.902000000000001 4.395999999999999,10.682 L 4.682,10.385000000000002 C 4.902,10.165000000000001 4.902,9.824 4.682,9.604000000000001 L 4.385,9.318000000000001" stroke-linejoin="round"/>', '<path class="dot" d="M 3.385,10.318 L 3.385,10.318 C 3.1649999999999996,10.098 2.824,10.098 2.6039999999999996,10.318 L 2.3179999999999996,10.604000000000001 C 2.0979999999999994,10.824 2.0979999999999994,11.165000000000001 2.3179999999999996,11.385000000000002 L 2.6149999999999993,11.682 C 2.8349999999999995,11.902000000000001 3.1759999999999997,11.902000000000001 3.3959999999999995,11.682 L 3.682,11.385000000000002 C 3.902,11.165000000000001 3.902,10.824 3.682,10.604000000000001 L 3.385,10.318000000000001" stroke-linejoin="round"/>', '<path class="dot" d="M 2.385,10.318 L 2.385,10.318 C 2.165,10.098 1.8239999999999998,10.098 1.6039999999999999,10.318 L 1.3179999999999998,10.604000000000001 C 1.0979999999999999,10.824 1.0979999999999996,11.165000000000001 1.3179999999999998,11.385000000000002 L 1.6149999999999998,11.682 C 1.8349999999999997,11.902000000000001 2.176,11.902000000000001 2.396,11.682 L 2.6820000000000004,11.385000000000002 C 2.902,11.165000000000001 2.902,10.824 2.6820000000000004,10.604000000000001 L 2.385,10.318000000000001" stroke-linejoin="round"/>', '<path class="dot" d="M 1.385,8.318 L 1.3849999999999998,8.318 C 1.1649999999999998,8.098 0.8239999999999998,8.098 0.6039999999999999,8.318 L 0.31799999999999984,8.604000000000001 C 0.09799999999999975,8.824 0.09799999999999973,9.165000000000001 0.31799999999999984,9.385000000000002 L 0.6149999999999998,9.682 C 0.8349999999999997,9.902000000000001 1.176,9.902000000000001 1.3959999999999997,9.682 L 1.6820000000000002,9.385000000000002 C 1.9020000000000001,9.165000000000001 1.9020000000000001,8.824 1.6820000000000002,8.604000000000001 L 1.385,8.318000000000001" stroke-linejoin="round"/>', '<path class="dot" d="M 1.385,6.3180000000000005 L 1.3849999999999998,6.3180000000000005 C 1.1649999999999998,6.098000000000001 0.8239999999999998,6.098000000000001 0.6039999999999999,6.3180000000000005 L 0.31799999999999984,6.604000000000001 C 0.09799999999999975,6.824000000000001 0.09799999999999973,7.165000000000001 0.31799999999999984,7.385000000000001 L 0.6149999999999998,7.682 C 0.8349999999999997,7.902 1.176,7.902 1.3959999999999997,7.682 L 1.6820000000000002,7.385000000000001 C 1.9020000000000001,7.165000000000001 1.9020000000000001,6.824000000000001 1.6820000000000002,6.604000000000001 L 1.385,6.3180000000000005" stroke-linejoin="round"/>', '<path class="dot" d="M 4.385,3.318 L 4.385,3.318 C 4.164999999999999,3.098 3.824,3.098 3.6039999999999996,3.318 L 3.3179999999999996,3.604 C 3.0979999999999994,3.8240000000000003 3.0979999999999994,4.165 3.3179999999999996,4.385 L 3.6149999999999993,4.682 C 3.8349999999999995,4.902 4.176,4.902 4.395999999999999,4.682 L 4.682,4.385 C 4.902,4.165 4.902,3.8240000000000003 4.682,3.604 L 4.385,3.318" stroke-linejoin="round"/>', '<path class="dot" d="M 4.385,1.318 L 4.385,1.318 C 4.164999999999999,1.0979999999999999 3.824,1.0979999999999999 3.6039999999999996,1.318 L 3.3179999999999996,1.604 C 3.0979999999999994,1.8240000000000003 3.0979999999999994,2.165 3.3179999999999996,2.3850000000000002 L 3.6149999999999993,2.682 C 3.8349999999999995,2.902 4.176,2.902 4.395999999999999,2.682 L 4.682,2.3850000000000002 C 4.902,2.165 4.902,1.8240000000000003 4.682,1.604 L 4.385,1.318" stroke-linejoin="round"/>', '<path class="dot" d="M 3.385,0.31800000000000006 L 3.385,0.31800000000000006 C 3.1649999999999996,0.09799999999999998 2.824,0.09799999999999995 2.6039999999999996,0.31800000000000006 L 2.3179999999999996,0.6040000000000002 C 2.0979999999999994,0.8240000000000002 2.0979999999999994,1.1650000000000003 2.3179999999999996,1.3850000000000002 L 2.6149999999999993,1.682 C 2.8349999999999995,1.902 3.1759999999999997,1.902 3.3959999999999995,1.682 L 3.682,1.3850000000000002 C 3.902,1.165 3.902,0.8240000000000002 3.682,0.6040000000000001 L 3.385,0.31800000000000006" stroke-linejoin="round"/>', '<path class="dot" d="M 2.385,1.318 L 2.385,1.318 C 2.165,1.0979999999999999 1.8239999999999998,1.0979999999999999 1.6039999999999999,1.318 L 1.3179999999999998,1.604 C 1.0979999999999999,1.8240000000000003 1.0979999999999996,2.165 1.3179999999999998,2.3850000000000002 L 1.6149999999999998,2.682 C 1.8349999999999997,2.902 2.176,2.902 2.396,2.682 L 2.6820000000000004,2.3850000000000002 C 2.902,2.165 2.902,1.8240000000000003 2.6820000000000004,1.604 L 2.385,1.318" stroke-linejoin="round"/>', '<path class="dot" d="M 2.385,2.318 L 2.385,2.318 C 2.165,2.098 1.8239999999999998,2.098 1.6039999999999999,2.318 L 1.3179999999999998,2.604 C 1.0979999999999999,2.8240000000000003 1.0979999999999996,3.165 1.3179999999999998,3.3850000000000002 L 1.6149999999999998,3.682 C 1.8349999999999997,3.902 2.176,3.902 2.396,3.682 L 2.6820000000000004,3.3850000000000002 C 2.902,3.165 2.902,2.8240000000000003 2.6820000000000004,2.604 L 2.385,2.318" stroke-linejoin="round"/>', '<path class="dot" d="M 5.385,10.318 L 5.385,10.318 C 5.164999999999999,10.098 4.824,10.098 4.603999999999999,10.318 L 4.318,10.604000000000001 C 4.098,10.824 4.098,11.165000000000001 4.318,11.385000000000002 L 4.614999999999999,11.682 C 4.834999999999999,11.902000000000001 5.176,11.902000000000001 5.395999999999999,11.682 L 5.682,11.385000000000002 C 5.902,11.165000000000001 5.902,10.824 5.682,10.604000000000001 L 5.385,10.318000000000001" stroke-linejoin="round"/>', '<path class="dot" d="M 6.385,10.318 L 6.385,10.318 C 6.164999999999999,10.098 5.824,10.098 5.603999999999999,10.318 L 5.318,10.604000000000001 C 5.098,10.824 5.098,11.165000000000001 5.318,11.385000000000002 L 5.614999999999999,11.682 C 5.834999999999999,11.902000000000001 6.176,11.902000000000001 6.395999999999999,11.682 L 6.682,11.385000000000002 C 6.902,11.165000000000001 6.902,10.824 6.682,10.604000000000001 L 6.385,10.318000000000001" stroke-linejoin="round"/>', '<path class="dot" d="M 7.385,9.318 L 7.385,9.318 C 7.164999999999999,9.098 6.824,9.098 6.603999999999999,9.318 L 6.318,9.604000000000001 C 6.098,9.824 6.098,10.165000000000001 6.318,10.385000000000002 L 6.614999999999999,10.682 C 6.834999999999999,10.902000000000001 7.176,10.902000000000001 7.395999999999999,10.682 L 7.682,10.385000000000002 C 7.902,10.165000000000001 7.902,9.824 7.682,9.604000000000001 L 7.385,9.318000000000001" stroke-linejoin="round"/>', '<path class="dot" d="M 7.385,8.318 L 7.385,8.318 C 7.164999999999999,8.098 6.824,8.098 6.603999999999999,8.318 L 6.318,8.604000000000001 C 6.098,8.824 6.098,9.165000000000001 6.318,9.385000000000002 L 6.614999999999999,9.682 C 6.834999999999999,9.902000000000001 7.176,9.902000000000001 7.395999999999999,9.682 L 7.682,9.385000000000002 C 7.902,9.165000000000001 7.902,8.824 7.682,8.604000000000001 L 7.385,8.318000000000001" stroke-linejoin="round"/>']
            
            
            <path d="M 7.0,6.0 L 7.0,5.0 L 6.0,4.0 L 5.0,5.0 L 4.0,10.0 L 3.0,11.0 L 2.0,11.0 L 1.0,9.0 L 1.0,7.0 L 4.0,4.0 L 4.0,2.0 L 3.0,1.0 L 2.0,2.0 L 2.0,3.0 L 5.0,11.0 L 6.0,11.0 L 7.0,10.0 L 7.0,9.0" fill="none"
            stroke="black"
            stroke-width="1"
            stroke-linecap="round"
            stroke-linejoin="round"
            />
            
            
        </svg>