<?xml version="1.0"?><!DOCTYPE svg PUBLIC "-//W3C//DTD SVG 1.1//EN" "http://www.w3.org/Graphics/SVG/1.1/DTD/svg11.dtd"><svg xmlns="http://www.w3.org/2000/svg" xmlns:xlink="http://www.w3.org/1999/xlink" width="350" height="1000" viewBox="0 0 7 17" >
            
                ['<path class="dot" d="M 6.385,2.318 L 6.385,2.318 C 6.164999999999999,2.098 5.824,2.098 5.603999999999999,2.318 L 5.318,2.604 C 5.098,2.8240000000000003 5.098,3.165 5.318,3.3850000000000002 L 5.614999999999999,3.682 C 5.834999999999999,3.902 6.176,3.902 6.395999999999999,3.682 L 6.682,3.3850000000000002 C 6.902,3.165 6.902,2.8240000000000003 6.682,2.604 L 6.385,2.318" stroke-linejoin="round"/>', '<path class="dot" d="M 4.385,0.31800000000000006 L 4.385,0.31800000000000006 C 4.164999999999999,0.09799999999999998 3.824,0.09799999999999995 3.6039999999999996,0.31800000000000006 L 3.3179999999999996,0.6040000000000002 C 3.0979999999999994,0.8240000000000002 3.0979999999999994,1.1650000000000003 3.3179999999999996,1.3850000000000002 L 3.6149999999999993,1.682 C 3.8349999999999995,1.902 4.176,1.902 4.395999999999999,1.682 L 4.682,1.3850000000000002 C 4.902,1.165 4.902,0.8240000000000002 4.682,0.6040000000000001 L 4.385,0.31800000000000006" stroke-linejoin="round"/>', '<path class="dot" d="M 2.385,2.318 L 2.385,2.318 C 2.165,2.098 1.8239999999999998,2.098 1.6039999999999999,2.318 L 1.3179999999999998,2.604 C 1.0979999999999999,2.8240000000000003 1.0979999999999996,3.165 1.3179999999999998,3.3850000000000002 L 1.6149999999999998,3.682 C 1.8349999999999997,3.902 2.176,3.902 2.396,3.682 L 2.6820000000000004,3.3850000000000002 C 2.902,3.165 2.902,2.8240000000000003 2.6820000000000004,2.604 L 2.385,2.318" stroke-linejoin="round"/>', '<path class="dot" d="M 2.385,3.318 L 2.385,3.318 C 2.165,3.098 1.8239999999999998,3.098 1.6039999999999999,3.318 L 1.3179999999999998,3.604 C 1.0979999999999999,3.8240000000000003 1.0979999999999996,4.165 1.3179999999999998,4.385 L 1.6149999999999998,4.682 C 1.8349999999999997,4.902 2.176,4.902 2.396,4.682 L 2.6820000000000004,4.385 C 2.902,4.165 2.902,3.8240000000000003 2.6820000000000004,3.604 L 2.385,3.318" stroke-linejoin="round"/>', '<path class="dot" d="M 6.385,7.3180000000000005 L 6.385,7.3180000000000005 C 6.164999999999999,7.098000000000001 5.824,7.098000000000001 5.603999999999999,7.3180000000000005 L 5.318,7.604000000000001 C 5.098,7.824000000000001 5.098,8.165000000000001 5.318,8.385000000000002 L 5.614999999999999,8.682 C 5.834999999999999,8.902000000000001 6.176,8.902000000000001 6.395999999999999,8.682 L 6.682,8.385000000000002 C 6.902,8.165000000000001 6.902,7.824000000000001 6.682,7.604000000000001 L 6.385,7.3180000000000005" stroke-linejoin="round"/>', '<path class="dot" d="M 6.385,8.318 L 6.385,8.318 C 6.164999999999999,8.098 5.824,8.098 5.603999999999999,8.318 L 5.318,8.604000000000001 C 5.098,8.824 5.098,9.165000000000001 5.318,9.385000000000002 L 5.614999999999999,9.682 C 5.834999999999999,9.902000000000001 6.176,9.902000000000001 6.395999999999999,9.682 L 6.682,9.385000000000002 C 6.902,9.165000000000001 6.902,8.824 6.682,8.604000000000001 L 6.385,8.318000000000001" stroke-linejoin="round"/>', '<path class="dot" d="M 4.385,10.318 L 4.385,10.318 C 4.164999999999999,10.098 3.824,10.098 3.6039999999999996,10.318 L 3.3179999999999996,10.604000000000001 C 3.0979999999999994,10.824 3.0979999999999994,11.165000000000001 3.3179999999999996,11.385000000000002 L 3.6149999999999993,11.682 C 3.8349999999999995,11.902000000000001 4.176,11.902000000000001 4.395999999999999,11.682 L 4.682,11.385000000000002 C 4.902,11.165000000000001 4.902,10.824 4.682,10.604000000000001 L 4.385,10.318000000000001" stroke-linejoin="round"/>', '<path class="dot" d="M 2.385,8.318 L 2.385,8.318 C 2.165,8.098 1.8239999999999998,8.098 1.6039999999999999,8.318 L 1.3179999999999998,8.604000000000001 C 1.0979999999999999,8.824 1.0979999999999996,9.165000000000001 1.3179999999999998,9.385000000000002 L 1.6149999999999998,9.682 C 1.8349999999999997,9.902000000000001 2.176,9.902000000000001 2.396,9.682 L 2.6820000000000004,9.385000000000002 C 2.902,9.165000000000001 2.902,8.824 2.6820000000000004,8.604000000000001 L 2.385,8.318000000000001" stroke-linejoin="round"/>']
            
                ['<path class="dot" d="M 5.385,-0.6819999999999999 L 5.385,-0.6819999999999999 C 5.164999999999999,-0.902 4.824,-0.902 4.603999999999999,-0.6819999999999999 L 4.318,-0.3959999999999998 C 4.098,-0.17599999999999982 4.098,0.16500000000000026 4.318,0.38500000000000023 L 4.614999999999999,0.6819999999999999 C 4.834999999999999,0.9019999999999999 5.176,0.9019999999999999 5.395999999999999,0.6819999999999999 L 5.682,0.38500000000000023 C 5.902,0.16500000000000004 5.902,-0.17599999999999982 5.682,-0.3959999999999999 L 5.385,-0.6819999999999999" stroke-linejoin="round"/>', '<path class="dot" d="M 3.385,-0.6819999999999999 L 3.385,-0.6819999999999999 C 3.1649999999999996,-0.902 2.824,-0.902 2.6039999999999996,-0.6819999999999999 L 2.3179999999999996,-0.3959999999999998 C 2.0979999999999994,-0.17599999999999982 2.0979999999999994,0.16500000000000026 2.3179999999999996,0.38500000000000023 L 2.6149999999999993,0.6819999999999999 C 2.8349999999999995,0.9019999999999999 3.1759999999999997,0.9019999999999999 3.3959999999999995,0.6819999999999999 L 3.682,0.38500000000000023 C 3.902,0.16500000000000004 3.902,-0.17599999999999982 3.682,-0.3959999999999999 L 3.385,-0.6819999999999999" stroke-linejoin="round"/>', '<path class="dot" d="M 3.385,12.318 L 3.385,12.318 C 3.1649999999999996,12.098 2.824,12.098 2.6039999999999996,12.318 L 2.3179999999999996,12.604000000000001 C 2.0979999999999994,12.824 2.0979999999999994,13.165000000000001 2.3179999999999996,13.385000000000002 L 2.6149999999999993,13.682 C 2.8349999999999995,13.902000000000001 3.1759999999999997,13.902000000000001 3.3959999999999995,13.682 L 3.682,13.385000000000002 C 3.902,13.165000000000001 3.902,12.824 3.682,12.604000000000001 L 3.385,12.318000000000001" stroke-linejoin="round"/>']
            
            
            <path d="M 6.0,3.0 L 4.0,1.0 L 2.0,3.0 L 2.0,4.0 L 6.0,8.0 L 6.0,9.0 L 4.0,11.0 L 2.0,9.0" fill="none"
            stroke="black"
            stroke-width="1"
            stroke-linecap="round"
            stroke-linejoin="round"
            />
            
            <path d="M 5.0,0.0 L 5.0,13.0 M 3.0,0.0 L 3.0,13.0" fill="none"
            stroke="black"
            stroke-width="1"
            stroke-linecap="round"
            stroke-linejoin="round"
            />
            
            
        </svg>