<?xml version="1.0" encoding="UTF-8" standalone="no"?>
<svg
   width="6"
   height="14"
   viewBox="0 0 6 14"
   version="1.1"
   id="svg25"
   xml:space="preserve"
   sodipodi:docname="k-cap-excpt.svg"
   inkscape:version="1.3.1 (9b9bdc1480, 2023-11-25, custom)"
   xmlns:inkscape="http://www.inkscape.org/namespaces/inkscape"
   xmlns:sodipodi="http://sodipodi.sourceforge.net/DTD/sodipodi-0.dtd"
   xmlns="http://www.w3.org/2000/svg"
   xmlns:svg="http://www.w3.org/2000/svg"><sodipodi:namedview
   id="namedview1"
   pagecolor="#ffffff"
   bordercolor="#999999"
   borderopacity="1"
   inkscape:showpageshadow="2"
   inkscape:pageopacity="0"
   inkscape:pagecheckerboard="0"
   inkscape:deskcolor="#d1d1d1"
   showgrid="true"
   inkscape:zoom="14.571429"
   inkscape:cx="-17.705882"
   inkscape:cy="8.0980392"
   inkscape:window-width="1878"
   inkscape:window-height="1016"
   inkscape:window-x="0"
   inkscape:window-y="0"
   inkscape:window-maximized="1"
   inkscape:current-layer="svg25"><inkscape:grid
     id="grid1"
     units="px"
     originx="0"
     originy="14"
     spacingx="1"
     spacingy="1"
     empcolor="#0099e5"
     empopacity="0.30196078"
     color="#0099e5"
     opacity="0.14901961"
     empspacing="5"
     dotted="false"
     gridanglex="30"
     gridanglez="30"
     visible="true" /></sodipodi:namedview><defs
   id="defs25" />
            
                ['', '']
            
                ['', '', '', '', '', '', '', '', '', '']
            
                ['', '', '', '', '', '', '', '', '', '']
            
            
            <path
   style="fill:#000000;stroke-width:1.99937"
   d="M 6,0 0,9 m 2,-3 4,8"
   id="path2"
   sodipodi:nodetypes="cccc" /></svg>
