<?xml version="1.0"?><!DOCTYPE svg PUBLIC "-//W3C//DTD SVG 1.1//EN" "http://www.w3.org/Graphics/SVG/1.1/DTD/svg11.dtd"><svg xmlns="http://www.w3.org/2000/svg" xmlns:xlink="http://www.w3.org/1999/xlink" width="350" height="1000" viewBox="0 0 14 40" >
            
                ['<path class="dot" d="M 11.790943877551019,3.7771938775510177 L 11.790943877551019,3.7771938775510177 C 11.34094387755102,3.327193877551018 10.64344387755102,3.3271938775510175 10.193443877551019,3.7771938775510177 L 9.60844387755102,4.362193877551018 C 9.158443877551019,4.812193877551018 9.158443877551019,5.509693877551018 9.60844387755102,5.959693877551018 L 10.21594387755102,6.567193877551018 C 10.665943877551019,7.017193877551017 11.363443877551019,7.017193877551017 11.81344387755102,6.567193877551018 L 12.39844387755102,5.959693877551018 C 12.84844387755102,5.509693877551018 12.84844387755102,4.812193877551018 12.39844387755102,4.362193877551018 L 11.790943877551019,3.777193877551018" stroke-linejoin="round"/>', '<path class="dot" d="M 7.790943877551021,-0.22280612244898207 L 7.79094387755102,-0.22280612244898207 C 7.34094387755102,-0.6728061224489821 6.64344387755102,-0.6728061224489822 6.1934438775510205,-0.22280612244898207 L 5.608443877551021,0.3621938775510183 C 5.15844387755102,0.8121938775510182 5.15844387755102,1.5096938775510182 5.608443877551021,1.9596938775510184 L 6.21594387755102,2.567193877551018 C 6.66594387755102,3.0171938775510174 7.3634438775510205,3.0171938775510174 7.81344387755102,2.567193877551018 L 8.39844387755102,1.9596938775510184 C 8.84844387755102,1.5096938775510182 8.84844387755102,0.8121938775510182 8.39844387755102,0.36219387755101806 L 7.790943877551021,-0.2228061224489819" stroke-linejoin="round"/>', '<path class="dot" d="M 3.7909438775510207,3.7771938775510177 L 3.79094387755102,3.7771938775510177 C 3.3409438775510196,3.327193877551018 2.64344387755102,3.3271938775510175 2.19344387755102,3.7771938775510177 L 1.60844387755102,4.362193877551018 C 1.15844387755102,4.812193877551018 1.15844387755102,5.509693877551018 1.60844387755102,5.959693877551018 L 2.2159438775510196,6.567193877551018 C 2.66594387755102,7.017193877551017 3.3634438775510196,7.017193877551017 3.8134438775510198,6.567193877551018 L 4.398443877551021,5.959693877551018 C 4.84844387755102,5.509693877551018 4.84844387755102,4.812193877551018 4.398443877551021,4.362193877551018 L 3.7909438775510207,3.777193877551018" stroke-linejoin="round"/>']
            
            
            <path d="M 11.0,5.0 L 7.0,1.0 L 3.0,5.0" fill="none"
            stroke="black"
            stroke-width="2.5"
            stroke-linecap="round"
            stroke-linejoin="round"
            />
            
            
        </svg>