<?xml version="1.0"?><!DOCTYPE svg PUBLIC "-//W3C//DTD SVG 1.1//EN" "http://www.w3.org/Graphics/SVG/1.1/DTD/svg11.dtd"><svg xmlns="http://www.w3.org/2000/svg" xmlns:xlink="http://www.w3.org/1999/xlink" width="350" height="1000" viewBox="0 0 14 40" >
            
                ['<path class="dot" d="M 2.7909438775510207,-0.22280612244898207 L 2.79094387755102,-0.22280612244898207 C 2.3409438775510196,-0.6728061224489821 1.6434438775510198,-0.6728061224489822 1.19344387755102,-0.22280612244898207 L 0.6084438775510199,0.3621938775510183 C 0.15844387755101996,0.8121938775510182 0.15844387755101985,1.5096938775510182 0.6084438775510199,1.9596938775510184 L 1.2159438775510198,2.567193877551018 C 1.6659438775510198,3.0171938775510174 2.3634438775510196,3.0171938775510174 2.8134438775510198,2.567193877551018 L 3.3984438775510206,1.9596938775510184 C 3.84844387755102,1.5096938775510182 3.84844387755102,0.8121938775510182 3.3984438775510206,0.36219387755101806 L 2.7909438775510207,-0.2228061224489819" stroke-linejoin="round"/>', '<path class="dot" d="M 2.7909438775510207,14.777193877551019 L 2.79094387755102,14.777193877551019 C 2.3409438775510196,14.327193877551018 1.6434438775510198,14.327193877551018 1.19344387755102,14.777193877551019 L 0.6084438775510199,15.362193877551018 C 0.15844387755101996,15.81219387755102 0.15844387755101985,16.50969387755102 0.6084438775510199,16.959693877551018 L 1.2159438775510198,17.56719387755102 C 1.6659438775510198,18.01719387755102 2.3634438775510196,18.01719387755102 2.8134438775510198,17.56719387755102 L 3.3984438775510206,16.959693877551018 C 3.84844387755102,16.50969387755102 3.84844387755102,15.81219387755102 3.3984438775510206,15.362193877551018 L 2.7909438775510207,14.777193877551019" stroke-linejoin="round"/>', '<path class="dot" d="M 3.790942977551021,17.777193877551017 L 3.79094297755102,17.777193877551017 C 3.3409429775510198,17.327193877551018 2.64344297755102,17.327193877551018 2.1934429775510202,17.777193877551017 L 1.60844297755102,18.362193877551018 C 1.15844297755102,18.812193877551017 1.15844297755102,19.50969387755102 1.60844297755102,19.959693877551018 L 2.2159429775510198,20.56719387755102 C 2.66594297755102,21.01719387755102 3.3634429775510197,21.01719387755102 3.81344297755102,20.56719387755102 L 4.398442977551021,19.959693877551018 C 4.84844297755102,19.50969387755102 4.84844297755102,18.812193877551017 4.398442977551021,18.362193877551018 L 3.790942977551021,17.777193877551017" stroke-linejoin="round"/>', '<path class="dot" d="M 4.79094397755102,19.777193877551017 L 4.790943977551019,19.777193877551017 C 4.340943977551019,19.327193877551018 3.6434439775510192,19.327193877551018 3.1934439775510195,19.777193877551017 L 2.6084439775510195,20.362193877551018 C 2.15844397755102,20.812193877551017 2.1584439775510194,21.50969387755102 2.6084439775510195,21.959693877551018 L 3.2159439775510195,22.56719387755102 C 3.665943977551019,23.01719387755102 4.36344397755102,23.01719387755102 4.813443977551019,22.56719387755102 L 5.39844397755102,21.959693877551018 C 5.848443977551019,21.50969387755102 5.848443977551019,20.812193877551017 5.39844397755102,20.362193877551018 L 4.79094397755102,19.777193877551017" stroke-linejoin="round"/>', '<path class="dot" d="M 6.790943877551021,20.777193877551017 L 6.79094387755102,20.777193877551017 C 6.34094387755102,20.327193877551018 5.64344387755102,20.327193877551018 5.1934438775510205,20.777193877551017 L 4.608443877551021,21.362193877551018 C 4.15844387755102,21.812193877551017 4.15844387755102,22.50969387755102 4.608443877551021,22.959693877551018 L 5.21594387755102,23.56719387755102 C 5.66594387755102,24.01719387755102 6.3634438775510205,24.01719387755102 6.81344387755102,23.56719387755102 L 7.398443877551021,22.959693877551018 C 7.84844387755102,22.50969387755102 7.84844387755102,21.812193877551017 7.398443877551021,21.362193877551018 L 6.790943877551021,20.777193877551017" stroke-linejoin="round"/>', '<path class="dot" d="M 8.79094387755102,20.777193877551017 L 8.790943877551019,20.777193877551017 C 8.34094387755102,20.327193877551018 7.64344387755102,20.327193877551018 7.1934438775510205,20.777193877551017 L 6.608443877551021,21.362193877551018 C 6.15844387755102,21.812193877551017 6.15844387755102,22.50969387755102 6.608443877551021,22.959693877551018 L 7.21594387755102,23.56719387755102 C 7.66594387755102,24.01719387755102 8.36344387755102,24.01719387755102 8.81344387755102,23.56719387755102 L 9.39844387755102,22.959693877551018 C 9.84844387755102,22.50969387755102 9.84844387755102,21.812193877551017 9.39844387755102,21.362193877551018 L 8.79094387755102,20.777193877551017" stroke-linejoin="round"/>', '<path class="dot" d="M 10.79094397755102,19.777193877551017 L 10.790943977551018,19.777193877551017 C 10.340943977551019,19.327193877551018 9.64344397755102,19.327193877551018 9.193443977551018,19.777193877551017 L 8.608443977551019,20.362193877551018 C 8.158443977551018,20.812193877551017 8.158443977551018,21.50969387755102 8.608443977551019,21.959693877551018 L 9.215943977551019,22.56719387755102 C 9.665943977551018,23.01719387755102 10.363443977551018,23.01719387755102 10.813443977551017,22.56719387755102 L 11.398443977551018,21.959693877551018 C 11.84844397755102,21.50969387755102 11.84844397755102,20.812193877551017 11.398443977551018,20.362193877551018 L 10.79094397755102,19.777193877551017" stroke-linejoin="round"/>', '<path class="dot" d="M 11.790942977551019,17.777193877551017 L 11.790942977551019,17.777193877551017 C 11.34094297755102,17.327193877551018 10.64344297755102,17.327193877551018 10.193442977551019,17.777193877551017 L 9.60844297755102,18.362193877551018 C 9.158442977551019,18.812193877551017 9.158442977551019,19.50969387755102 9.60844297755102,19.959693877551018 L 10.21594297755102,20.56719387755102 C 10.665942977551019,21.01719387755102 11.363442977551019,21.01719387755102 11.81344297755102,20.56719387755102 L 12.39844297755102,19.959693877551018 C 12.84844297755102,19.50969387755102 12.84844297755102,18.812193877551017 12.39844297755102,18.362193877551018 L 11.790942977551019,17.777193877551017" stroke-linejoin="round"/>', '<path class="dot" d="M 12.790942977551019,14.777193877551019 L 12.790942977551019,14.777193877551019 C 12.34094297755102,14.327193877551018 11.64344297755102,14.327193877551018 11.193442977551019,14.777193877551019 L 10.60844297755102,15.362193877551018 C 10.158442977551019,15.81219387755102 10.158442977551019,16.50969387755102 10.60844297755102,16.959693877551018 L 11.21594297755102,17.56719387755102 C 11.665942977551019,18.01719387755102 12.363442977551019,18.01719387755102 12.81344297755102,17.56719387755102 L 13.39844297755102,16.959693877551018 C 13.84844297755102,16.50969387755102 13.84844297755102,15.81219387755102 13.39844297755102,15.362193877551018 L 12.790942977551019,14.777193877551019" stroke-linejoin="round"/>', '<path class="dot" d="M 12.790942977551019,-0.22280612244898207 L 12.790942977551019,-0.22280612244898207 C 12.34094297755102,-0.6728061224489821 11.64344297755102,-0.6728061224489822 11.193442977551019,-0.22280612244898207 L 10.60844297755102,0.3621938775510183 C 10.158442977551019,0.8121938775510182 10.158442977551019,1.5096938775510182 10.60844297755102,1.9596938775510184 L 11.21594297755102,2.567193877551018 C 11.665942977551019,3.0171938775510174 12.363442977551019,3.0171938775510174 12.81344297755102,2.567193877551018 L 13.39844297755102,1.9596938775510184 C 13.84844297755102,1.5096938775510182 13.84844297755102,0.8121938775510182 13.39844297755102,0.36219387755101806 L 12.790942977551019,-0.2228061224489819" stroke-linejoin="round"/>']
            
                ['<path class="dot" d="M 11.790943877551019,-4.222806122448982 L 11.790943877551019,-4.222806122448982 C 11.34094387755102,-4.672806122448982 10.64344387755102,-4.672806122448982 10.193443877551019,-4.222806122448982 L 9.60844387755102,-3.637806122448982 C 9.158443877551019,-3.1878061224489818 9.158443877551019,-2.490306122448982 9.60844387755102,-2.040306122448982 L 10.21594387755102,-1.4328061224489823 C 10.665943877551019,-0.9828061224489826 11.363443877551019,-0.9828061224489826 11.81344387755102,-1.4328061224489823 L 12.39844387755102,-2.040306122448982 C 12.84844387755102,-2.490306122448982 12.84844387755102,-3.1878061224489818 12.39844387755102,-3.637806122448982 L 11.790943877551019,-4.222806122448982" stroke-linejoin="round"/>', '<path class="dot" d="M 7.790943877551021,-8.222806122448981 L 7.79094387755102,-8.222806122448981 C 7.34094387755102,-8.672806122448982 6.64344387755102,-8.672806122448982 6.1934438775510205,-8.222806122448981 L 5.608443877551021,-7.637806122448981 C 5.15844387755102,-7.187806122448981 5.15844387755102,-6.490306122448981 5.608443877551021,-6.040306122448981 L 6.21594387755102,-5.432806122448982 C 6.66594387755102,-4.982806122448982 7.3634438775510205,-4.982806122448982 7.81344387755102,-5.432806122448982 L 8.39844387755102,-6.040306122448981 C 8.84844387755102,-6.490306122448981 8.84844387755102,-7.187806122448981 8.39844387755102,-7.637806122448981 L 7.790943877551021,-8.222806122448981" stroke-linejoin="round"/>', '<path class="dot" d="M 3.7909438775510207,-4.222806122448982 L 3.79094387755102,-4.222806122448982 C 3.3409438775510196,-4.672806122448982 2.64344387755102,-4.672806122448982 2.19344387755102,-4.222806122448982 L 1.60844387755102,-3.637806122448982 C 1.15844387755102,-3.1878061224489818 1.15844387755102,-2.490306122448982 1.60844387755102,-2.040306122448982 L 2.2159438775510196,-1.4328061224489823 C 2.66594387755102,-0.9828061224489826 3.3634438775510196,-0.9828061224489826 3.8134438775510198,-1.4328061224489823 L 4.398443877551021,-2.040306122448982 C 4.84844387755102,-2.490306122448982 4.84844387755102,-3.1878061224489818 4.398443877551021,-3.637806122448982 L 3.7909438775510207,-4.222806122448982" stroke-linejoin="round"/>']
            
            
            <path d="M 2.0,1.0 L 2.0,16.0 L 2.9999991,19.0 L 4.000000099999999,21.0 L 6.0,22.0 L 8.0,22.0 L 10.0000001,21.0 L 10.9999991,19.0 L 11.9999991,16.0 L 11.9999991,1.0" fill="none"
            stroke="black"
            stroke-width="2.5"
            stroke-linecap="round"
            stroke-linejoin="round"
            />
            
            <path d="M 11.0,-3.0 L 7.0,-7.0 L 3.0,-3.0" fill="none"
            stroke="black"
            stroke-width="2.5"
            stroke-linecap="round"
            stroke-linejoin="round"
            />
            
            
        </svg>