<?xml version="1.0"?><!DOCTYPE svg PUBLIC "-//W3C//DTD SVG 1.1//EN" "http://www.w3.org/Graphics/SVG/1.1/DTD/svg11.dtd"><svg xmlns="http://www.w3.org/2000/svg" xmlns:xlink="http://www.w3.org/1999/xlink" width="350" height="1000" viewBox="0 0 10 26" >
            
                ['<path class="dot" d="M 7.5195834333333345,13.140271433333332 L 7.519583433333334,13.140271433333332 C 7.2295834333333335,12.850271433333333 6.780083433333334,12.850271433333333 6.490083433333334,13.140271433333332 L 6.113083433333334,13.517271433333333 C 5.823083433333334,13.807271433333334 5.823083433333334,14.256771433333332 6.113083433333334,14.546771433333333 L 6.504583433333334,14.938271433333332 C 6.794583433333334,15.228271433333333 7.2440834333333335,15.228271433333333 7.5340834333333335,14.938271433333332 L 7.911083433333334,14.546771433333333 C 8.201083433333334,14.256771433333332 8.201083433333334,13.807271433333334 7.911083433333334,13.517271433333333 L 7.5195834333333345,13.140271433333332" stroke-linejoin="round"/>', '<path class="dot" d="M 8.519583433333334,11.140271333333333 L 8.519583433333334,11.140271333333333 C 8.229583433333334,10.850271333333334 7.780083433333334,10.850271333333334 7.490083433333334,11.140271333333333 L 7.113083433333334,11.517271333333333 C 6.823083433333334,11.807271333333333 6.823083433333334,12.256771333333333 7.113083433333334,12.546771333333334 L 7.504583433333334,12.938271333333333 C 7.794583433333334,13.228271333333334 8.244083433333333,13.228271333333334 8.534083433333334,12.938271333333333 L 8.911083433333335,12.546771333333334 C 9.201083433333334,12.256771333333333 9.201083433333334,11.807271333333334 8.911083433333335,11.517271333333333 L 8.519583433333334,11.140271333333333" stroke-linejoin="round"/>', '<path class="dot" d="M 8.519583433333334,7.140270833333333 L 8.519583433333334,7.140270833333333 C 8.229583433333334,6.850270833333333 7.780083433333334,6.850270833333333 7.490083433333334,7.140270833333333 L 7.113083433333334,7.517270833333333 C 6.823083433333334,7.807270833333333 6.823083433333334,8.256770833333333 7.113083433333334,8.546770833333333 L 7.504583433333334,8.938270833333332 C 7.794583433333334,9.228270833333333 8.244083433333333,9.228270833333333 8.534083433333334,8.938270833333332 L 8.911083433333335,8.546770833333333 C 9.201083433333334,8.256770833333333 9.201083433333334,7.807270833333333 8.911083433333335,7.517270833333333 L 8.519583433333334,7.140270833333333" stroke-linejoin="round"/>', '<path class="dot" d="M 7.5195834333333345,5.140270613333333 L 7.519583433333334,5.140270613333333 C 7.2295834333333335,4.850270613333333 6.780083433333334,4.850270613333333 6.490083433333334,5.140270613333333 L 6.113083433333334,5.5172706133333325 C 5.823083433333334,5.8072706133333325 5.823083433333334,6.256770613333332 6.113083433333334,6.546770613333333 L 6.504583433333334,6.938270613333332 C 6.794583433333334,7.228270613333333 7.2440834333333335,7.228270613333333 7.5340834333333335,6.938270613333332 L 7.911083433333334,6.546770613333333 C 8.201083433333334,6.256770613333332 8.201083433333334,5.8072706133333325 7.911083433333334,5.5172706133333325 L 7.5195834333333345,5.140270613333333" stroke-linejoin="round"/>', '<path class="dot" d="M 6.519583333333333,4.140270833333333 L 6.519583333333332,4.140270833333333 C 6.229583333333332,3.8502708333333326 5.780083333333333,3.8502708333333326 5.490083333333333,4.140270833333333 L 5.113083333333333,4.517270833333333 C 4.823083333333333,4.807270833333333 4.823083333333333,5.2567708333333325 5.113083333333333,5.546770833333333 L 5.504583333333333,5.938270833333332 C 5.794583333333333,6.228270833333333 6.244083333333332,6.228270833333333 6.534083333333332,5.938270833333332 L 6.911083333333333,5.546770833333333 C 7.201083333333333,5.2567708333333325 7.201083333333333,4.807270833333333 6.911083333333333,4.517270833333333 L 6.519583333333333,4.140270833333333" stroke-linejoin="round"/>', '<path class="dot" d="M 4.519583333333333,4.140270833333333 L 4.519583333333333,4.140270833333333 C 4.229583333333333,3.8502708333333326 3.7800833333333332,3.8502708333333326 3.490083333333333,4.140270833333333 L 3.113083333333333,4.517270833333333 C 2.823083333333333,4.807270833333333 2.823083333333333,5.2567708333333325 3.113083333333333,5.546770833333333 L 3.504583333333333,5.938270833333332 C 3.7945833333333328,6.228270833333333 4.244083333333333,6.228270833333333 4.534083333333333,5.938270833333332 L 4.911083333333334,5.546770833333333 C 5.201083333333333,5.2567708333333325 5.201083333333333,4.807270833333333 4.911083333333334,4.517270833333333 L 4.519583333333333,4.140270833333333" stroke-linejoin="round"/>', '<path class="dot" d="M 3.5195833333333333,5.140270613333333 L 3.5195833333333333,5.140270613333333 C 3.2295833333333333,4.850270613333333 2.7800833333333332,4.850270613333333 2.490083333333333,5.140270613333333 L 2.113083333333333,5.5172706133333325 C 1.8230833333333332,5.8072706133333325 1.8230833333333332,6.256770613333332 2.113083333333333,6.546770613333333 L 2.504583333333333,6.938270613333332 C 2.7945833333333328,7.228270613333333 3.244083333333333,7.228270613333333 3.5340833333333332,6.938270613333332 L 3.9110833333333335,6.546770613333333 C 4.201083333333333,6.256770613333332 4.201083333333333,5.8072706133333325 3.9110833333333335,5.5172706133333325 L 3.5195833333333333,5.140270613333333" stroke-linejoin="round"/>', '<path class="dot" d="M 2.5195833333333333,7.140270833333333 L 2.5195833333333333,7.140270833333333 C 2.2295833333333333,6.850270833333333 1.7800833333333332,6.850270833333333 1.4900833333333332,7.140270833333333 L 1.1130833333333332,7.517270833333333 C 0.8230833333333332,7.807270833333333 0.8230833333333331,8.256770833333333 1.1130833333333332,8.546770833333333 L 1.5045833333333332,8.938270833333332 C 1.794583333333333,9.228270833333333 2.244083333333333,9.228270833333333 2.5340833333333332,8.938270833333332 L 2.9110833333333335,8.546770833333333 C 3.2010833333333335,8.256770833333333 3.2010833333333335,7.807270833333333 2.9110833333333335,7.517270833333333 L 2.5195833333333333,7.140270833333333" stroke-linejoin="round"/>', '<path class="dot" d="M 2.5195833333333333,11.140271133333332 L 2.5195833333333333,11.140271133333332 C 2.2295833333333333,10.850271133333333 1.7800833333333332,10.850271133333333 1.4900833333333332,11.140271133333332 L 1.1130833333333332,11.517271133333333 C 0.8230833333333332,11.807271133333334 0.8230833333333331,12.256771133333332 1.1130833333333332,12.546771133333333 L 1.5045833333333332,12.938271133333332 C 1.794583333333333,13.228271133333333 2.244083333333333,13.228271133333333 2.5340833333333332,12.938271133333332 L 2.9110833333333335,12.546771133333333 C 3.2010833333333335,12.256771133333332 3.2010833333333335,11.807271133333334 2.9110833333333335,11.517271133333333 L 2.5195833333333333,11.140271133333332" stroke-linejoin="round"/>', '<path class="dot" d="M 3.5195833333333333,13.140271133333332 L 3.5195833333333333,13.140271133333332 C 3.2295833333333333,12.850271133333333 2.7800833333333332,12.850271133333333 2.490083333333333,13.140271133333332 L 2.113083333333333,13.517271133333333 C 1.8230833333333332,13.807271133333334 1.8230833333333332,14.256771133333332 2.113083333333333,14.546771133333333 L 2.504583333333333,14.938271133333332 C 2.7945833333333328,15.228271133333333 3.244083333333333,15.228271133333333 3.5340833333333332,14.938271133333332 L 3.9110833333333335,14.546771133333333 C 4.201083333333333,14.256771133333332 4.201083333333333,13.807271133333334 3.9110833333333335,13.517271133333333 L 3.5195833333333333,13.140271133333332" stroke-linejoin="round"/>', '<path class="dot" d="M 4.519583333333333,14.140270833333332 L 4.519583333333333,14.140270833333332 C 4.229583333333333,13.850270833333333 3.7800833333333332,13.850270833333333 3.490083333333333,14.140270833333332 L 3.113083333333333,14.517270833333333 C 2.823083333333333,14.807270833333334 2.823083333333333,15.256770833333333 3.113083333333333,15.546770833333333 L 3.504583333333333,15.938270833333332 C 3.7945833333333328,16.228270833333333 4.244083333333333,16.228270833333333 4.534083333333333,15.938270833333332 L 4.911083333333334,15.546770833333333 C 5.201083333333333,15.256770833333333 5.201083333333333,14.807270833333334 4.911083333333334,14.517270833333333 L 4.519583333333333,14.140270833333332" stroke-linejoin="round"/>', '<path class="dot" d="M 6.519583333333333,14.140270833333332 L 6.519583333333332,14.140270833333332 C 6.229583333333332,13.850270833333333 5.780083333333333,13.850270833333333 5.490083333333333,14.140270833333332 L 5.113083333333333,14.517270833333333 C 4.823083333333333,14.807270833333334 4.823083333333333,15.256770833333333 5.113083333333333,15.546770833333333 L 5.504583333333333,15.938270833333332 C 5.794583333333333,16.228270833333333 6.244083333333332,16.228270833333333 6.534083333333332,15.938270833333332 L 6.911083333333333,15.546770833333333 C 7.201083333333333,15.256770833333333 7.201083333333333,14.807270833333334 6.911083333333333,14.517270833333333 L 6.519583333333333,14.140270833333332" stroke-linejoin="round"/>', '<path class="dot" d="M 7.5195834333333345,13.140271433333332 L 7.519583433333334,13.140271433333332 C 7.2295834333333335,12.850271433333333 6.780083433333334,12.850271433333333 6.490083433333334,13.140271433333332 L 6.113083433333334,13.517271433333333 C 5.823083433333334,13.807271433333334 5.823083433333334,14.256771433333332 6.113083433333334,14.546771433333333 L 6.504583433333334,14.938271433333332 C 6.794583433333334,15.228271433333333 7.2440834333333335,15.228271433333333 7.5340834333333335,14.938271433333332 L 7.911083433333334,14.546771433333333 C 8.201083433333334,14.256771433333332 8.201083433333334,13.807271433333334 7.911083433333334,13.517271433333333 L 7.5195834333333345,13.140271433333332" stroke-linejoin="round"/>']
            
                ['<path class="dot" d="M 3.5349959961768387,0.11002217931886002 L 3.5349959961768382,0.11002217931886002 C 3.2449959961768386,-0.17997782068114002 2.7954959961768386,-0.17997782068114007 2.5054959961768386,0.11002217931886002 L 2.1284959961768384,0.48702217931886016 C 1.8384959961768386,0.7770221793188601 1.8384959961768386,1.22652217931886 2.1284959961768384,1.5165221793188601 L 2.5199959961768386,1.9080221793188599 C 2.8099959961768386,2.19802217931886 3.2594959961768386,2.19802217931886 3.549495996176838,1.9080221793188599 L 3.926495996176839,1.5165221793188601 C 4.216495996176839,1.22652217931886 4.216495996176839,0.7770221793188602 3.926495996176839,0.48702217931886005 L 3.534995996176839,0.11002217931886005" stroke-linejoin="round"/>', '<path class="dot" d="M 7.504170670489827,2.1705198873478047 L 7.5041706704898266,2.1705198873478047 C 7.2141706704898265,1.8805198873478046 6.764670670489827,1.8805198873478046 6.474670670489827,2.1705198873478047 L 6.097670670489827,2.547519887347805 C 5.807670670489827,2.8375198873478045 5.807670670489827,3.287019887347805 6.097670670489827,3.577019887347805 L 6.489170670489827,3.9685198873478047 C 6.779170670489827,4.258519887347805 7.2286706704898265,4.258519887347805 7.5186706704898265,3.9685198873478047 L 7.895670670489827,3.577019887347805 C 8.185670670489827,3.287019887347805 8.185670670489827,2.837519887347805 7.895670670489827,2.5475198873478044 L 7.504170670489827,2.1705198873478047" stroke-linejoin="round"/>']
            
            
            <path d="M 7.0000001,14.0000006 L 8.000000100000001,12.0000005 L 8.000000100000001,8.0 L 7.0000001,5.99999978 L 6.0,5.0 L 4.0,5.0 L 3.0,5.99999978 L 2.0,8.0 L 2.0,12.0000003 L 3.0,14.0000003 L 4.0,15.0 L 6.0,15.0 L 7.0000001,14.0000006" fill="none"
            stroke="black"
            stroke-width="1.5"
            stroke-linecap="round"
            stroke-linejoin="round"
            />
            
            <path d="M 3.0154126628435054,0.9697513459855269 L 6.984587337156494,3.0302490540144715" fill="none"
            stroke="black"
            stroke-width="1.5"
            stroke-linecap="round"
            stroke-linejoin="round"
            />
            
            
        </svg>