<?xml version="1.0"?><!DOCTYPE svg PUBLIC "-//W3C//DTD SVG 1.1//EN" "http://www.w3.org/Graphics/SVG/1.1/DTD/svg11.dtd"><svg xmlns="http://www.w3.org/2000/svg" xmlns:xlink="http://www.w3.org/1999/xlink" width="350" height="1000" viewBox="0 0 14 40" >
            
                ['<path class="dot" d="M 11.790943877551019,9.777193877551019 L 11.790943877551019,9.777193877551019 C 11.34094387755102,9.327193877551018 10.64344387755102,9.327193877551018 10.193443877551019,9.777193877551019 L 9.60844387755102,10.362193877551018 C 9.158443877551019,10.81219387755102 9.158443877551019,11.509693877551019 9.60844387755102,11.959693877551018 L 10.21594387755102,12.567193877551018 C 10.665943877551019,13.01719387755102 11.363443877551019,13.01719387755102 11.81344387755102,12.567193877551018 L 12.39844387755102,11.959693877551018 C 12.84844387755102,11.509693877551019 12.84844387755102,10.81219387755102 12.39844387755102,10.362193877551018 L 11.790943877551019,9.777193877551019" stroke-linejoin="round"/>', '<path class="dot" d="M 10.790943877551019,7.777193877551018 L 10.790943877551019,7.777193877551018 C 10.34094387755102,7.327193877551018 9.64344387755102,7.327193877551018 9.193443877551019,7.777193877551018 L 8.60844387755102,8.362193877551018 C 8.158443877551019,8.812193877551017 8.158443877551019,9.509693877551019 8.60844387755102,9.959693877551018 L 9.21594387755102,10.567193877551018 C 9.665943877551019,11.017193877551017 10.363443877551019,11.017193877551017 10.81344387755102,10.567193877551018 L 11.39844387755102,9.959693877551018 C 11.84844387755102,9.509693877551019 11.84844387755102,8.812193877551017 11.39844387755102,8.362193877551018 L 10.790943877551019,7.777193877551018" stroke-linejoin="round"/>', '<path class="dot" d="M 8.79094387755102,6.777193877551018 L 8.790943877551019,6.777193877551018 C 8.34094387755102,6.327193877551018 7.64344387755102,6.327193877551018 7.1934438775510205,6.777193877551018 L 6.608443877551021,7.362193877551018 C 6.15844387755102,7.812193877551018 6.15844387755102,8.509693877551019 6.608443877551021,8.959693877551018 L 7.21594387755102,9.567193877551018 C 7.66594387755102,10.017193877551017 8.36344387755102,10.017193877551017 8.81344387755102,9.567193877551018 L 9.39844387755102,8.959693877551018 C 9.84844387755102,8.509693877551019 9.84844387755102,7.812193877551018 9.39844387755102,7.362193877551018 L 8.79094387755102,6.777193877551018" stroke-linejoin="round"/>', '<path class="dot" d="M 6.790943877551021,6.777193877551018 L 6.79094387755102,6.777193877551018 C 6.34094387755102,6.327193877551018 5.64344387755102,6.327193877551018 5.1934438775510205,6.777193877551018 L 4.608443877551021,7.362193877551018 C 4.15844387755102,7.812193877551018 4.15844387755102,8.509693877551019 4.608443877551021,8.959693877551018 L 5.21594387755102,9.567193877551018 C 5.66594387755102,10.017193877551017 6.3634438775510205,10.017193877551017 6.81344387755102,9.567193877551018 L 7.398443877551021,8.959693877551018 C 7.84844387755102,8.509693877551019 7.84844387755102,7.812193877551018 7.398443877551021,7.362193877551018 L 6.790943877551021,6.777193877551018" stroke-linejoin="round"/>', '<path class="dot" d="M 4.790943877551021,7.777193877551018 L 4.79094387755102,7.777193877551018 C 4.34094387755102,7.327193877551018 3.64344387755102,7.327193877551018 3.19344387755102,7.777193877551018 L 2.60844387755102,8.362193877551018 C 2.1584438775510204,8.812193877551017 2.15844387755102,9.509693877551019 2.60844387755102,9.959693877551018 L 3.21594387755102,10.567193877551018 C 3.66594387755102,11.017193877551017 4.3634438775510205,11.017193877551017 4.81344387755102,10.567193877551018 L 5.398443877551021,9.959693877551018 C 5.84844387755102,9.509693877551019 5.84844387755102,8.812193877551017 5.398443877551021,8.362193877551018 L 4.790943877551021,7.777193877551018" stroke-linejoin="round"/>', '<path class="dot" d="M 2.7909438775510207,11.777193877551019 L 2.79094387755102,11.777193877551019 C 2.3409438775510196,11.327193877551018 1.6434438775510198,11.327193877551018 1.19344387755102,11.777193877551019 L 0.6084438775510199,12.362193877551018 C 0.15844387755101996,12.81219387755102 0.15844387755101985,13.509693877551019 0.6084438775510199,13.959693877551018 L 1.2159438775510198,14.567193877551018 C 1.6659438775510198,15.01719387755102 2.3634438775510196,15.01719387755102 2.8134438775510198,14.567193877551018 L 3.3984438775510206,13.959693877551018 C 3.84844387755102,13.509693877551019 3.84844387755102,12.81219387755102 3.3984438775510206,12.362193877551018 L 2.7909438775510207,11.777193877551019" stroke-linejoin="round"/>', '<path class="dot" d="M 2.7909438775510207,15.777193877551019 L 2.79094387755102,15.777193877551019 C 2.3409438775510196,15.327193877551018 1.6434438775510198,15.327193877551018 1.19344387755102,15.777193877551019 L 0.6084438775510199,16.362193877551018 C 0.15844387755101996,16.812193877551017 0.15844387755101985,17.50969387755102 0.6084438775510199,17.959693877551018 L 1.2159438775510198,18.56719387755102 C 1.6659438775510198,19.01719387755102 2.3634438775510196,19.01719387755102 2.8134438775510198,18.56719387755102 L 3.3984438775510206,17.959693877551018 C 3.84844387755102,17.50969387755102 3.84844387755102,16.812193877551017 3.3984438775510206,16.362193877551018 L 2.7909438775510207,15.777193877551019" stroke-linejoin="round"/>', '<path class="dot" d="M 4.790943877551021,19.777193877551017 L 4.79094387755102,19.777193877551017 C 4.34094387755102,19.327193877551018 3.64344387755102,19.327193877551018 3.19344387755102,19.777193877551017 L 2.60844387755102,20.362193877551018 C 2.1584438775510204,20.812193877551017 2.15844387755102,21.50969387755102 2.60844387755102,21.959693877551018 L 3.21594387755102,22.56719387755102 C 3.66594387755102,23.01719387755102 4.3634438775510205,23.01719387755102 4.81344387755102,22.56719387755102 L 5.398443877551021,21.959693877551018 C 5.84844387755102,21.50969387755102 5.84844387755102,20.812193877551017 5.398443877551021,20.362193877551018 L 4.790943877551021,19.777193877551017" stroke-linejoin="round"/>', '<path class="dot" d="M 6.790943877551021,20.777193877551017 L 6.79094387755102,20.777193877551017 C 6.34094387755102,20.327193877551018 5.64344387755102,20.327193877551018 5.1934438775510205,20.777193877551017 L 4.608443877551021,21.362193877551018 C 4.15844387755102,21.812193877551017 4.15844387755102,22.50969387755102 4.608443877551021,22.959693877551018 L 5.21594387755102,23.56719387755102 C 5.66594387755102,24.01719387755102 6.3634438775510205,24.01719387755102 6.81344387755102,23.56719387755102 L 7.398443877551021,22.959693877551018 C 7.84844387755102,22.50969387755102 7.84844387755102,21.812193877551017 7.398443877551021,21.362193877551018 L 6.790943877551021,20.777193877551017" stroke-linejoin="round"/>', '<path class="dot" d="M 8.79094387755102,20.777193877551017 L 8.790943877551019,20.777193877551017 C 8.34094387755102,20.327193877551018 7.64344387755102,20.327193877551018 7.1934438775510205,20.777193877551017 L 6.608443877551021,21.362193877551018 C 6.15844387755102,21.812193877551017 6.15844387755102,22.50969387755102 6.608443877551021,22.959693877551018 L 7.21594387755102,23.56719387755102 C 7.66594387755102,24.01719387755102 8.36344387755102,24.01719387755102 8.81344387755102,23.56719387755102 L 9.39844387755102,22.959693877551018 C 9.84844387755102,22.50969387755102 9.84844387755102,21.812193877551017 9.39844387755102,21.362193877551018 L 8.79094387755102,20.777193877551017" stroke-linejoin="round"/>', '<path class="dot" d="M 10.790943877551019,19.777193877551017 L 10.790943877551019,19.777193877551017 C 10.34094387755102,19.327193877551018 9.64344387755102,19.327193877551018 9.193443877551019,19.777193877551017 L 8.60844387755102,20.362193877551018 C 8.158443877551019,20.812193877551017 8.158443877551019,21.50969387755102 8.60844387755102,21.959693877551018 L 9.21594387755102,22.56719387755102 C 9.665943877551019,23.01719387755102 10.363443877551019,23.01719387755102 10.81344387755102,22.56719387755102 L 11.39844387755102,21.959693877551018 C 11.84844387755102,21.50969387755102 11.84844387755102,20.812193877551017 11.39844387755102,20.362193877551018 L 10.790943877551019,19.777193877551017" stroke-linejoin="round"/>', '<path class="dot" d="M 11.790943877551019,17.777193877551017 L 11.790943877551019,17.777193877551017 C 11.34094387755102,17.327193877551018 10.64344387755102,17.327193877551018 10.193443877551019,17.777193877551017 L 9.60844387755102,18.362193877551018 C 9.158443877551019,18.812193877551017 9.158443877551019,19.50969387755102 9.60844387755102,19.959693877551018 L 10.21594387755102,20.56719387755102 C 10.665943877551019,21.01719387755102 11.363443877551019,21.01719387755102 11.81344387755102,20.56719387755102 L 12.39844387755102,19.959693877551018 C 12.84844387755102,19.50969387755102 12.84844387755102,18.812193877551017 12.39844387755102,18.362193877551018 L 11.790943877551019,17.777193877551017" stroke-linejoin="round"/>']
            
                ['<path class="dot" d="M 7.790943877551021,20.777193877551017 L 7.79094387755102,20.777193877551017 C 7.34094387755102,20.327193877551018 6.64344387755102,20.327193877551018 6.1934438775510205,20.777193877551017 L 5.608443877551021,21.362193877551018 C 5.15844387755102,21.812193877551017 5.15844387755102,22.50969387755102 5.608443877551021,22.959693877551018 L 6.21594387755102,23.56719387755102 C 6.66594387755102,24.01719387755102 7.3634438775510205,24.01719387755102 7.81344387755102,23.56719387755102 L 8.39844387755102,22.959693877551018 C 8.84844387755102,22.50969387755102 8.84844387755102,21.812193877551017 8.39844387755102,21.362193877551018 L 7.790943877551021,20.777193877551017" stroke-linejoin="round"/>', '<path class="dot" d="M 7.790943877551021,22.777193877551017 L 7.79094387755102,22.777193877551017 C 7.34094387755102,22.327193877551018 6.64344387755102,22.327193877551018 6.1934438775510205,22.777193877551017 L 5.608443877551021,23.362193877551018 C 5.15844387755102,23.812193877551017 5.15844387755102,24.50969387755102 5.608443877551021,24.959693877551018 L 6.21594387755102,25.56719387755102 C 6.66594387755102,26.01719387755102 7.3634438775510205,26.01719387755102 7.81344387755102,25.56719387755102 L 8.39844387755102,24.959693877551018 C 8.84844387755102,24.50969387755102 8.84844387755102,23.812193877551017 8.39844387755102,23.362193877551018 L 7.790943877551021,22.777193877551017" stroke-linejoin="round"/>', '<path class="dot" d="M 9.79094387755102,24.777193877551017 L 9.790943877551019,24.777193877551017 C 9.34094387755102,24.327193877551018 8.64344387755102,24.327193877551018 8.19344387755102,24.777193877551017 L 7.608443877551021,25.362193877551018 C 7.15844387755102,25.812193877551017 7.15844387755102,26.50969387755102 7.608443877551021,26.959693877551018 L 8.21594387755102,27.56719387755102 C 8.66594387755102,28.01719387755102 9.36344387755102,28.01719387755102 9.81344387755102,27.56719387755102 L 10.39844387755102,26.959693877551018 C 10.84844387755102,26.50969387755102 10.84844387755102,25.812193877551017 10.39844387755102,25.362193877551018 L 9.79094387755102,24.777193877551017" stroke-linejoin="round"/>', '<path class="dot" d="M 7.790943877551021,26.777193877551017 L 7.79094387755102,26.777193877551017 C 7.34094387755102,26.327193877551018 6.64344387755102,26.327193877551018 6.1934438775510205,26.777193877551017 L 5.608443877551021,27.362193877551018 C 5.15844387755102,27.812193877551017 5.15844387755102,28.50969387755102 5.608443877551021,28.959693877551018 L 6.21594387755102,29.56719387755102 C 6.66594387755102,30.01719387755102 7.3634438775510205,30.01719387755102 7.81344387755102,29.56719387755102 L 8.39844387755102,28.959693877551018 C 8.84844387755102,28.50969387755102 8.84844387755102,27.812193877551017 8.39844387755102,27.362193877551018 L 7.790943877551021,26.777193877551017" stroke-linejoin="round"/>']
            
            
            <path d="M 11.0,11.0 L 10.0,9.0 L 8.0,8.0 L 6.0,8.0 L 4.0,9.0 L 2.0,13.0 L 2.0,17.0 L 4.0,21.0 L 6.0,22.0 L 8.0,22.0 L 10.0,21.0 L 11.0,19.0" fill="none"
            stroke="black"
            stroke-width="2.5"
            stroke-linecap="round"
            stroke-linejoin="round"
            />
            
            <path d="M 7.0,22.0 L 7.0,24.0 L 9.0,26.0 L 7.0,28.0" fill="none"
            stroke="black"
            stroke-width="2.5"
            stroke-linecap="round"
            stroke-linejoin="round"
            />
            
            
        </svg>