<?xml version="1.0"?><!DOCTYPE svg PUBLIC "-//W3C//DTD SVG 1.1//EN" "http://www.w3.org/Graphics/SVG/1.1/DTD/svg11.dtd"><svg xmlns="http://www.w3.org/2000/svg" xmlns:xlink="http://www.w3.org/1999/xlink" width="350" height="1000" viewBox="0 0 14 40" >
            
                ['<path class="dot" d="M 2.7909438775510207,-0.22280612244898207 L 2.79094387755102,-0.22280612244898207 C 2.3409438775510196,-0.6728061224489821 1.6434438775510198,-0.6728061224489822 1.19344387755102,-0.22280612244898207 L 0.6084438775510199,0.3621938775510183 C 0.15844387755101996,0.8121938775510182 0.15844387755101985,1.5096938775510182 0.6084438775510199,1.9596938775510184 L 1.2159438775510198,2.567193877551018 C 1.6659438775510198,3.0171938775510174 2.3634438775510196,3.0171938775510174 2.8134438775510198,2.567193877551018 L 3.3984438775510206,1.9596938775510184 C 3.84844387755102,1.5096938775510182 3.84844387755102,0.8121938775510182 3.3984438775510206,0.36219387755101806 L 2.7909438775510207,-0.2228061224489819" stroke-linejoin="round"/>', '<path class="dot" d="M 7.790943977551021,-0.22280612244898207 L 7.79094397755102,-0.22280612244898207 C 7.340943977551021,-0.6728061224489821 6.64344397755102,-0.6728061224489822 6.193443977551021,-0.22280612244898207 L 5.608443977551021,0.3621938775510183 C 5.158443977551021,0.8121938775510182 5.158443977551021,1.5096938775510182 5.608443977551021,1.9596938775510184 L 6.215943977551021,2.567193877551018 C 6.66594397755102,3.0171938775510174 7.36344397755102,3.0171938775510174 7.81344397755102,2.567193877551018 L 8.398443977551022,1.9596938775510184 C 8.848443977551021,1.5096938775510182 8.848443977551021,0.8121938775510182 8.398443977551022,0.36219387755101806 L 7.790943977551021,-0.2228061224489819" stroke-linejoin="round"/>', '<path class="dot" d="M 7.790943977551021,-0.22280612244898207 L 7.79094397755102,-0.22280612244898207 C 7.340943977551021,-0.6728061224489821 6.64344397755102,-0.6728061224489822 6.193443977551021,-0.22280612244898207 L 5.608443977551021,0.3621938775510183 C 5.158443977551021,0.8121938775510182 5.158443977551021,1.5096938775510182 5.608443977551021,1.9596938775510184 L 6.215943977551021,2.567193877551018 C 6.66594397755102,3.0171938775510174 7.36344397755102,3.0171938775510174 7.81344397755102,2.567193877551018 L 8.398443977551022,1.9596938775510184 C 8.848443977551021,1.5096938775510182 8.848443977551021,0.8121938775510182 8.398443977551022,0.36219387755101806 L 7.790943977551021,-0.2228061224489819" stroke-linejoin="round"/>', '<path class="dot" d="M 12.790943877551019,-0.22280612244898207 L 12.790943877551019,-0.22280612244898207 C 12.34094387755102,-0.6728061224489821 11.64344387755102,-0.6728061224489822 11.193443877551019,-0.22280612244898207 L 10.60844387755102,0.3621938775510183 C 10.158443877551019,0.8121938775510182 10.158443877551019,1.5096938775510182 10.60844387755102,1.9596938775510184 L 11.21594387755102,2.567193877551018 C 11.665943877551019,3.0171938775510174 12.363443877551019,3.0171938775510174 12.81344387755102,2.567193877551018 L 13.39844387755102,1.9596938775510184 C 13.84844387755102,1.5096938775510182 13.84844387755102,0.8121938775510182 13.39844387755102,0.36219387755101806 L 12.790943877551019,-0.2228061224489819" stroke-linejoin="round"/>', '<path class="dot" d="M 10.790943877551019,20.777193877551017 L 10.790943877551019,20.777193877551017 C 10.34094387755102,20.327193877551018 9.64344387755102,20.327193877551018 9.193443877551019,20.777193877551017 L 8.60844387755102,21.362193877551018 C 8.158443877551019,21.812193877551017 8.158443877551019,22.50969387755102 8.60844387755102,22.959693877551018 L 9.21594387755102,23.56719387755102 C 9.665943877551019,24.01719387755102 10.363443877551019,24.01719387755102 10.81344387755102,23.56719387755102 L 11.39844387755102,22.959693877551018 C 11.84844387755102,22.50969387755102 11.84844387755102,21.812193877551017 11.39844387755102,21.362193877551018 L 10.790943877551019,20.777193877551017" stroke-linejoin="round"/>']
            
            
            <path d="M 2.0,1.0 L 4.0,22.0 M 7.0000001,1.0 L 4.0,22.0 M 7.0000001,1.0 L 10.0,22.0 M 12.0,1.0 L 10.0,22.0" fill="none"
            stroke="black"
            stroke-width="2.5"
            stroke-linecap="round"
            stroke-linejoin="round"
            />
            
            
        </svg>