<?xml version="1.0" encoding="UTF-8" standalone="no"?>
<svg
   data-dec="71"
   width="14"
   height="40"
   version="1.1"
   id="svg1"
   xmlns="http://www.w3.org/2000/svg"
   xmlns:svg="http://www.w3.org/2000/svg">
  <defs
     id="defs1" />
  <path
     d="M 6,1 4,2 3,4 2,9 v 5 l 1,5 1,2 2,1 h 2 l 2,-1 1,-2 1,-3 V 14 M 12,7 11,4 10,2 8,1 H 6 M 8.666667,14 H 12"
     style="fill:none;stroke:none;stroke-width:2;stroke-linecap:round;stroke-linejoin:round"
     id="path1-2-4" />
</svg>
