<?xml version="1.0"?><!DOCTYPE svg PUBLIC "-//W3C//DTD SVG 1.1//EN" "http://www.w3.org/Graphics/SVG/1.1/DTD/svg11.dtd"><svg xmlns="http://www.w3.org/2000/svg" xmlns:xlink="http://www.w3.org/1999/xlink" width="350" height="1000" viewBox="0 0 14 40" >
            
                ['<path class="dot" d="M 7.790943877551021,6.777193877551018 L 7.79094387755102,6.777193877551018 C 7.34094387755102,6.327193877551018 6.64344387755102,6.327193877551018 6.1934438775510205,6.777193877551018 L 5.608443877551021,7.362193877551018 C 5.15844387755102,7.812193877551018 5.15844387755102,8.509693877551019 5.608443877551021,8.959693877551018 L 6.21594387755102,9.567193877551018 C 6.66594387755102,10.017193877551017 7.3634438775510205,10.017193877551017 7.81344387755102,9.567193877551018 L 8.39844387755102,8.959693877551018 C 8.84844387755102,8.509693877551019 8.84844387755102,7.812193877551018 8.39844387755102,7.362193877551018 L 7.790943877551021,6.777193877551018" stroke-linejoin="round"/>', '<path class="dot" d="M 7.790943877551021,20.777193877551017 L 7.79094387755102,20.777193877551017 C 7.34094387755102,20.327193877551018 6.64344387755102,20.327193877551018 6.1934438775510205,20.777193877551017 L 5.608443877551021,21.362193877551018 C 5.15844387755102,21.812193877551017 5.15844387755102,22.50969387755102 5.608443877551021,22.959693877551018 L 6.21594387755102,23.56719387755102 C 6.66594387755102,24.01719387755102 7.3634438775510205,24.01719387755102 7.81344387755102,23.56719387755102 L 8.39844387755102,22.959693877551018 C 8.84844387755102,22.50969387755102 8.84844387755102,21.812193877551017 8.39844387755102,21.362193877551018 L 7.790943877551021,20.777193877551017" stroke-linejoin="round"/>']
            
                ['<path class="dot" d="M 3.7909438775510207,6.777203877551018 L 3.79094387755102,6.777203877551018 C 3.3409438775510196,6.3272038775510175 2.64344387755102,6.3272038775510175 2.19344387755102,6.777203877551018 L 1.60844387755102,7.362203877551018 C 1.15844387755102,7.812203877551018 1.15844387755102,8.509703877551019 1.60844387755102,8.959703877551018 L 2.2159438775510196,9.567203877551018 C 2.66594387755102,10.017203877551017 3.3634438775510196,10.017203877551017 3.8134438775510198,9.567203877551018 L 4.398443877551021,8.959703877551018 C 4.84844387755102,8.509703877551019 4.84844387755102,7.812203877551018 4.398443877551021,7.362203877551018 L 3.7909438775510207,6.777203877551018" stroke-linejoin="round"/>', '<path class="dot" d="M 7.790943877551021,6.777203877551018 L 7.79094387755102,6.777203877551018 C 7.34094387755102,6.3272038775510175 6.64344387755102,6.3272038775510175 6.1934438775510205,6.777203877551018 L 5.608443877551021,7.362203877551018 C 5.15844387755102,7.812203877551018 5.15844387755102,8.509703877551019 5.608443877551021,8.959703877551018 L 6.21594387755102,9.567203877551018 C 6.66594387755102,10.017203877551017 7.3634438775510205,10.017203877551017 7.81344387755102,9.567203877551018 L 8.39844387755102,8.959703877551018 C 8.84844387755102,8.509703877551019 8.84844387755102,7.812203877551018 8.39844387755102,7.362203877551018 L 7.790943877551021,6.777203877551018" stroke-linejoin="round"/>']
            
                ['<path class="dot" d="M 3.7909438775510207,20.777193877551017 L 3.79094387755102,20.777193877551017 C 3.3409438775510196,20.327193877551018 2.64344387755102,20.327193877551018 2.19344387755102,20.777193877551017 L 1.60844387755102,21.362193877551018 C 1.15844387755102,21.812193877551017 1.15844387755102,22.50969387755102 1.60844387755102,22.959693877551018 L 2.2159438775510196,23.56719387755102 C 2.66594387755102,24.01719387755102 3.3634438775510196,24.01719387755102 3.8134438775510198,23.56719387755102 L 4.398443877551021,22.959693877551018 C 4.84844387755102,22.50969387755102 4.84844387755102,21.812193877551017 4.398443877551021,21.362193877551018 L 3.7909438775510207,20.777193877551017" stroke-linejoin="round"/>', '<path class="dot" d="M 11.790943577551019,20.777193877551017 L 11.790943577551019,20.777193877551017 C 11.34094357755102,20.327193877551018 10.64344357755102,20.327193877551018 10.193443577551019,20.777193877551017 L 9.60844357755102,21.362193877551018 C 9.158443577551019,21.812193877551017 9.158443577551019,22.50969387755102 9.60844357755102,22.959693877551018 L 10.21594357755102,23.56719387755102 C 10.665943577551019,24.01719387755102 11.363443577551019,24.01719387755102 11.81344357755102,23.56719387755102 L 12.39844357755102,22.959693877551018 C 12.84844357755102,22.50969387755102 12.84844357755102,21.812193877551017 12.39844357755102,21.362193877551018 L 11.790943577551019,20.777193877551017" stroke-linejoin="round"/>']
            
                ['<path class="dot" d="M 11.790943777551018,-1.2228061224489821 L 11.790943777551018,-1.2228061224489821 C 11.340943777551018,-1.672806122448982 10.643443777551019,-1.672806122448982 10.193443777551018,-1.2228061224489821 L 9.608443777551019,-0.6378061224489817 C 9.158443777551017,-0.18780612244898176 9.158443777551017,0.5096938775510182 9.608443777551019,0.9596938775510184 L 10.215943777551018,1.567193877551018 C 10.665943777551018,2.0171938775510174 11.363443777551018,2.0171938775510174 11.813443777551019,1.567193877551018 L 12.39844377755102,0.9596938775510184 C 12.848443777551019,0.5096938775510182 12.848443777551019,-0.18780612244898176 12.39844377755102,-0.6378061224489819 L 11.790943777551018,-1.222806122448982" stroke-linejoin="round"/>', '<path class="dot" d="M 3.7909438775510207,3.7771938775510177 L 3.79094387755102,3.7771938775510177 C 3.3409438775510196,3.327193877551018 2.64344387755102,3.3271938775510175 2.19344387755102,3.7771938775510177 L 1.60844387755102,4.362193877551018 C 1.15844387755102,4.812193877551018 1.15844387755102,5.509693877551018 1.60844387755102,5.959693877551018 L 2.2159438775510196,6.567193877551018 C 2.66594387755102,7.017193877551017 3.3634438775510196,7.017193877551017 3.8134438775510198,6.567193877551018 L 4.398443877551021,5.959693877551018 C 4.84844387755102,5.509693877551018 4.84844387755102,4.812193877551018 4.398443877551021,4.362193877551018 L 3.7909438775510207,3.777193877551018" stroke-linejoin="round"/>']
            
            
            <path d="M 7.0,8.0 L 7.0,22.0" fill="none"
            stroke="black"
            stroke-width="2.5"
            stroke-linecap="round"
            stroke-linejoin="round"
            />
            
            <path d="M 3.0,8.00001 L 7.0,8.00001" fill="none"
            stroke="black"
            stroke-width="2.5"
            stroke-linecap="round"
            stroke-linejoin="round"
            />
            
            <path d="M 3.0,22.0 L 10.9999997,22.0" fill="none"
            stroke="black"
            stroke-width="2.5"
            stroke-linecap="round"
            stroke-linejoin="round"
            />
            
            <path d="M 10.999999899999999,0.0 L 3.0,5.0" fill="none"
            stroke="black"
            stroke-width="2.5"
            stroke-linecap="round"
            stroke-linejoin="round"
            />
            
            
        </svg>