<?xml version="1.0"?><!DOCTYPE svg PUBLIC "-//W3C//DTD SVG 1.1//EN" "http://www.w3.org/Graphics/SVG/1.1/DTD/svg11.dtd"><svg xmlns="http://www.w3.org/2000/svg" xmlns:xlink="http://www.w3.org/1999/xlink" width="350" height="1000" viewBox="0 0 14 40" >
            
                ['<path class="dot" d="M 10.790943877551019,-0.22280612244898207 L 10.790943877551019,-0.22280612244898207 C 10.34094387755102,-0.6728061224489821 9.64344387755102,-0.6728061224489822 9.193443877551019,-0.22280612244898207 L 8.60844387755102,0.3621938775510183 C 8.158443877551019,0.8121938775510182 8.158443877551019,1.5096938775510182 8.60844387755102,1.9596938775510184 L 9.21594387755102,2.567193877551018 C 9.665943877551019,3.0171938775510174 10.363443877551019,3.0171938775510174 10.81344387755102,2.567193877551018 L 11.39844387755102,1.9596938775510184 C 11.84844387755102,1.5096938775510182 11.84844387755102,0.8121938775510182 11.39844387755102,0.36219387755101806 L 10.790943877551019,-0.2228061224489819" stroke-linejoin="round"/>', '<path class="dot" d="M 10.790943877551019,27.777193877551017 L 10.790943877551019,27.777193877551017 C 10.34094387755102,27.327193877551018 9.64344387755102,27.327193877551018 9.193443877551019,27.777193877551017 L 8.60844387755102,28.362193877551018 C 8.158443877551019,28.812193877551017 8.158443877551019,29.50969387755102 8.60844387755102,29.959693877551018 L 9.21594387755102,30.56719387755102 C 9.665943877551019,31.01719387755102 10.363443877551019,31.01719387755102 10.81344387755102,30.56719387755102 L 11.39844387755102,29.959693877551018 C 11.84844387755102,29.50969387755102 11.84844387755102,28.812193877551017 11.39844387755102,28.362193877551018 L 10.790943877551019,27.777193877551017" stroke-linejoin="round"/>']
            
                ['<path class="dot" d="M 3.7909438775510207,27.777193877551017 L 3.79094387755102,27.777193877551017 C 3.3409438775510196,27.327193877551018 2.64344387755102,27.327193877551018 2.19344387755102,27.777193877551017 L 1.60844387755102,28.362193877551018 C 1.15844387755102,28.812193877551017 1.15844387755102,29.50969387755102 1.60844387755102,29.959693877551018 L 2.2159438775510196,30.56719387755102 C 2.66594387755102,31.01719387755102 3.3634438775510196,31.01719387755102 3.8134438775510198,30.56719387755102 L 4.398443877551021,29.959693877551018 C 4.84844387755102,29.50969387755102 4.84844387755102,28.812193877551017 4.398443877551021,28.362193877551018 L 3.7909438775510207,27.777193877551017" stroke-linejoin="round"/>', '<path class="dot" d="M 10.790943877551019,27.777193877551017 L 10.790943877551019,27.777193877551017 C 10.34094387755102,27.327193877551018 9.64344387755102,27.327193877551018 9.193443877551019,27.777193877551017 L 8.60844387755102,28.362193877551018 C 8.158443877551019,28.812193877551017 8.158443877551019,29.50969387755102 8.60844387755102,29.959693877551018 L 9.21594387755102,30.56719387755102 C 9.665943877551019,31.01719387755102 10.363443877551019,31.01719387755102 10.81344387755102,30.56719387755102 L 11.39844387755102,29.959693877551018 C 11.84844387755102,29.50969387755102 11.84844387755102,28.812193877551017 11.39844387755102,28.362193877551018 L 10.790943877551019,27.777193877551017" stroke-linejoin="round"/>']
            
                ['<path class="dot" d="M 3.7909438775510207,-0.22280612244898207 L 3.79094387755102,-0.22280612244898207 C 3.3409438775510196,-0.6728061224489821 2.64344387755102,-0.6728061224489822 2.19344387755102,-0.22280612244898207 L 1.60844387755102,0.3621938775510183 C 1.15844387755102,0.8121938775510182 1.15844387755102,1.5096938775510182 1.60844387755102,1.9596938775510184 L 2.2159438775510196,2.567193877551018 C 2.66594387755102,3.0171938775510174 3.3634438775510196,3.0171938775510174 3.8134438775510198,2.567193877551018 L 4.398443877551021,1.9596938775510184 C 4.84844387755102,1.5096938775510182 4.84844387755102,0.8121938775510182 4.398443877551021,0.36219387755101806 L 3.7909438775510207,-0.2228061224489819" stroke-linejoin="round"/>', '<path class="dot" d="M 10.790943877551019,-0.22280612244898207 L 10.790943877551019,-0.22280612244898207 C 10.34094387755102,-0.6728061224489821 9.64344387755102,-0.6728061224489822 9.193443877551019,-0.22280612244898207 L 8.60844387755102,0.3621938775510183 C 8.158443877551019,0.8121938775510182 8.158443877551019,1.5096938775510182 8.60844387755102,1.9596938775510184 L 9.21594387755102,2.567193877551018 C 9.665943877551019,3.0171938775510174 10.363443877551019,3.0171938775510174 10.81344387755102,2.567193877551018 L 11.39844387755102,1.9596938775510184 C 11.84844387755102,1.5096938775510182 11.84844387755102,0.8121938775510182 11.39844387755102,0.36219387755101806 L 10.790943877551019,-0.2228061224489819" stroke-linejoin="round"/>']
            
            
            <path d="M 10.0,1.0 L 10.0,29.0" fill="none"
            stroke="black"
            stroke-width="2.5"
            stroke-linecap="round"
            stroke-linejoin="round"
            />
            
            <path d="M 3.0,29.0 L 10.0,29.0" fill="none"
            stroke="black"
            stroke-width="2.5"
            stroke-linecap="round"
            stroke-linejoin="round"
            />
            
            <path d="M 3.0,1.0 L 10.0,1.0" fill="none"
            stroke="black"
            stroke-width="2.5"
            stroke-linecap="round"
            stroke-linejoin="round"
            />
            
            
        </svg>