<?xml version="1.0"?><!DOCTYPE svg PUBLIC "-//W3C//DTD SVG 1.1//EN" "http://www.w3.org/Graphics/SVG/1.1/DTD/svg11.dtd"><svg xmlns="http://www.w3.org/2000/svg" xmlns:xlink="http://www.w3.org/1999/xlink" width="350" height="1000" viewBox="0 0 10 26" >
            
                ['<path class="dot" d="M 8.519583333333333,12.140270833333332 L 8.519583333333333,12.140270833333332 C 8.229583333333332,11.850270833333333 7.780083333333333,11.850270833333333 7.490083333333333,12.140270833333332 L 7.113083333333333,12.517270833333333 C 6.823083333333333,12.807270833333334 6.823083333333333,13.256770833333333 7.113083333333333,13.546770833333333 L 7.504583333333333,13.938270833333332 C 7.794583333333333,14.228270833333333 8.244083333333332,14.228270833333333 8.534083333333333,13.938270833333332 L 8.911083333333334,13.546770833333333 C 9.201083333333333,13.256770833333333 9.201083333333333,12.807270833333334 8.911083333333334,12.517270833333333 L 8.519583333333333,12.140270833333332" stroke-linejoin="round"/>', '<path class="dot" d="M 6.519583333333333,14.140270833333332 L 6.519583333333332,14.140270833333332 C 6.229583333333332,13.850270833333333 5.780083333333333,13.850270833333333 5.490083333333333,14.140270833333332 L 5.113083333333333,14.517270833333333 C 4.823083333333333,14.807270833333334 4.823083333333333,15.256770833333333 5.113083333333333,15.546770833333333 L 5.504583333333333,15.938270833333332 C 5.794583333333333,16.228270833333333 6.244083333333332,16.228270833333333 6.534083333333332,15.938270833333332 L 6.911083333333333,15.546770833333333 C 7.201083333333333,15.256770833333333 7.201083333333333,14.807270833333334 6.911083333333333,14.517270833333333 L 6.519583333333333,14.140270833333332" stroke-linejoin="round"/>', '<path class="dot" d="M 4.519583333333333,14.140270833333332 L 4.519583333333333,14.140270833333332 C 4.229583333333333,13.850270833333333 3.7800833333333332,13.850270833333333 3.490083333333333,14.140270833333332 L 3.113083333333333,14.517270833333333 C 2.823083333333333,14.807270833333334 2.823083333333333,15.256770833333333 3.113083333333333,15.546770833333333 L 3.504583333333333,15.938270833333332 C 3.7945833333333328,16.228270833333333 4.244083333333333,16.228270833333333 4.534083333333333,15.938270833333332 L 4.911083333333334,15.546770833333333 C 5.201083333333333,15.256770833333333 5.201083333333333,14.807270833333334 4.911083333333334,14.517270833333333 L 4.519583333333333,14.140270833333332" stroke-linejoin="round"/>', '<path class="dot" d="M 3.5195833333333333,13.140270833333332 L 3.5195833333333333,13.140270833333332 C 3.2295833333333333,12.850270833333333 2.7800833333333332,12.850270833333333 2.490083333333333,13.140270833333332 L 2.113083333333333,13.517270833333333 C 1.8230833333333332,13.807270833333334 1.8230833333333332,14.256770833333333 2.113083333333333,14.546770833333333 L 2.504583333333333,14.938270833333332 C 2.7945833333333328,15.228270833333333 3.244083333333333,15.228270833333333 3.5340833333333332,14.938270833333332 L 3.9110833333333335,14.546770833333333 C 4.201083333333333,14.256770833333333 4.201083333333333,13.807270833333334 3.9110833333333335,13.517270833333333 L 3.5195833333333333,13.140270833333332" stroke-linejoin="round"/>', '<path class="dot" d="M 2.5195833333333333,11.140270833333332 L 2.5195833333333333,11.140270833333332 C 2.2295833333333333,10.850270833333333 1.7800833333333332,10.850270833333333 1.4900833333333332,11.140270833333332 L 1.1130833333333332,11.517270833333333 C 0.8230833333333332,11.807270833333334 0.8230833333333331,12.256770833333333 1.1130833333333332,12.546770833333333 L 1.5045833333333332,12.938270833333332 C 1.794583333333333,13.228270833333333 2.244083333333333,13.228270833333333 2.5340833333333332,12.938270833333332 L 2.9110833333333335,12.546770833333333 C 3.2010833333333335,12.256770833333333 3.2010833333333335,11.807270833333334 2.9110833333333335,11.517270833333333 L 2.5195833333333333,11.140270833333332" stroke-linejoin="round"/>', '<path class="dot" d="M 2.5195833333333333,7.140270833333333 L 2.5195833333333333,7.140270833333333 C 2.2295833333333333,6.850270833333333 1.7800833333333332,6.850270833333333 1.4900833333333332,7.140270833333333 L 1.1130833333333332,7.517270833333333 C 0.8230833333333332,7.807270833333333 0.8230833333333331,8.256770833333333 1.1130833333333332,8.546770833333333 L 1.5045833333333332,8.938270833333332 C 1.794583333333333,9.228270833333333 2.244083333333333,9.228270833333333 2.5340833333333332,8.938270833333332 L 2.9110833333333335,8.546770833333333 C 3.2010833333333335,8.256770833333333 3.2010833333333335,7.807270833333333 2.9110833333333335,7.517270833333333 L 2.5195833333333333,7.140270833333333" stroke-linejoin="round"/>', '<path class="dot" d="M 3.5195833333333333,5.140270833333333 L 3.5195833333333333,5.140270833333333 C 3.2295833333333333,4.850270833333333 2.7800833333333332,4.850270833333333 2.490083333333333,5.140270833333333 L 2.113083333333333,5.517270833333333 C 1.8230833333333332,5.807270833333333 1.8230833333333332,6.2567708333333325 2.113083333333333,6.546770833333333 L 2.504583333333333,6.938270833333332 C 2.7945833333333328,7.228270833333333 3.244083333333333,7.228270833333333 3.5340833333333332,6.938270833333332 L 3.9110833333333335,6.546770833333333 C 4.201083333333333,6.2567708333333325 4.201083333333333,5.807270833333333 3.9110833333333335,5.517270833333333 L 3.5195833333333333,5.140270833333333" stroke-linejoin="round"/>', '<path class="dot" d="M 4.519583333333333,4.140270833333333 L 4.519583333333333,4.140270833333333 C 4.229583333333333,3.8502708333333326 3.7800833333333332,3.8502708333333326 3.490083333333333,4.140270833333333 L 3.113083333333333,4.517270833333333 C 2.823083333333333,4.807270833333333 2.823083333333333,5.2567708333333325 3.113083333333333,5.546770833333333 L 3.504583333333333,5.938270833333332 C 3.7945833333333328,6.228270833333333 4.244083333333333,6.228270833333333 4.534083333333333,5.938270833333332 L 4.911083333333334,5.546770833333333 C 5.201083333333333,5.2567708333333325 5.201083333333333,4.807270833333333 4.911083333333334,4.517270833333333 L 4.519583333333333,4.140270833333333" stroke-linejoin="round"/>', '<path class="dot" d="M 6.519583333333333,4.140270833333333 L 6.519583333333332,4.140270833333333 C 6.229583333333332,3.8502708333333326 5.780083333333333,3.8502708333333326 5.490083333333333,4.140270833333333 L 5.113083333333333,4.517270833333333 C 4.823083333333333,4.807270833333333 4.823083333333333,5.2567708333333325 5.113083333333333,5.546770833333333 L 5.504583333333333,5.938270833333332 C 5.794583333333333,6.228270833333333 6.244083333333332,6.228270833333333 6.534083333333332,5.938270833333332 L 6.911083333333333,5.546770833333333 C 7.201083333333333,5.2567708333333325 7.201083333333333,4.807270833333333 6.911083333333333,4.517270833333333 L 6.519583333333333,4.140270833333333" stroke-linejoin="round"/>', '<path class="dot" d="M 8.519583333333333,6.140270833333333 L 8.519583333333333,6.140270833333333 C 8.229583333333332,5.850270833333333 7.780083333333333,5.850270833333333 7.490083333333333,6.140270833333333 L 7.113083333333333,6.517270833333333 C 6.823083333333333,6.807270833333333 6.823083333333333,7.2567708333333325 7.113083333333333,7.546770833333333 L 7.504583333333333,7.938270833333332 C 7.794583333333333,8.228270833333333 8.244083333333332,8.228270833333333 8.534083333333333,7.938270833333332 L 8.911083333333334,7.546770833333333 C 9.201083333333333,7.2567708333333325 9.201083333333333,6.807270833333333 8.911083333333334,6.517270833333333 L 8.519583333333333,6.140270833333333" stroke-linejoin="round"/>']
            
                ['<path class="dot" d="M 8.519583333333333,4.140271133333333 L 8.519583333333333,4.140271133333333 C 8.229583333333332,3.8502711333333326 7.780083333333333,3.8502711333333326 7.490083333333333,4.140271133333333 L 7.113083333333333,4.517271133333333 C 6.823083333333333,4.807271133333333 6.823083333333333,5.2567711333333325 7.113083333333333,5.546771133333333 L 7.504583333333333,5.938271133333332 C 7.794583333333333,6.228271133333333 8.244083333333332,6.228271133333333 8.534083333333333,5.938271133333332 L 8.911083333333334,5.546771133333333 C 9.201083333333333,5.2567711333333325 9.201083333333333,4.807271133333333 8.911083333333334,4.517271133333333 L 8.519583333333333,4.140271133333333" stroke-linejoin="round"/>', '<path class="dot" d="M 8.519583333333333,14.140270833333332 L 8.519583333333333,14.140270833333332 C 8.229583333333332,13.850270833333333 7.780083333333333,13.850270833333333 7.490083333333333,14.140270833333332 L 7.113083333333333,14.517270833333333 C 6.823083333333333,14.807270833333334 6.823083333333333,15.256770833333333 7.113083333333333,15.546770833333333 L 7.504583333333333,15.938270833333332 C 7.794583333333333,16.228270833333333 8.244083333333332,16.228270833333333 8.534083333333333,15.938270833333332 L 8.911083333333334,15.546770833333333 C 9.201083333333333,15.256770833333333 9.201083333333333,14.807270833333334 8.911083333333334,14.517270833333333 L 8.519583333333333,14.140270833333332" stroke-linejoin="round"/>']
            
                ['<path class="dot" d="M 7.519583333333333,0.14027123333333244 L 7.519583333333332,0.14027123333333244 C 7.229583333333332,-0.1497287666666676 6.780083333333333,-0.14972876666666765 6.490083333333333,0.14027123333333244 L 6.113083333333333,0.5172712333333326 C 5.823083333333333,0.8072712333333325 5.823083333333333,1.2567712333333325 6.113083333333333,1.5467712333333326 L 6.504583333333333,1.9382712333333323 C 6.794583333333333,2.2282712333333325 7.244083333333332,2.2282712333333325 7.534083333333332,1.9382712333333323 L 7.911083333333333,1.5467712333333326 C 8.201083333333333,1.2567712333333325 8.201083333333333,0.8072712333333326 7.911083333333333,0.5172712333333325 L 7.519583333333333,0.14027123333333247" stroke-linejoin="round"/>', '<path class="dot" d="M 3.5195833333333333,2.1402708333333322 L 3.5195833333333333,2.1402708333333322 C 3.2295833333333333,1.8502708333333322 2.7800833333333332,1.8502708333333322 2.490083333333333,2.1402708333333322 L 2.113083333333333,2.5172708333333325 C 1.8230833333333332,2.807270833333332 1.8230833333333332,3.2567708333333325 2.113083333333333,3.5467708333333325 L 2.504583333333333,3.9382708333333323 C 2.7945833333333328,4.228270833333332 3.244083333333333,4.228270833333332 3.5340833333333332,3.9382708333333323 L 3.9110833333333335,3.5467708333333325 C 4.201083333333333,3.2567708333333325 4.201083333333333,2.8072708333333325 3.9110833333333335,2.517270833333332 L 3.5195833333333333,2.1402708333333322" stroke-linejoin="round"/>']
            
            
            <path d="M 8.0,13.0 L 6.0,15.0 L 4.0,15.0 L 3.0,14.0 L 2.0,12.0 L 2.0,8.0 L 3.0,6.0 L 4.0,5.0 L 6.0,5.0 L 8.0,7.0" fill="none"
            stroke="black"
            stroke-width="1.5"
            stroke-linecap="round"
            stroke-linejoin="round"
            />
            
            <path d="M 8.0,5.0000003 L 8.0,15.0" fill="none"
            stroke="black"
            stroke-width="1.5"
            stroke-linecap="round"
            stroke-linejoin="round"
            />
            
            <path d="M 7.0,1.0000003999999993 L 3.0,2.999999999999999" fill="none"
            stroke="black"
            stroke-width="1.5"
            stroke-linecap="round"
            stroke-linejoin="round"
            />
            
            
        </svg>