<?xml version="1.0"?><!DOCTYPE svg PUBLIC "-//W3C//DTD SVG 1.1//EN" "http://www.w3.org/Graphics/SVG/1.1/DTD/svg11.dtd"><svg xmlns="http://www.w3.org/2000/svg" xmlns:xlink="http://www.w3.org/1999/xlink" width="350" height="1000" viewBox="0 0 7 17" >
            
                ['<path class="dot" d="M 1.885,3.318 L 1.8849999999999998,3.318 C 1.6649999999999998,3.098 1.3239999999999998,3.098 1.1039999999999999,3.318 L 0.8179999999999998,3.604 C 0.5979999999999998,3.8240000000000003 0.5979999999999998,4.165 0.8179999999999998,4.385 L 1.1149999999999998,4.682 C 1.3349999999999997,4.902 1.676,4.902 1.8959999999999997,4.682 L 2.1820000000000004,4.385 C 2.402,4.165 2.402,3.8240000000000003 2.1820000000000004,3.604 L 1.885,3.318" stroke-linejoin="round"/>', '<path class="dot" d="M 5.885,3.318 L 5.885,3.318 C 5.664999999999999,3.098 5.324,3.098 5.103999999999999,3.318 L 4.818,3.604 C 4.598,3.8240000000000003 4.598,4.165 4.818,4.385 L 5.114999999999999,4.682 C 5.334999999999999,4.902 5.676,4.902 5.895999999999999,4.682 L 6.182,4.385 C 6.402,4.165 6.402,3.8240000000000003 6.182,3.604 L 5.885,3.318" stroke-linejoin="round"/>', '<path class="dot" d="M 3.8850001,10.318 L 3.8850001,10.318 C 3.6650001,10.098 3.3240001,10.098 3.1040001,10.318 L 2.8180001,10.604000000000001 C 2.5980000999999997,10.824 2.5980000999999997,11.165000000000001 2.8180001,11.385000000000002 L 3.1150000999999996,11.682 C 3.3350001,11.902000000000001 3.6760001,11.902000000000001 3.8960000999999997,11.682 L 4.1820001,11.385000000000002 C 4.4020001,11.165000000000001 4.4020001,10.824 4.1820001,10.604000000000001 L 3.8850001,10.318000000000001" stroke-linejoin="round"/>']
            
            
            <path d="M 1.5,4.0 L 3.5000001,11.0 M 5.5,4.0 L 3.5000001,11.0" fill="none"
            stroke="black"
            stroke-width="1"
            stroke-linecap="round"
            stroke-linejoin="round"
            />
            
            
        </svg>