<?xml version="1.0"?><!DOCTYPE svg PUBLIC "-//W3C//DTD SVG 1.1//EN" "http://www.w3.org/Graphics/SVG/1.1/DTD/svg11.dtd"><svg xmlns="http://www.w3.org/2000/svg" xmlns:xlink="http://www.w3.org/1999/xlink" width="350" height="1000" viewBox="0 0 10 26" >
            
                ['<path class="dot" d="M 5.519583233333332,4.140271133333333 L 5.519583233333332,4.140271133333333 C 5.229583233333332,3.8502711333333326 4.780083233333332,3.8502711333333326 4.490083233333332,4.140271133333333 L 4.113083233333332,4.517271133333333 C 3.8230832333333318,4.807271133333333 3.8230832333333318,5.2567711333333325 4.113083233333332,5.546771133333333 L 4.5045832333333315,5.938271133333332 C 4.794583233333332,6.228271133333333 5.244083233333332,6.228271133333333 5.534083233333332,5.938271133333332 L 5.911083233333333,5.546771133333333 C 6.201083233333332,5.2567711333333325 6.201083233333332,4.807271133333333 5.911083233333333,4.517271133333333 L 5.519583233333332,4.140271133333333" stroke-linejoin="round"/>', '<path class="dot" d="M 0.5195833333333333,9.140270933333333 L 0.5195833333333331,9.140270933333333 C 0.22958333333333325,8.850270933333334 -0.21991666666666687,8.850270933333334 -0.5099166666666669,9.140270933333333 L -0.8869166666666668,9.517270933333334 C -1.1769166666666668,9.807270933333335 -1.1769166666666668,10.256770933333334 -0.8869166666666668,10.546770933333335 L -0.49541666666666695,10.938270933333333 C -0.20541666666666702,11.228270933333334 0.2440833333333332,11.228270933333334 0.534083333333333,10.938270933333333 L 0.9110833333333335,10.546770933333335 C 1.2010833333333335,10.256770933333334 1.2010833333333335,9.807270933333335 0.9110833333333335,9.517270933333334 L 0.5195833333333335,9.140270933333333" stroke-linejoin="round"/>', '<path class="dot" d="M 5.519583233333332,14.140270833333332 L 5.519583233333332,14.140270833333332 C 5.229583233333332,13.850270833333333 4.780083233333332,13.850270833333333 4.490083233333332,14.140270833333332 L 4.113083233333332,14.517270833333333 C 3.8230832333333318,14.807270833333334 3.8230832333333318,15.256770833333333 4.113083233333332,15.546770833333333 L 4.5045832333333315,15.938270833333332 C 4.794583233333332,16.228270833333333 5.244083233333332,16.228270833333333 5.534083233333332,15.938270833333332 L 5.911083233333333,15.546770833333333 C 6.201083233333332,15.256770833333333 6.201083233333332,14.807270833333334 5.911083233333333,14.517270833333333 L 5.519583233333332,14.140270833333332" stroke-linejoin="round"/>', '<path class="dot" d="M 10.519583033333333,9.140270933333332 L 10.519583033333333,9.140270933333332 C 10.229583033333332,8.850270933333332 9.780083033333332,8.850270933333332 9.490083033333333,9.140270933333332 L 9.113083033333332,9.517270933333332 C 8.823083033333333,9.807270933333331 8.823083033333333,10.256770933333332 9.113083033333332,10.546770933333333 L 9.504583033333333,10.938270933333332 C 9.794583033333332,11.228270933333333 10.244083033333332,11.228270933333333 10.534083033333333,10.938270933333332 L 10.911083033333334,10.546770933333333 C 11.201083033333333,10.256770933333332 11.201083033333333,9.807270933333333 10.911083033333334,9.517270933333332 L 10.519583033333333,9.140270933333332" stroke-linejoin="round"/>']
            
            
            <path d="M 4.999999899999999,5.0000003 L 4.999999899999999,15.0 M 0.0,10.000000100000001 L 4.999999899999999,15.0 L 9.9999997,10.0000001" fill="none"
            stroke="black"
            stroke-width="1.5"
            stroke-linecap="round"
            stroke-linejoin="round"
            />
            
            
        </svg>