<?xml version="1.0"?><!DOCTYPE svg PUBLIC "-//W3C//DTD SVG 1.1//EN" "http://www.w3.org/Graphics/SVG/1.1/DTD/svg11.dtd"><svg xmlns="http://www.w3.org/2000/svg" xmlns:xlink="http://www.w3.org/1999/xlink" width="350" height="1000" viewBox="0 0 7 17" >
            
                ['<path class="dot" d="M 1.885,0.31800000000000006 L 1.8849999999999998,0.31800000000000006 C 1.6649999999999998,0.09799999999999998 1.3239999999999998,0.09799999999999995 1.1039999999999999,0.31800000000000006 L 0.8179999999999998,0.6040000000000002 C 0.5979999999999998,0.8240000000000002 0.5979999999999998,1.1650000000000003 0.8179999999999998,1.3850000000000002 L 1.1149999999999998,1.682 C 1.3349999999999997,1.902 1.676,1.902 1.8959999999999997,1.682 L 2.1820000000000004,1.3850000000000002 C 2.402,1.165 2.402,0.8240000000000002 2.1820000000000004,0.6040000000000001 L 1.885,0.31800000000000006" stroke-linejoin="round"/>', '<path class="dot" d="M 1.885,10.318 L 1.8849999999999998,10.318 C 1.6649999999999998,10.098 1.3239999999999998,10.098 1.1039999999999999,10.318 L 0.8179999999999998,10.604000000000001 C 0.5979999999999998,10.824 0.5979999999999998,11.165000000000001 0.8179999999999998,11.385000000000002 L 1.1149999999999998,11.682 C 1.3349999999999997,11.902000000000001 1.676,11.902000000000001 1.8959999999999997,11.682 L 2.1820000000000004,11.385000000000002 C 2.402,11.165000000000001 2.402,10.824 2.1820000000000004,10.604000000000001 L 1.885,10.318000000000001" stroke-linejoin="round"/>']
            
                ['<path class="dot" d="M 1.885,0.31800000000000006 L 1.8849999999999998,0.31800000000000006 C 1.6649999999999998,0.09799999999999998 1.3239999999999998,0.09799999999999995 1.1039999999999999,0.31800000000000006 L 0.8179999999999998,0.6040000000000002 C 0.5979999999999998,0.8240000000000002 0.5979999999999998,1.1650000000000003 0.8179999999999998,1.3850000000000002 L 1.1149999999999998,1.682 C 1.3349999999999997,1.902 1.676,1.902 1.8959999999999997,1.682 L 2.1820000000000004,1.3850000000000002 C 2.402,1.165 2.402,0.8240000000000002 2.1820000000000004,0.6040000000000001 L 1.885,0.31800000000000006" stroke-linejoin="round"/>', '<path class="dot" d="M 3.8849998999999995,0.31800000000000006 L 3.8849998999999995,0.31800000000000006 C 3.6649998999999993,0.09799999999999998 3.3239998999999996,0.09799999999999995 3.1039998999999994,0.31800000000000006 L 2.8179998999999993,0.6040000000000002 C 2.597999899999999,0.8240000000000002 2.597999899999999,1.1650000000000003 2.8179998999999993,1.3850000000000002 L 3.114999899999999,1.682 C 3.3349998999999992,1.902 3.6759998999999994,1.902 3.895999899999999,1.682 L 4.181999899999999,1.3850000000000002 C 4.4019999,1.165 4.4019999,0.8240000000000002 4.181999899999999,0.6040000000000001 L 3.8849998999999995,0.31800000000000006" stroke-linejoin="round"/>', '<path class="dot" d="M 4.885,1.318 L 4.885,1.318 C 4.664999999999999,1.0979999999999999 4.324,1.0979999999999999 4.103999999999999,1.318 L 3.8179999999999996,1.604 C 3.5979999999999994,1.8240000000000003 3.5979999999999994,2.165 3.8179999999999996,2.3850000000000002 L 4.114999999999999,2.682 C 4.334999999999999,2.902 4.676,2.902 4.895999999999999,2.682 L 5.182,2.3850000000000002 C 5.402,2.165 5.402,1.8240000000000003 5.182,1.604 L 4.885,1.318" stroke-linejoin="round"/>', '<path class="dot" d="M 5.885,4.3180000000000005 L 5.885,4.3180000000000005 C 5.664999999999999,4.098000000000001 5.324,4.098000000000001 5.103999999999999,4.3180000000000005 L 4.818,4.604000000000001 C 4.598,4.824000000000001 4.598,5.165000000000001 4.818,5.385000000000001 L 5.114999999999999,5.682 C 5.334999999999999,5.902 5.676,5.902 5.895999999999999,5.682 L 6.182,5.385000000000001 C 6.402,5.165000000000001 6.402,4.824000000000001 6.182,4.604000000000001 L 5.885,4.3180000000000005" stroke-linejoin="round"/>', '<path class="dot" d="M 5.885,6.3180000000000005 L 5.885,6.3180000000000005 C 5.664999999999999,6.098000000000001 5.324,6.098000000000001 5.103999999999999,6.3180000000000005 L 4.818,6.604000000000001 C 4.598,6.824000000000001 4.598,7.165000000000001 4.818,7.385000000000001 L 5.114999999999999,7.682 C 5.334999999999999,7.902 5.676,7.902 5.895999999999999,7.682 L 6.182,7.385000000000001 C 6.402,7.165000000000001 6.402,6.824000000000001 6.182,6.604000000000001 L 5.885,6.3180000000000005" stroke-linejoin="round"/>', '<path class="dot" d="M 4.885,9.318 L 4.885,9.318 C 4.664999999999999,9.098 4.324,9.098 4.103999999999999,9.318 L 3.8179999999999996,9.604000000000001 C 3.5979999999999994,9.824 3.5979999999999994,10.165000000000001 3.8179999999999996,10.385000000000002 L 4.114999999999999,10.682 C 4.334999999999999,10.902000000000001 4.676,10.902000000000001 4.895999999999999,10.682 L 5.182,10.385000000000002 C 5.402,10.165000000000001 5.402,9.824 5.182,9.604000000000001 L 4.885,9.318000000000001" stroke-linejoin="round"/>', '<path class="dot" d="M 3.8849998999999995,10.318 L 3.8849998999999995,10.318 C 3.6649998999999993,10.098 3.3239998999999996,10.098 3.1039998999999994,10.318 L 2.8179998999999993,10.604000000000001 C 2.597999899999999,10.824 2.597999899999999,11.165000000000001 2.8179998999999993,11.385000000000002 L 3.114999899999999,11.682 C 3.3349998999999992,11.902000000000001 3.6759998999999994,11.902000000000001 3.895999899999999,11.682 L 4.181999899999999,11.385000000000002 C 4.4019999,11.165000000000001 4.4019999,10.824 4.181999899999999,10.604000000000001 L 3.8849998999999995,10.318000000000001" stroke-linejoin="round"/>', '<path class="dot" d="M 1.885,10.318 L 1.8849999999999998,10.318 C 1.6649999999999998,10.098 1.3239999999999998,10.098 1.1039999999999999,10.318 L 0.8179999999999998,10.604000000000001 C 0.5979999999999998,10.824 0.5979999999999998,11.165000000000001 0.8179999999999998,11.385000000000002 L 1.1149999999999998,11.682 C 1.3349999999999997,11.902000000000001 1.676,11.902000000000001 1.8959999999999997,11.682 L 2.1820000000000004,11.385000000000002 C 2.402,11.165000000000001 2.402,10.824 2.1820000000000004,10.604000000000001 L 1.885,10.318000000000001" stroke-linejoin="round"/>']
            
            
            <path d="M 1.5,1.0 L 1.5,11.0" fill="none"
            stroke="black"
            stroke-width="1"
            stroke-linecap="round"
            stroke-linejoin="round"
            />
            
            <path d="M 1.5,1.0 L 3.4999998999999997,1.0 L 4.5,2.0 L 5.5,5.0 L 5.5,7.0 L 4.5,10.0 L 3.4999998999999997,11.0 L 1.5,11.0" fill="none"
            stroke="black"
            stroke-width="1"
            stroke-linecap="round"
            stroke-linejoin="round"
            />
            
            
        </svg>