<?xml version="1.0"?><!DOCTYPE svg PUBLIC "-//W3C//DTD SVG 1.1//EN" "http://www.w3.org/Graphics/SVG/1.1/DTD/svg11.dtd"><svg xmlns="http://www.w3.org/2000/svg" xmlns:xlink="http://www.w3.org/1999/xlink" width="350" height="1000" viewBox="0 0 7 17" >
            
                ['<path class="dot" d="M 4.385,2.318 L 4.385,2.318 C 4.164999999999999,2.098 3.824,2.098 3.6039999999999996,2.318 L 3.3179999999999996,2.604 C 3.0979999999999994,2.8240000000000003 3.0979999999999994,3.165 3.3179999999999996,3.3850000000000002 L 3.6149999999999993,3.682 C 3.8349999999999995,3.902 4.176,3.902 4.395999999999999,3.682 L 4.682,3.3850000000000002 C 4.902,3.165 4.902,2.8240000000000003 4.682,2.604 L 4.385,2.318" stroke-linejoin="round"/>', '<path class="dot" d="M 3.385,3.318 L 3.385,3.318 C 3.1649999999999996,3.098 2.824,3.098 2.6039999999999996,3.318 L 2.3179999999999996,3.604 C 2.0979999999999994,3.8240000000000003 2.0979999999999994,4.165 2.3179999999999996,4.385 L 2.6149999999999993,4.682 C 2.8349999999999995,4.902 3.1759999999999997,4.902 3.3959999999999995,4.682 L 3.682,4.385 C 3.902,4.165 3.902,3.8240000000000003 3.682,3.604 L 3.385,3.318" stroke-linejoin="round"/>', '<path class="dot" d="M 4.385,4.3180000000000005 L 4.385,4.3180000000000005 C 4.164999999999999,4.098000000000001 3.824,4.098000000000001 3.6039999999999996,4.3180000000000005 L 3.3179999999999996,4.604000000000001 C 3.0979999999999994,4.824000000000001 3.0979999999999994,5.165000000000001 3.3179999999999996,5.385000000000001 L 3.6149999999999993,5.682 C 3.8349999999999995,5.902 4.176,5.902 4.395999999999999,5.682 L 4.682,5.385000000000001 C 4.902,5.165000000000001 4.902,4.824000000000001 4.682,4.604000000000001 L 4.385,4.3180000000000005" stroke-linejoin="round"/>', '<path class="dot" d="M 5.385,3.318 L 5.385,3.318 C 5.164999999999999,3.098 4.824,3.098 4.603999999999999,3.318 L 4.318,3.604 C 4.098,3.8240000000000003 4.098,4.165 4.318,4.385 L 4.614999999999999,4.682 C 4.834999999999999,4.902 5.176,4.902 5.395999999999999,4.682 L 5.682,4.385 C 5.902,4.165 5.902,3.8240000000000003 5.682,3.604 L 5.385,3.318" stroke-linejoin="round"/>', '<path class="dot" d="M 4.385,2.318 L 4.385,2.318 C 4.164999999999999,2.098 3.824,2.098 3.6039999999999996,2.318 L 3.3179999999999996,2.604 C 3.0979999999999994,2.8240000000000003 3.0979999999999994,3.165 3.3179999999999996,3.3850000000000002 L 3.6149999999999993,3.682 C 3.8349999999999995,3.902 4.176,3.902 4.395999999999999,3.682 L 4.682,3.3850000000000002 C 4.902,3.165 4.902,2.8240000000000003 4.682,2.604 L 4.385,2.318" stroke-linejoin="round"/>']
            
                ['<path class="dot" d="M 5.385,10.318 L 5.385,10.318 C 5.164999999999999,10.098 4.824,10.098 4.603999999999999,10.318 L 4.318,10.604000000000001 C 4.098,10.824 4.098,11.165000000000001 4.318,11.385000000000002 L 4.614999999999999,11.682 C 4.834999999999999,11.902000000000001 5.176,11.902000000000001 5.395999999999999,11.682 L 5.682,11.385000000000002 C 5.902,11.165000000000001 5.902,10.824 5.682,10.604000000000001 L 5.385,10.318000000000001" stroke-linejoin="round"/>', '<path class="dot" d="M 4.385,11.318 L 4.385,11.318 C 4.164999999999999,11.098 3.824,11.098 3.6039999999999996,11.318 L 3.3179999999999996,11.604000000000001 C 3.0979999999999994,11.824 3.0979999999999994,12.165000000000001 3.3179999999999996,12.385000000000002 L 3.6149999999999993,12.682 C 3.8349999999999995,12.902000000000001 4.176,12.902000000000001 4.395999999999999,12.682 L 4.682,12.385000000000002 C 4.902,12.165000000000001 4.902,11.824 4.682,11.604000000000001 L 4.385,11.318000000000001" stroke-linejoin="round"/>', '<path class="dot" d="M 3.385,10.318 L 3.385,10.318 C 3.1649999999999996,10.098 2.824,10.098 2.6039999999999996,10.318 L 2.3179999999999996,10.604000000000001 C 2.0979999999999994,10.824 2.0979999999999994,11.165000000000001 2.3179999999999996,11.385000000000002 L 2.6149999999999993,11.682 C 2.8349999999999995,11.902000000000001 3.1759999999999997,11.902000000000001 3.3959999999999995,11.682 L 3.682,11.385000000000002 C 3.902,11.165000000000001 3.902,10.824 3.682,10.604000000000001 L 3.385,10.318000000000001" stroke-linejoin="round"/>', '<path class="dot" d="M 4.385,9.318 L 4.385,9.318 C 4.164999999999999,9.098 3.824,9.098 3.6039999999999996,9.318 L 3.3179999999999996,9.604000000000001 C 3.0979999999999994,9.824 3.0979999999999994,10.165000000000001 3.3179999999999996,10.385000000000002 L 3.6149999999999993,10.682 C 3.8349999999999995,10.902000000000001 4.176,10.902000000000001 4.395999999999999,10.682 L 4.682,10.385000000000002 C 4.902,10.165000000000001 4.902,9.824 4.682,9.604000000000001 L 4.385,9.318000000000001" stroke-linejoin="round"/>', '<path class="dot" d="M 5.385,10.318 L 5.385,10.318 C 5.164999999999999,10.098 4.824,10.098 4.603999999999999,10.318 L 4.318,10.604000000000001 C 4.098,10.824 4.098,11.165000000000001 4.318,11.385000000000002 L 4.614999999999999,11.682 C 4.834999999999999,11.902000000000001 5.176,11.902000000000001 5.395999999999999,11.682 L 5.682,11.385000000000002 C 5.902,11.165000000000001 5.902,10.824 5.682,10.604000000000001 L 5.385,10.318000000000001" stroke-linejoin="round"/>', '<path class="dot" d="M 5.385,12.318 L 5.385,12.318 C 5.164999999999999,12.098 4.824,12.098 4.603999999999999,12.318 L 4.318,12.604000000000001 C 4.098,12.824 4.098,13.165000000000001 4.318,13.385000000000002 L 4.614999999999999,13.682 C 4.834999999999999,13.902000000000001 5.176,13.902000000000001 5.395999999999999,13.682 L 5.682,13.385000000000002 C 5.902,13.165000000000001 5.902,12.824 5.682,12.604000000000001 L 5.385,12.318000000000001" stroke-linejoin="round"/>', '<path class="dot" d="M 3.385,14.318 L 3.385,14.318 C 3.1649999999999996,14.098 2.824,14.098 2.6039999999999996,14.318 L 2.3179999999999996,14.604000000000001 C 2.0979999999999994,14.824 2.0979999999999994,15.165000000000001 2.3179999999999996,15.385000000000002 L 2.6149999999999993,15.682 C 2.8349999999999995,15.902000000000001 3.1759999999999997,15.902000000000001 3.3959999999999995,15.682 L 3.682,15.385000000000002 C 3.902,15.165000000000001 3.902,14.824 3.682,14.604000000000001 L 3.385,14.318000000000001" stroke-linejoin="round"/>']
            
            
            <path d="M 4.0,3.0 L 3.0,4.0 L 4.0,5.0 L 5.0,4.0 L 4.0,3.0" fill="none"
            stroke="black"
            stroke-width="1"
            stroke-linecap="round"
            stroke-linejoin="round"
            />
            
            <path d="M 5.0,11.0 L 4.0,12.0 L 3.0,11.0 L 4.0,10.0 L 5.0,11.0 L 5.0,13.0 L 3.0,15.0" fill="none"
            stroke="black"
            stroke-width="1"
            stroke-linecap="round"
            stroke-linejoin="round"
            />
            
            
        </svg>