<?xml version="1.0"?><!DOCTYPE svg PUBLIC "-//W3C//DTD SVG 1.1//EN" "http://www.w3.org/Graphics/SVG/1.1/DTD/svg11.dtd"><svg xmlns="http://www.w3.org/2000/svg" xmlns:xlink="http://www.w3.org/1999/xlink" width="350" height="1000" viewBox="0 0 14 40" >
            
                ['<path class="dot" d="M 7.790943877551021,20.777193877551017 L 7.79094387755102,20.777193877551017 C 7.34094387755102,20.327193877551018 6.64344387755102,20.327193877551018 6.1934438775510205,20.777193877551017 L 5.608443877551021,21.362193877551018 C 5.15844387755102,21.812193877551017 5.15844387755102,22.50969387755102 5.608443877551021,22.959693877551018 L 6.21594387755102,23.56719387755102 C 6.66594387755102,24.01719387755102 7.3634438775510205,24.01719387755102 7.81344387755102,23.56719387755102 L 8.39844387755102,22.959693877551018 C 8.84844387755102,22.50969387755102 8.84844387755102,21.812193877551017 8.39844387755102,21.362193877551018 L 7.790943877551021,20.777193877551017" stroke-linejoin="round"/>', '<path class="dot" d="M 9.79094387755102,19.777193877551017 L 9.790943877551019,19.777193877551017 C 9.34094387755102,19.327193877551018 8.64344387755102,19.327193877551018 8.19344387755102,19.777193877551017 L 7.608443877551021,20.362193877551018 C 7.15844387755102,20.812193877551017 7.15844387755102,21.50969387755102 7.608443877551021,21.959693877551018 L 8.21594387755102,22.56719387755102 C 8.66594387755102,23.01719387755102 9.36344387755102,23.01719387755102 9.81344387755102,22.56719387755102 L 10.39844387755102,21.959693877551018 C 10.84844387755102,21.50969387755102 10.84844387755102,20.812193877551017 10.39844387755102,20.362193877551018 L 9.79094387755102,19.777193877551017" stroke-linejoin="round"/>', '<path class="dot" d="M 7.790943877551021,18.777193877551017 L 7.79094387755102,18.777193877551017 C 7.34094387755102,18.327193877551018 6.64344387755102,18.327193877551018 6.1934438775510205,18.777193877551017 L 5.608443877551021,19.362193877551018 C 5.15844387755102,19.812193877551017 5.15844387755102,20.50969387755102 5.608443877551021,20.959693877551018 L 6.21594387755102,21.56719387755102 C 6.66594387755102,22.01719387755102 7.3634438775510205,22.01719387755102 7.81344387755102,21.56719387755102 L 8.39844387755102,20.959693877551018 C 8.84844387755102,20.50969387755102 8.84844387755102,19.812193877551017 8.39844387755102,19.362193877551018 L 7.790943877551021,18.777193877551017" stroke-linejoin="round"/>', '<path class="dot" d="M 5.790943877551021,19.777193877551017 L 5.79094387755102,19.777193877551017 C 5.34094387755102,19.327193877551018 4.64344387755102,19.327193877551018 4.1934438775510205,19.777193877551017 L 3.60844387755102,20.362193877551018 C 3.1584438775510204,20.812193877551017 3.15844387755102,21.50969387755102 3.60844387755102,21.959693877551018 L 4.21594387755102,22.56719387755102 C 4.66594387755102,23.01719387755102 5.3634438775510205,23.01719387755102 5.81344387755102,22.56719387755102 L 6.398443877551021,21.959693877551018 C 6.84844387755102,21.50969387755102 6.84844387755102,20.812193877551017 6.398443877551021,20.362193877551018 L 5.790943877551021,19.777193877551017" stroke-linejoin="round"/>', '<path class="dot" d="M 7.790943877551021,20.777193877551017 L 7.79094387755102,20.777193877551017 C 7.34094387755102,20.327193877551018 6.64344387755102,20.327193877551018 6.1934438775510205,20.777193877551017 L 5.608443877551021,21.362193877551018 C 5.15844387755102,21.812193877551017 5.15844387755102,22.50969387755102 5.608443877551021,22.959693877551018 L 6.21594387755102,23.56719387755102 C 6.66594387755102,24.01719387755102 7.3634438775510205,24.01719387755102 7.81344387755102,23.56719387755102 L 8.39844387755102,22.959693877551018 C 8.84844387755102,22.50969387755102 8.84844387755102,21.812193877551017 8.39844387755102,21.362193877551018 L 7.790943877551021,20.777193877551017" stroke-linejoin="round"/>']
            
                ['<path class="dot" d="M 7.790943877551021,8.777193877551019 L 7.79094387755102,8.777193877551019 C 7.34094387755102,8.327193877551018 6.64344387755102,8.327193877551018 6.1934438775510205,8.777193877551019 L 5.608443877551021,9.362193877551018 C 5.15844387755102,9.81219387755102 5.15844387755102,10.509693877551019 5.608443877551021,10.959693877551018 L 6.21594387755102,11.567193877551018 C 6.66594387755102,12.01719387755102 7.3634438775510205,12.01719387755102 7.81344387755102,11.567193877551018 L 8.39844387755102,10.959693877551018 C 8.84844387755102,10.509693877551019 8.84844387755102,9.81219387755102 8.39844387755102,9.362193877551018 L 7.790943877551021,8.777193877551019" stroke-linejoin="round"/>', '<path class="dot" d="M 9.79094387755102,7.777193877551018 L 9.790943877551019,7.777193877551018 C 9.34094387755102,7.327193877551018 8.64344387755102,7.327193877551018 8.19344387755102,7.777193877551018 L 7.608443877551021,8.362193877551018 C 7.15844387755102,8.812193877551017 7.15844387755102,9.509693877551019 7.608443877551021,9.959693877551018 L 8.21594387755102,10.567193877551018 C 8.66594387755102,11.017193877551017 9.36344387755102,11.017193877551017 9.81344387755102,10.567193877551018 L 10.39844387755102,9.959693877551018 C 10.84844387755102,9.509693877551019 10.84844387755102,8.812193877551017 10.39844387755102,8.362193877551018 L 9.79094387755102,7.777193877551018" stroke-linejoin="round"/>', '<path class="dot" d="M 7.790943877551021,6.777193877551018 L 7.79094387755102,6.777193877551018 C 7.34094387755102,6.327193877551018 6.64344387755102,6.327193877551018 6.1934438775510205,6.777193877551018 L 5.608443877551021,7.362193877551018 C 5.15844387755102,7.812193877551018 5.15844387755102,8.509693877551019 5.608443877551021,8.959693877551018 L 6.21594387755102,9.567193877551018 C 6.66594387755102,10.017193877551017 7.3634438775510205,10.017193877551017 7.81344387755102,9.567193877551018 L 8.39844387755102,8.959693877551018 C 8.84844387755102,8.509693877551019 8.84844387755102,7.812193877551018 8.39844387755102,7.362193877551018 L 7.790943877551021,6.777193877551018" stroke-linejoin="round"/>', '<path class="dot" d="M 5.790943877551021,7.777193877551018 L 5.79094387755102,7.777193877551018 C 5.34094387755102,7.327193877551018 4.64344387755102,7.327193877551018 4.1934438775510205,7.777193877551018 L 3.60844387755102,8.362193877551018 C 3.1584438775510204,8.812193877551017 3.15844387755102,9.509693877551019 3.60844387755102,9.959693877551018 L 4.21594387755102,10.567193877551018 C 4.66594387755102,11.017193877551017 5.3634438775510205,11.017193877551017 5.81344387755102,10.567193877551018 L 6.398443877551021,9.959693877551018 C 6.84844387755102,9.509693877551019 6.84844387755102,8.812193877551017 6.398443877551021,8.362193877551018 L 5.790943877551021,7.777193877551018" stroke-linejoin="round"/>', '<path class="dot" d="M 7.790943877551021,8.777193877551019 L 7.79094387755102,8.777193877551019 C 7.34094387755102,8.327193877551018 6.64344387755102,8.327193877551018 6.1934438775510205,8.777193877551019 L 5.608443877551021,9.362193877551018 C 5.15844387755102,9.81219387755102 5.15844387755102,10.509693877551019 5.608443877551021,10.959693877551018 L 6.21594387755102,11.567193877551018 C 6.66594387755102,12.01719387755102 7.3634438775510205,12.01719387755102 7.81344387755102,11.567193877551018 L 8.39844387755102,10.959693877551018 C 8.84844387755102,10.509693877551019 8.84844387755102,9.81219387755102 8.39844387755102,9.362193877551018 L 7.790943877551021,8.777193877551019" stroke-linejoin="round"/>']
            
            
            <path d="M 7.0,22.0 L 9.0,21.0 L 7.0,20.0 L 5.0,21.0 L 7.0,22.0" fill="none"
            stroke="black"
            stroke-width="2.5"
            stroke-linecap="round"
            stroke-linejoin="round"
            />
            
            <path d="M 7.0,10.0 L 9.0,9.0 L 7.0,8.0 L 5.0,9.0 L 7.0,10.0" fill="none"
            stroke="black"
            stroke-width="2.5"
            stroke-linecap="round"
            stroke-linejoin="round"
            />
            
            
        </svg>