<?xml version="1.0"?><!DOCTYPE svg PUBLIC "-//W3C//DTD SVG 1.1//EN" "http://www.w3.org/Graphics/SVG/1.1/DTD/svg11.dtd"><svg xmlns="http://www.w3.org/2000/svg" xmlns:xlink="http://www.w3.org/1999/xlink" width="350" height="1000" viewBox="0 0 10 26" >
            
                ['<path class="dot" d="M 7.519583333333333,2.1402706333333334 L 7.519583333333332,2.1402706333333334 C 7.229583333333332,1.8502706333333334 6.780083333333333,1.8502706333333334 6.490083333333333,2.1402706333333334 L 6.113083333333333,2.5172706333333337 C 5.823083333333333,2.8072706333333333 5.823083333333333,3.2567706333333337 6.113083333333333,3.5467706333333338 L 6.504583333333333,3.9382706333333335 C 6.794583333333333,4.2282706333333335 7.244083333333332,4.2282706333333335 7.534083333333332,3.9382706333333335 L 7.911083333333333,3.5467706333333338 C 8.201083333333333,3.2567706333333337 8.201083333333333,2.8072706333333337 7.911083333333333,2.5172706333333332 L 7.519583333333333,2.1402706333333334" stroke-linejoin="round"/>', '<path class="dot" d="M 5.519583333333333,0.1402708333333331 L 5.519583333333333,0.1402708333333331 C 5.229583333333333,-0.14972916666666694 4.780083333333333,-0.149729166666667 4.490083333333333,0.1402708333333331 L 4.113083333333333,0.5172708333333332 C 3.823083333333333,0.8072708333333332 3.823083333333333,1.2567708333333332 4.113083333333333,1.5467708333333332 L 4.504583333333333,1.938270833333333 C 4.794583333333333,2.228270833333333 5.244083333333333,2.228270833333333 5.534083333333333,1.938270833333333 L 5.911083333333334,1.5467708333333332 C 6.201083333333333,1.2567708333333332 6.201083333333333,0.8072708333333333 5.911083333333334,0.5172708333333331 L 5.519583333333333,0.14027083333333312" stroke-linejoin="round"/>', '<path class="dot" d="M 3.5195833333333333,0.1402708333333331 L 3.5195833333333333,0.1402708333333331 C 3.2295833333333333,-0.14972916666666694 2.7800833333333332,-0.149729166666667 2.490083333333333,0.1402708333333331 L 2.113083333333333,0.5172708333333332 C 1.8230833333333332,0.8072708333333332 1.8230833333333332,1.2567708333333332 2.113083333333333,1.5467708333333332 L 2.504583333333333,1.938270833333333 C 2.7945833333333328,2.228270833333333 3.244083333333333,2.228270833333333 3.5340833333333332,1.938270833333333 L 3.9110833333333335,1.5467708333333332 C 4.201083333333333,1.2567708333333332 4.201083333333333,0.8072708333333333 3.9110833333333335,0.5172708333333331 L 3.5195833333333333,0.14027083333333312" stroke-linejoin="round"/>', '<path class="dot" d="M 1.5195833333333333,2.1402706333333334 L 1.519583333333333,2.1402706333333334 C 1.2295833333333333,1.8502706333333334 0.7800833333333331,1.8502706333333334 0.4900833333333331,2.1402706333333334 L 0.11308333333333317,2.5172706333333337 C -0.17691666666666686,2.8072706333333333 -0.17691666666666692,3.2567706333333337 0.11308333333333317,3.5467706333333338 L 0.504583333333333,3.9382706333333335 C 0.794583333333333,4.2282706333333335 1.2440833333333332,4.2282706333333335 1.534083333333333,3.9382706333333335 L 1.9110833333333335,3.5467706333333338 C 2.2010833333333335,3.2567706333333337 2.2010833333333335,2.8072706333333337 1.9110833333333335,2.5172706333333332 L 1.5195833333333335,2.1402706333333334" stroke-linejoin="round"/>', '<path class="dot" d="M 1.5195833333333333,3.1402708333333327 L 1.519583333333333,3.1402708333333327 C 1.2295833333333333,2.8502708333333326 0.7800833333333331,2.8502708333333326 0.4900833333333331,3.1402708333333327 L 0.11308333333333317,3.517270833333333 C -0.17691666666666686,3.807270833333333 -0.17691666666666692,4.2567708333333325 0.11308333333333317,4.546770833333333 L 0.504583333333333,4.938270833333332 C 0.794583333333333,5.228270833333333 1.2440833333333332,5.228270833333333 1.534083333333333,4.938270833333332 L 1.9110833333333335,4.546770833333333 C 2.2010833333333335,4.2567708333333325 2.2010833333333335,3.807270833333333 1.9110833333333335,3.517270833333333 L 1.5195833333333335,3.140270833333333" stroke-linejoin="round"/>', '<path class="dot" d="M 2.5195833333333333,5.140270833333333 L 2.5195833333333333,5.140270833333333 C 2.2295833333333333,4.850270833333333 1.7800833333333332,4.850270833333333 1.4900833333333332,5.140270833333333 L 1.1130833333333332,5.517270833333333 C 0.8230833333333332,5.807270833333333 0.8230833333333331,6.2567708333333325 1.1130833333333332,6.546770833333333 L 1.5045833333333332,6.938270833333332 C 1.794583333333333,7.228270833333333 2.244083333333333,7.228270833333333 2.5340833333333332,6.938270833333332 L 2.9110833333333335,6.546770833333333 C 3.2010833333333335,6.2567708333333325 3.2010833333333335,5.807270833333333 2.9110833333333335,5.517270833333333 L 2.5195833333333333,5.140270833333333" stroke-linejoin="round"/>', '<path class="dot" d="M 3.5195833333333333,6.1402703333333335 L 3.5195833333333333,6.1402703333333335 C 3.2295833333333333,5.8502703333333335 2.7800833333333332,5.8502703333333335 2.490083333333333,6.1402703333333335 L 2.113083333333333,6.517270333333333 C 1.8230833333333332,6.807270333333333 1.8230833333333332,7.256770333333334 2.113083333333333,7.546770333333333 L 2.504583333333333,7.9382703333333335 C 2.7945833333333328,8.228270333333333 3.244083333333333,8.228270333333333 3.5340833333333332,7.9382703333333335 L 3.9110833333333335,7.546770333333333 C 4.201083333333333,7.256770333333334 4.201083333333333,6.807270333333333 3.9110833333333335,6.517270333333333 L 3.5195833333333333,6.1402703333333335" stroke-linejoin="round"/>', '<path class="dot" d="M 5.519583333333333,7.140270833333333 L 5.519583333333333,7.140270833333333 C 5.229583333333333,6.850270833333333 4.780083333333333,6.850270833333333 4.490083333333333,7.140270833333333 L 4.113083333333333,7.517270833333333 C 3.823083333333333,7.807270833333333 3.823083333333333,8.256770833333333 4.113083333333333,8.546770833333333 L 4.504583333333333,8.938270833333332 C 4.794583333333333,9.228270833333333 5.244083333333333,9.228270833333333 5.534083333333333,8.938270833333332 L 5.911083333333334,8.546770833333333 C 6.201083333333333,8.256770833333333 6.201083333333333,7.807270833333333 5.911083333333334,7.517270833333333 L 5.519583333333333,7.140270833333333" stroke-linejoin="round"/>', '<path class="dot" d="M 6.519583333333333,8.140270833333332 L 6.519583333333332,8.140270833333332 C 6.229583333333332,7.850270833333333 5.780083333333333,7.850270833333333 5.490083333333333,8.140270833333332 L 5.113083333333333,8.517270833333333 C 4.823083333333333,8.807270833333334 4.823083333333333,9.256770833333333 5.113083333333333,9.546770833333333 L 5.504583333333333,9.938270833333332 C 5.794583333333333,10.228270833333333 6.244083333333332,10.228270833333333 6.534083333333332,9.938270833333332 L 6.911083333333333,9.546770833333333 C 7.201083333333333,9.256770833333333 7.201083333333333,8.807270833333334 6.911083333333333,8.517270833333333 L 6.519583333333333,8.140270833333332" stroke-linejoin="round"/>', '<path class="dot" d="M 7.519583333333333,10.140270833333332 L 7.519583333333332,10.140270833333332 C 7.229583333333332,9.850270833333333 6.780083333333333,9.850270833333333 6.490083333333333,10.140270833333332 L 6.113083333333333,10.517270833333333 C 5.823083333333333,10.807270833333334 5.823083333333333,11.256770833333333 6.113083333333333,11.546770833333333 L 6.504583333333333,11.938270833333332 C 6.794583333333333,12.228270833333333 7.244083333333332,12.228270833333333 7.534083333333332,11.938270833333332 L 7.911083333333333,11.546770833333333 C 8.201083333333333,11.256770833333333 8.201083333333333,10.807270833333334 7.911083333333333,10.517270833333333 L 7.519583333333333,10.140270833333332" stroke-linejoin="round"/>', '<path class="dot" d="M 7.519583333333333,12.140270833333332 L 7.519583333333332,12.140270833333332 C 7.229583333333332,11.850270833333333 6.780083333333333,11.850270833333333 6.490083333333333,12.140270833333332 L 6.113083333333333,12.517270833333333 C 5.823083333333333,12.807270833333334 5.823083333333333,13.256770833333333 6.113083333333333,13.546770833333333 L 6.504583333333333,13.938270833333332 C 6.794583333333333,14.228270833333333 7.244083333333332,14.228270833333333 7.534083333333332,13.938270833333332 L 7.911083333333333,13.546770833333333 C 8.201083333333333,13.256770833333333 8.201083333333333,12.807270833333334 7.911083333333333,12.517270833333333 L 7.519583333333333,12.140270833333332" stroke-linejoin="round"/>', '<path class="dot" d="M 5.519583333333333,14.140270833333332 L 5.519583333333333,14.140270833333332 C 5.229583333333333,13.850270833333333 4.780083333333333,13.850270833333333 4.490083333333333,14.140270833333332 L 4.113083333333333,14.517270833333333 C 3.823083333333333,14.807270833333334 3.823083333333333,15.256770833333333 4.113083333333333,15.546770833333333 L 4.504583333333333,15.938270833333332 C 4.794583333333333,16.228270833333333 5.244083333333333,16.228270833333333 5.534083333333333,15.938270833333332 L 5.911083333333334,15.546770833333333 C 6.201083333333333,15.256770833333333 6.201083333333333,14.807270833333334 5.911083333333334,14.517270833333333 L 5.519583333333333,14.140270833333332" stroke-linejoin="round"/>', '<path class="dot" d="M 3.5195833333333333,14.140270833333332 L 3.5195833333333333,14.140270833333332 C 3.2295833333333333,13.850270833333333 2.7800833333333332,13.850270833333333 2.490083333333333,14.140270833333332 L 2.113083333333333,14.517270833333333 C 1.8230833333333332,14.807270833333334 1.8230833333333332,15.256770833333333 2.113083333333333,15.546770833333333 L 2.504583333333333,15.938270833333332 C 2.7945833333333328,16.228270833333333 3.244083333333333,16.228270833333333 3.5340833333333332,15.938270833333332 L 3.9110833333333335,15.546770833333333 C 4.201083333333333,15.256770833333333 4.201083333333333,14.807270833333334 3.9110833333333335,14.517270833333333 L 3.5195833333333333,14.140270833333332" stroke-linejoin="round"/>', '<path class="dot" d="M 1.5195833333333333,12.140270833333332 L 1.519583333333333,12.140270833333332 C 1.2295833333333333,11.850270833333333 0.7800833333333331,11.850270833333333 0.4900833333333331,12.140270833333332 L 0.11308333333333317,12.517270833333333 C -0.17691666666666686,12.807270833333334 -0.17691666666666692,13.256770833333333 0.11308333333333317,13.546770833333333 L 0.504583333333333,13.938270833333332 C 0.794583333333333,14.228270833333333 1.2440833333333332,14.228270833333333 1.534083333333333,13.938270833333332 L 1.9110833333333335,13.546770833333333 C 2.2010833333333335,13.256770833333333 2.2010833333333335,12.807270833333334 1.9110833333333335,12.517270833333333 L 1.5195833333333335,12.140270833333332" stroke-linejoin="round"/>']
            
                ['<path class="dot" d="M 3.5195833333333333,-2.8597291666666673 L 3.5195833333333333,-2.8597291666666673 C 3.2295833333333333,-3.1497291666666674 2.7800833333333332,-3.1497291666666674 2.490083333333333,-2.8597291666666673 L 2.113083333333333,-2.482729166666667 C 1.8230833333333332,-2.192729166666667 1.8230833333333332,-1.743229166666667 2.113083333333333,-1.453229166666667 L 2.504583333333333,-1.0617291666666673 C 2.7945833333333328,-0.7717291666666672 3.244083333333333,-0.7717291666666672 3.5340833333333332,-1.0617291666666673 L 3.9110833333333335,-1.453229166666667 C 4.201083333333333,-1.743229166666667 4.201083333333333,-2.192729166666667 3.9110833333333335,-2.482729166666667 L 3.5195833333333333,-2.859729166666667" stroke-linejoin="round"/>', '<path class="dot" d="M 5.519583333333333,-2.8597291666666673 L 5.519583333333333,-2.8597291666666673 C 5.229583333333333,-3.1497291666666674 4.780083333333333,-3.1497291666666674 4.490083333333333,-2.8597291666666673 L 4.113083333333333,-2.482729166666667 C 3.823083333333333,-2.192729166666667 3.823083333333333,-1.743229166666667 4.113083333333333,-1.453229166666667 L 4.504583333333333,-1.0617291666666673 C 4.794583333333333,-0.7717291666666672 5.244083333333333,-0.7717291666666672 5.534083333333333,-1.0617291666666673 L 5.911083333333334,-1.453229166666667 C 6.201083333333333,-1.743229166666667 6.201083333333333,-2.192729166666667 5.911083333333334,-2.482729166666667 L 5.519583333333333,-2.859729166666667" stroke-linejoin="round"/>', '<path class="dot" d="M 5.519583333333333,17.140270833333336 L 5.519583333333333,17.140270833333336 C 5.229583333333333,16.850270833333333 4.780083333333333,16.850270833333333 4.490083333333333,17.140270833333336 L 4.113083333333333,17.517270833333335 C 3.823083333333333,17.807270833333334 3.823083333333333,18.256770833333334 4.113083333333333,18.546770833333333 L 4.504583333333333,18.938270833333334 C 4.794583333333333,19.228270833333333 5.244083333333333,19.228270833333333 5.534083333333333,18.938270833333334 L 5.911083333333334,18.546770833333333 C 6.201083333333333,18.256770833333334 6.201083333333333,17.807270833333334 5.911083333333334,17.517270833333335 L 5.519583333333333,17.140270833333336" stroke-linejoin="round"/>']
            
            
            <path d="M 7.0,2.9999998000000003 L 5.0,1.0 L 3.0,1.0 L 1.0,2.9999998000000003 L 1.0,4.0 L 2.0,6.0 L 3.0,6.9999995 L 5.0,8.0 L 6.0,9.0 L 7.0,11.0 L 7.0,13.0 L 5.0,15.0 L 3.0,15.0 L 1.0,13.0" fill="none"
            stroke="black"
            stroke-width="1.5"
            stroke-linecap="round"
            stroke-linejoin="round"
            />
            
            <path d="M 3.0,-2.0 L 3.0,18.0 M 5.0,-2.0 L 5.0,18.0" fill="none"
            stroke="black"
            stroke-width="1.5"
            stroke-linecap="round"
            stroke-linejoin="round"
            />
            
            
        </svg>