<?xml version="1.0"?><!DOCTYPE svg PUBLIC "-//W3C//DTD SVG 1.1//EN" "http://www.w3.org/Graphics/SVG/1.1/DTD/svg11.dtd"><svg xmlns="http://www.w3.org/2000/svg" xmlns:xlink="http://www.w3.org/1999/xlink" width="350" height="1000" viewBox="0 0 10 26" >
            
                ['<path class="dot" d="M 7.5195834333333345,13.140271433333332 L 7.519583433333334,13.140271433333332 C 7.2295834333333335,12.850271433333333 6.780083433333334,12.850271433333333 6.490083433333334,13.140271433333332 L 6.113083433333334,13.517271433333333 C 5.823083433333334,13.807271433333334 5.823083433333334,14.256771433333332 6.113083433333334,14.546771433333333 L 6.504583433333334,14.938271433333332 C 6.794583433333334,15.228271433333333 7.2440834333333335,15.228271433333333 7.5340834333333335,14.938271433333332 L 7.911083433333334,14.546771433333333 C 8.201083433333334,14.256771433333332 8.201083433333334,13.807271433333334 7.911083433333334,13.517271433333333 L 7.5195834333333345,13.140271433333332" stroke-linejoin="round"/>', '<path class="dot" d="M 8.519583433333334,11.140271333333333 L 8.519583433333334,11.140271333333333 C 8.229583433333334,10.850271333333334 7.780083433333334,10.850271333333334 7.490083433333334,11.140271333333333 L 7.113083433333334,11.517271333333333 C 6.823083433333334,11.807271333333333 6.823083433333334,12.256771333333333 7.113083433333334,12.546771333333334 L 7.504583433333334,12.938271333333333 C 7.794583433333334,13.228271333333334 8.244083433333333,13.228271333333334 8.534083433333334,12.938271333333333 L 8.911083433333335,12.546771333333334 C 9.201083433333334,12.256771333333333 9.201083433333334,11.807271333333334 8.911083433333335,11.517271333333333 L 8.519583433333334,11.140271333333333" stroke-linejoin="round"/>', '<path class="dot" d="M 8.519583433333334,7.140270833333333 L 8.519583433333334,7.140270833333333 C 8.229583433333334,6.850270833333333 7.780083433333334,6.850270833333333 7.490083433333334,7.140270833333333 L 7.113083433333334,7.517270833333333 C 6.823083433333334,7.807270833333333 6.823083433333334,8.256770833333333 7.113083433333334,8.546770833333333 L 7.504583433333334,8.938270833333332 C 7.794583433333334,9.228270833333333 8.244083433333333,9.228270833333333 8.534083433333334,8.938270833333332 L 8.911083433333335,8.546770833333333 C 9.201083433333334,8.256770833333333 9.201083433333334,7.807270833333333 8.911083433333335,7.517270833333333 L 8.519583433333334,7.140270833333333" stroke-linejoin="round"/>', '<path class="dot" d="M 7.5195834333333345,5.140270613333333 L 7.519583433333334,5.140270613333333 C 7.2295834333333335,4.850270613333333 6.780083433333334,4.850270613333333 6.490083433333334,5.140270613333333 L 6.113083433333334,5.5172706133333325 C 5.823083433333334,5.8072706133333325 5.823083433333334,6.256770613333332 6.113083433333334,6.546770613333333 L 6.504583433333334,6.938270613333332 C 6.794583433333334,7.228270613333333 7.2440834333333335,7.228270613333333 7.5340834333333335,6.938270613333332 L 7.911083433333334,6.546770613333333 C 8.201083433333334,6.256770613333332 8.201083433333334,5.8072706133333325 7.911083433333334,5.5172706133333325 L 7.5195834333333345,5.140270613333333" stroke-linejoin="round"/>', '<path class="dot" d="M 6.519583333333333,4.140270833333333 L 6.519583333333332,4.140270833333333 C 6.229583333333332,3.8502708333333326 5.780083333333333,3.8502708333333326 5.490083333333333,4.140270833333333 L 5.113083333333333,4.517270833333333 C 4.823083333333333,4.807270833333333 4.823083333333333,5.2567708333333325 5.113083333333333,5.546770833333333 L 5.504583333333333,5.938270833333332 C 5.794583333333333,6.228270833333333 6.244083333333332,6.228270833333333 6.534083333333332,5.938270833333332 L 6.911083333333333,5.546770833333333 C 7.201083333333333,5.2567708333333325 7.201083333333333,4.807270833333333 6.911083333333333,4.517270833333333 L 6.519583333333333,4.140270833333333" stroke-linejoin="round"/>', '<path class="dot" d="M 4.519583333333333,4.140270833333333 L 4.519583333333333,4.140270833333333 C 4.229583333333333,3.8502708333333326 3.7800833333333332,3.8502708333333326 3.490083333333333,4.140270833333333 L 3.113083333333333,4.517270833333333 C 2.823083333333333,4.807270833333333 2.823083333333333,5.2567708333333325 3.113083333333333,5.546770833333333 L 3.504583333333333,5.938270833333332 C 3.7945833333333328,6.228270833333333 4.244083333333333,6.228270833333333 4.534083333333333,5.938270833333332 L 4.911083333333334,5.546770833333333 C 5.201083333333333,5.2567708333333325 5.201083333333333,4.807270833333333 4.911083333333334,4.517270833333333 L 4.519583333333333,4.140270833333333" stroke-linejoin="round"/>', '<path class="dot" d="M 3.5195833333333333,5.140270613333333 L 3.5195833333333333,5.140270613333333 C 3.2295833333333333,4.850270613333333 2.7800833333333332,4.850270613333333 2.490083333333333,5.140270613333333 L 2.113083333333333,5.5172706133333325 C 1.8230833333333332,5.8072706133333325 1.8230833333333332,6.256770613333332 2.113083333333333,6.546770613333333 L 2.504583333333333,6.938270613333332 C 2.7945833333333328,7.228270613333333 3.244083333333333,7.228270613333333 3.5340833333333332,6.938270613333332 L 3.9110833333333335,6.546770613333333 C 4.201083333333333,6.256770613333332 4.201083333333333,5.8072706133333325 3.9110833333333335,5.5172706133333325 L 3.5195833333333333,5.140270613333333" stroke-linejoin="round"/>', '<path class="dot" d="M 2.5195833333333333,7.140270833333333 L 2.5195833333333333,7.140270833333333 C 2.2295833333333333,6.850270833333333 1.7800833333333332,6.850270833333333 1.4900833333333332,7.140270833333333 L 1.1130833333333332,7.517270833333333 C 0.8230833333333332,7.807270833333333 0.8230833333333331,8.256770833333333 1.1130833333333332,8.546770833333333 L 1.5045833333333332,8.938270833333332 C 1.794583333333333,9.228270833333333 2.244083333333333,9.228270833333333 2.5340833333333332,8.938270833333332 L 2.9110833333333335,8.546770833333333 C 3.2010833333333335,8.256770833333333 3.2010833333333335,7.807270833333333 2.9110833333333335,7.517270833333333 L 2.5195833333333333,7.140270833333333" stroke-linejoin="round"/>', '<path class="dot" d="M 2.5195833333333333,11.140271133333332 L 2.5195833333333333,11.140271133333332 C 2.2295833333333333,10.850271133333333 1.7800833333333332,10.850271133333333 1.4900833333333332,11.140271133333332 L 1.1130833333333332,11.517271133333333 C 0.8230833333333332,11.807271133333334 0.8230833333333331,12.256771133333332 1.1130833333333332,12.546771133333333 L 1.5045833333333332,12.938271133333332 C 1.794583333333333,13.228271133333333 2.244083333333333,13.228271133333333 2.5340833333333332,12.938271133333332 L 2.9110833333333335,12.546771133333333 C 3.2010833333333335,12.256771133333332 3.2010833333333335,11.807271133333334 2.9110833333333335,11.517271133333333 L 2.5195833333333333,11.140271133333332" stroke-linejoin="round"/>', '<path class="dot" d="M 3.5195833333333333,13.140271133333332 L 3.5195833333333333,13.140271133333332 C 3.2295833333333333,12.850271133333333 2.7800833333333332,12.850271133333333 2.490083333333333,13.140271133333332 L 2.113083333333333,13.517271133333333 C 1.8230833333333332,13.807271133333334 1.8230833333333332,14.256771133333332 2.113083333333333,14.546771133333333 L 2.504583333333333,14.938271133333332 C 2.7945833333333328,15.228271133333333 3.244083333333333,15.228271133333333 3.5340833333333332,14.938271133333332 L 3.9110833333333335,14.546771133333333 C 4.201083333333333,14.256771133333332 4.201083333333333,13.807271133333334 3.9110833333333335,13.517271133333333 L 3.5195833333333333,13.140271133333332" stroke-linejoin="round"/>', '<path class="dot" d="M 4.519583333333333,14.140270833333332 L 4.519583333333333,14.140270833333332 C 4.229583333333333,13.850270833333333 3.7800833333333332,13.850270833333333 3.490083333333333,14.140270833333332 L 3.113083333333333,14.517270833333333 C 2.823083333333333,14.807270833333334 2.823083333333333,15.256770833333333 3.113083333333333,15.546770833333333 L 3.504583333333333,15.938270833333332 C 3.7945833333333328,16.228270833333333 4.244083333333333,16.228270833333333 4.534083333333333,15.938270833333332 L 4.911083333333334,15.546770833333333 C 5.201083333333333,15.256770833333333 5.201083333333333,14.807270833333334 4.911083333333334,14.517270833333333 L 4.519583333333333,14.140270833333332" stroke-linejoin="round"/>', '<path class="dot" d="M 6.519583333333333,14.140270833333332 L 6.519583333333332,14.140270833333332 C 6.229583333333332,13.850270833333333 5.780083333333333,13.850270833333333 5.490083333333333,14.140270833333332 L 5.113083333333333,14.517270833333333 C 4.823083333333333,14.807270833333334 4.823083333333333,15.256770833333333 5.113083333333333,15.546770833333333 L 5.504583333333333,15.938270833333332 C 5.794583333333333,16.228270833333333 6.244083333333332,16.228270833333333 6.534083333333332,15.938270833333332 L 6.911083333333333,15.546770833333333 C 7.201083333333333,15.256770833333333 7.201083333333333,14.807270833333334 6.911083333333333,14.517270833333333 L 6.519583333333333,14.140270833333332" stroke-linejoin="round"/>', '<path class="dot" d="M 7.5195834333333345,13.140271433333332 L 7.519583433333334,13.140271433333332 C 7.2295834333333335,12.850271433333333 6.780083433333334,12.850271433333333 6.490083433333334,13.140271433333332 L 6.113083433333334,13.517271433333333 C 5.823083433333334,13.807271433333334 5.823083433333334,14.256771433333332 6.113083433333334,14.546771433333333 L 6.504583433333334,14.938271433333332 C 6.794583433333334,15.228271433333333 7.2440834333333335,15.228271433333333 7.5340834333333335,14.938271433333332 L 7.911083433333334,14.546771433333333 C 8.201083433333334,14.256771433333332 8.201083433333334,13.807271433333334 7.911083433333334,13.517271433333333 L 7.5195834333333345,13.140271433333332" stroke-linejoin="round"/>']
            
                ['<path class="dot" d="M 9.519583333333333,0.14027113333333305 L 9.519583333333333,0.14027113333333305 C 9.229583333333332,-0.149728866666667 8.780083333333332,-0.14972886666666704 8.490083333333333,0.14027113333333305 L 8.113083333333332,0.5172711333333332 C 7.823083333333333,0.8072711333333331 7.823083333333333,1.2567711333333331 8.113083333333332,1.5467711333333332 L 8.504583333333333,1.938271133333333 C 8.794583333333332,2.228271133333333 9.244083333333332,2.228271133333333 9.534083333333333,1.938271133333333 L 9.911083333333334,1.5467711333333332 C 10.201083333333333,1.2567711333333331 10.201083333333333,0.8072711333333332 9.911083333333334,0.5172711333333331 L 9.519583333333333,0.14027113333333308" stroke-linejoin="round"/>', '<path class="dot" d="M 7.519583333333333,2.140270833333333 L 7.519583333333332,2.140270833333333 C 7.229583333333332,1.850270833333333 6.780083333333333,1.850270833333333 6.490083333333333,2.140270833333333 L 6.113083333333333,2.5172708333333333 C 5.823083333333333,2.807270833333333 5.823083333333333,3.2567708333333334 6.113083333333333,3.5467708333333334 L 6.504583333333333,3.938270833333333 C 6.794583333333333,4.228270833333333 7.244083333333332,4.228270833333333 7.534083333333332,3.938270833333333 L 7.911083333333333,3.5467708333333334 C 8.201083333333333,3.2567708333333334 8.201083333333333,2.8072708333333334 7.911083333333333,2.517270833333333 L 7.519583333333333,2.140270833333333" stroke-linejoin="round"/>', '<path class="dot" d="M 5.519583333333333,0.14027113333333305 L 5.519583333333333,0.14027113333333305 C 5.229583333333333,-0.149728866666667 4.780083333333333,-0.14972886666666704 4.490083333333333,0.14027113333333305 L 4.113083333333333,0.5172711333333332 C 3.823083333333333,0.8072711333333331 3.823083333333333,1.2567711333333331 4.113083333333333,1.5467711333333332 L 4.504583333333333,1.938271133333333 C 4.794583333333333,2.228271133333333 5.244083333333333,2.228271133333333 5.534083333333333,1.938271133333333 L 5.911083333333334,1.5467711333333332 C 6.201083333333333,1.2567711333333331 6.201083333333333,0.8072711333333332 5.911083333333334,0.5172711333333331 L 5.519583333333333,0.14027113333333308" stroke-linejoin="round"/>', '<path class="dot" d="M 3.5195833333333333,2.140270833333333 L 3.5195833333333333,2.140270833333333 C 3.2295833333333333,1.850270833333333 2.7800833333333332,1.850270833333333 2.490083333333333,2.140270833333333 L 2.113083333333333,2.5172708333333333 C 1.8230833333333332,2.807270833333333 1.8230833333333332,3.2567708333333334 2.113083333333333,3.5467708333333334 L 2.504583333333333,3.938270833333333 C 2.7945833333333328,4.228270833333333 3.244083333333333,4.228270833333333 3.5340833333333332,3.938270833333333 L 3.9110833333333335,3.5467708333333334 C 4.201083333333333,3.2567708333333334 4.201083333333333,2.8072708333333334 3.9110833333333335,2.517270833333333 L 3.5195833333333333,2.140270833333333" stroke-linejoin="round"/>']
            
            
            <path d="M 7.0000001,14.0000006 L 8.000000100000001,12.0000005 L 8.000000100000001,8.0 L 7.0000001,5.99999978 L 6.0,5.0 L 4.0,5.0 L 3.0,5.99999978 L 2.0,8.0 L 2.0,12.0000003 L 3.0,14.0000003 L 4.0,15.0 L 6.0,15.0 L 7.0000001,14.0000006" fill="none"
            stroke="black"
            stroke-width="1.5"
            stroke-linecap="round"
            stroke-linejoin="round"
            />
            
            <path d="M 9.0,1.0000003 L 7.0,3.0 L 5.0,1.0000003 L 3.0,3.0" fill="none"
            stroke="black"
            stroke-width="1.5"
            stroke-linecap="round"
            stroke-linejoin="round"
            />
            
            
        </svg>