<?xml version="1.0"?><!DOCTYPE svg PUBLIC "-//W3C//DTD SVG 1.1//EN" "http://www.w3.org/Graphics/SVG/1.1/DTD/svg11.dtd"><svg xmlns="http://www.w3.org/2000/svg" xmlns:xlink="http://www.w3.org/1999/xlink" width="350" height="1000" viewBox="0 0 7 17" >
            
                ['<path class="dot" d="M 6.385,5.3180000000000005 L 6.385,5.3180000000000005 C 6.164999999999999,5.098000000000001 5.824,5.098000000000001 5.603999999999999,5.3180000000000005 L 5.318,5.604000000000001 C 5.098,5.824000000000001 5.098,6.165000000000001 5.318,6.385000000000001 L 5.614999999999999,6.682 C 5.834999999999999,6.902 6.176,6.902 6.395999999999999,6.682 L 6.682,6.385000000000001 C 6.902,6.165000000000001 6.902,5.824000000000001 6.682,5.604000000000001 L 6.385,5.3180000000000005" stroke-linejoin="round"/>', '<path class="dot" d="M 4.385,3.318 L 4.385,3.318 C 4.164999999999999,3.098 3.824,3.098 3.6039999999999996,3.318 L 3.3179999999999996,3.604 C 3.0979999999999994,3.8240000000000003 3.0979999999999994,4.165 3.3179999999999996,4.385 L 3.6149999999999993,4.682 C 3.8349999999999995,4.902 4.176,4.902 4.395999999999999,4.682 L 4.682,4.385 C 4.902,4.165 4.902,3.8240000000000003 4.682,3.604 L 4.385,3.318" stroke-linejoin="round"/>', '<path class="dot" d="M 2.385,5.3180000000000005 L 2.385,5.3180000000000005 C 2.165,5.098000000000001 1.8239999999999998,5.098000000000001 1.6039999999999999,5.3180000000000005 L 1.3179999999999998,5.604000000000001 C 1.0979999999999999,5.824000000000001 1.0979999999999996,6.165000000000001 1.3179999999999998,6.385000000000001 L 1.6149999999999998,6.682 C 1.8349999999999997,6.902 2.176,6.902 2.396,6.682 L 2.6820000000000004,6.385000000000001 C 2.902,6.165000000000001 2.902,5.824000000000001 2.6820000000000004,5.604000000000001 L 2.385,5.3180000000000005" stroke-linejoin="round"/>', '<path class="dot" d="M 2.385,8.318 L 2.385,8.318 C 2.165,8.098 1.8239999999999998,8.098 1.6039999999999999,8.318 L 1.3179999999999998,8.604000000000001 C 1.0979999999999999,8.824 1.0979999999999996,9.165000000000001 1.3179999999999998,9.385000000000002 L 1.6149999999999998,9.682 C 1.8349999999999997,9.902000000000001 2.176,9.902000000000001 2.396,9.682 L 2.6820000000000004,9.385000000000002 C 2.902,9.165000000000001 2.902,8.824 2.6820000000000004,8.604000000000001 L 2.385,8.318000000000001" stroke-linejoin="round"/>', '<path class="dot" d="M 4.385,10.318 L 4.385,10.318 C 4.164999999999999,10.098 3.824,10.098 3.6039999999999996,10.318 L 3.3179999999999996,10.604000000000001 C 3.0979999999999994,10.824 3.0979999999999994,11.165000000000001 3.3179999999999996,11.385000000000002 L 3.6149999999999993,11.682 C 3.8349999999999995,11.902000000000001 4.176,11.902000000000001 4.395999999999999,11.682 L 4.682,11.385000000000002 C 4.902,11.165000000000001 4.902,10.824 4.682,10.604000000000001 L 4.385,10.318000000000001" stroke-linejoin="round"/>', '<path class="dot" d="M 6.385,8.318 L 6.385,8.318 C 6.164999999999999,8.098 5.824,8.098 5.603999999999999,8.318 L 5.318,8.604000000000001 C 5.098,8.824 5.098,9.165000000000001 5.318,9.385000000000002 L 5.614999999999999,9.682 C 5.834999999999999,9.902000000000001 6.176,9.902000000000001 6.395999999999999,9.682 L 6.682,9.385000000000002 C 6.902,9.165000000000001 6.902,8.824 6.682,8.604000000000001 L 6.385,8.318000000000001" stroke-linejoin="round"/>']
            
                ['<path class="dot" d="M 2.385,6.3180000000000005 L 2.385,6.3180000000000005 C 2.165,6.098000000000001 1.8239999999999998,6.098000000000001 1.6039999999999999,6.3180000000000005 L 1.3179999999999998,6.604000000000001 C 1.0979999999999999,6.824000000000001 1.0979999999999996,7.165000000000001 1.3179999999999998,7.385000000000001 L 1.6149999999999998,7.682 C 1.8349999999999997,7.902 2.176,7.902 2.396,7.682 L 2.6820000000000004,7.385000000000001 C 2.902,7.165000000000001 2.902,6.824000000000001 2.6820000000000004,6.604000000000001 L 2.385,6.3180000000000005" stroke-linejoin="round"/>', '<path class="dot" d="M 6.385,6.3180000000000005 L 6.385,6.3180000000000005 C 6.164999999999999,6.098000000000001 5.824,6.098000000000001 5.603999999999999,6.3180000000000005 L 5.318,6.604000000000001 C 5.098,6.824000000000001 5.098,7.165000000000001 5.318,7.385000000000001 L 5.614999999999999,7.682 C 5.834999999999999,7.902 6.176,7.902 6.395999999999999,7.682 L 6.682,7.385000000000001 C 6.902,7.165000000000001 6.902,6.824000000000001 6.682,6.604000000000001 L 6.385,6.3180000000000005" stroke-linejoin="round"/>', '<path class="dot" d="M 6.385,5.3180000000000005 L 6.385,5.3180000000000005 C 6.164999999999999,5.098000000000001 5.824,5.098000000000001 5.603999999999999,5.3180000000000005 L 5.318,5.604000000000001 C 5.098,5.824000000000001 5.098,6.165000000000001 5.318,6.385000000000001 L 5.614999999999999,6.682 C 5.834999999999999,6.902 6.176,6.902 6.395999999999999,6.682 L 6.682,6.385000000000001 C 6.902,6.165000000000001 6.902,5.824000000000001 6.682,5.604000000000001 L 6.385,5.3180000000000005" stroke-linejoin="round"/>']
            
                ['<path class="dot" d="M 3.385,1.318 L 3.385,1.318 C 3.1649999999999996,1.0979999999999999 2.824,1.0979999999999999 2.6039999999999996,1.318 L 2.3179999999999996,1.604 C 2.0979999999999994,1.8240000000000003 2.0979999999999994,2.165 2.3179999999999996,2.3850000000000002 L 2.6149999999999993,2.682 C 2.8349999999999995,2.902 3.1759999999999997,2.902 3.3959999999999995,2.682 L 3.682,2.3850000000000002 C 3.902,2.165 3.902,1.8240000000000003 3.682,1.604 L 3.385,1.318" stroke-linejoin="round"/>', '<path class="dot" d="M 5.385,0.31800000000000006 L 5.385,0.31800000000000006 C 5.164999999999999,0.09799999999999998 4.824,0.09799999999999995 4.603999999999999,0.31800000000000006 L 4.318,0.6040000000000002 C 4.098,0.8240000000000002 4.098,1.1650000000000003 4.318,1.3850000000000002 L 4.614999999999999,1.682 C 4.834999999999999,1.902 5.176,1.902 5.395999999999999,1.682 L 5.682,1.3850000000000002 C 5.902,1.165 5.902,0.8240000000000002 5.682,0.6040000000000001 L 5.385,0.31800000000000006" stroke-linejoin="round"/>']
            
            
            <path d="M 6.0,6.0 L 4.0,4.0 L 2.0,6.0 L 2.0,9.0 L 4.0,11.0 L 6.0,9.0" fill="none"
            stroke="black"
            stroke-width="1"
            stroke-linecap="round"
            stroke-linejoin="round"
            />
            
            <path d="M 2.0,7.0 L 6.0,7.0 L 6.0,6.0" fill="none"
            stroke="black"
            stroke-width="1"
            stroke-linecap="round"
            stroke-linejoin="round"
            />
            
            <path d="M 3.0,2.0 L 5.0,1.0" fill="none"
            stroke="black"
            stroke-width="1"
            stroke-linecap="round"
            stroke-linejoin="round"
            />
            
            
        </svg>