<?xml version="1.0"?><!DOCTYPE svg PUBLIC "-//W3C//DTD SVG 1.1//EN" "http://www.w3.org/Graphics/SVG/1.1/DTD/svg11.dtd"><svg xmlns="http://www.w3.org/2000/svg" xmlns:xlink="http://www.w3.org/1999/xlink" width="350" height="1000" viewBox="0 0 7 17" >
            
                ['<path class="dot" d="M 3.263679656440358,10.267747468305833 L 3.263679656440358,10.267747468305833 C 3.0436796564403577,10.047747468305834 2.702679656440358,10.047747468305834 2.4826796564403577,10.267747468305833 L 2.1966796564403577,10.553747468305835 C 1.9766796564403575,10.773747468305833 1.9766796564403575,11.114747468305834 2.1966796564403577,11.334747468305835 L 2.4936796564403574,11.631747468305834 C 2.7136796564403576,11.851747468305835 3.0546796564403578,11.851747468305835 3.2746796564403575,11.631747468305834 L 3.560679656440358,11.334747468305835 C 3.780679656440358,11.114747468305834 3.780679656440358,10.773747468305833 3.560679656440358,10.553747468305835 L 3.263679656440358,10.267747468305835" stroke-linejoin="round"/>', '<path class="dot" d="M 7.506320343559642,0.3682525316941674 L 7.506320343559642,0.3682525316941674 C 7.286320343559641,0.1482525316941673 6.945320343559642,0.14825253169416727 6.725320343559641,0.3682525316941674 L 6.439320343559642,0.6542525316941675 C 6.219320343559642,0.8742525316941675 6.219320343559642,1.2152525316941676 6.439320343559642,1.4352525316941676 L 6.736320343559641,1.7322525316941673 C 6.956320343559641,1.9522525316941672 7.297320343559642,1.9522525316941672 7.517320343559641,1.7322525316941673 L 7.803320343559642,1.4352525316941676 C 8.023320343559641,1.2152525316941674 8.023320343559641,0.8742525316941675 7.803320343559642,0.6542525316941674 L 7.506320343559642,0.3682525316941674" stroke-linejoin="round"/>']
            
                ['<path class="dot" d="M 1.385,1.318 L 1.3849999999999998,1.318 C 1.1649999999999998,1.0979999999999999 0.8239999999999998,1.0979999999999999 0.6039999999999999,1.318 L 0.31799999999999984,1.604 C 0.09799999999999975,1.8240000000000003 0.09799999999999973,2.165 0.31799999999999984,2.3850000000000002 L 0.6149999999999998,2.682 C 0.8349999999999997,2.902 1.176,2.902 1.3959999999999997,2.682 L 1.6820000000000002,2.3850000000000002 C 1.9020000000000001,2.165 1.9020000000000001,1.8240000000000003 1.6820000000000002,1.604 L 1.385,1.318" stroke-linejoin="round"/>', '<path class="dot" d="M 1.385,2.318 L 1.3849999999999998,2.318 C 1.1649999999999998,2.098 0.8239999999999998,2.098 0.6039999999999999,2.318 L 0.31799999999999984,2.604 C 0.09799999999999975,2.8240000000000003 0.09799999999999973,3.165 0.31799999999999984,3.3850000000000002 L 0.6149999999999998,3.682 C 0.8349999999999997,3.902 1.176,3.902 1.3959999999999997,3.682 L 1.6820000000000002,3.3850000000000002 C 1.9020000000000001,3.165 1.9020000000000001,2.8240000000000003 1.6820000000000002,2.604 L 1.385,2.318" stroke-linejoin="round"/>', '<path class="dot" d="M 2.385,3.318 L 2.385,3.318 C 2.165,3.098 1.8239999999999998,3.098 1.6039999999999999,3.318 L 1.3179999999999998,3.604 C 1.0979999999999999,3.8240000000000003 1.0979999999999996,4.165 1.3179999999999998,4.385 L 1.6149999999999998,4.682 C 1.8349999999999997,4.902 2.176,4.902 2.396,4.682 L 2.6820000000000004,4.385 C 2.902,4.165 2.902,3.8240000000000003 2.6820000000000004,3.604 L 2.385,3.318" stroke-linejoin="round"/>', '<path class="dot" d="M 3.385,2.318 L 3.385,2.318 C 3.1649999999999996,2.098 2.824,2.098 2.6039999999999996,2.318 L 2.3179999999999996,2.604 C 2.0979999999999994,2.8240000000000003 2.0979999999999994,3.165 2.3179999999999996,3.3850000000000002 L 2.6149999999999993,3.682 C 2.8349999999999995,3.902 3.1759999999999997,3.902 3.3959999999999995,3.682 L 3.682,3.3850000000000002 C 3.902,3.165 3.902,2.8240000000000003 3.682,2.604 L 3.385,2.318" stroke-linejoin="round"/>', '<path class="dot" d="M 3.385,1.318 L 3.385,1.318 C 3.1649999999999996,1.0979999999999999 2.824,1.0979999999999999 2.6039999999999996,1.318 L 2.3179999999999996,1.604 C 2.0979999999999994,1.8240000000000003 2.0979999999999994,2.165 2.3179999999999996,2.3850000000000002 L 2.6149999999999993,2.682 C 2.8349999999999995,2.902 3.1759999999999997,2.902 3.3959999999999995,2.682 L 3.682,2.3850000000000002 C 3.902,2.165 3.902,1.8240000000000003 3.682,1.604 L 3.385,1.318" stroke-linejoin="round"/>', '<path class="dot" d="M 2.385,0.31800000000000006 L 2.385,0.31800000000000006 C 2.165,0.09799999999999998 1.8239999999999998,0.09799999999999995 1.6039999999999999,0.31800000000000006 L 1.3179999999999998,0.6040000000000002 C 1.0979999999999999,0.8240000000000002 1.0979999999999996,1.1650000000000003 1.3179999999999998,1.3850000000000002 L 1.6149999999999998,1.682 C 1.8349999999999997,1.902 2.176,1.902 2.396,1.682 L 2.6820000000000004,1.3850000000000002 C 2.902,1.165 2.902,0.8240000000000002 2.6820000000000004,0.6040000000000001 L 2.385,0.31800000000000006" stroke-linejoin="round"/>', '<path class="dot" d="M 2.385,0.31800000000000006 L 2.385,0.31800000000000006 C 2.165,0.09799999999999998 1.8239999999999998,0.09799999999999995 1.6039999999999999,0.31800000000000006 L 1.3179999999999998,0.6040000000000002 C 1.0979999999999999,0.8240000000000002 1.0979999999999996,1.1650000000000003 1.3179999999999998,1.3850000000000002 L 1.6149999999999998,1.682 C 1.8349999999999997,1.902 2.176,1.902 2.396,1.682 L 2.6820000000000004,1.3850000000000002 C 2.902,1.165 2.902,0.8240000000000002 2.6820000000000004,0.6040000000000001 L 2.385,0.31800000000000006" stroke-linejoin="round"/>', '<path class="dot" d="M 4.385,1.318 L 4.385,1.318 C 4.164999999999999,1.0979999999999999 3.824,1.0979999999999999 3.6039999999999996,1.318 L 3.3179999999999996,1.604 C 3.0979999999999994,1.8240000000000003 3.0979999999999994,2.165 3.3179999999999996,2.3850000000000002 L 3.6149999999999993,2.682 C 3.8349999999999995,2.902 4.176,2.902 4.395999999999999,2.682 L 4.682,2.3850000000000002 C 4.902,2.165 4.902,1.8240000000000003 4.682,1.604 L 4.385,1.318" stroke-linejoin="round"/>', '<path class="dot" d="M 6.3850001,7.3180000000000005 L 6.3850001,7.3180000000000005 C 6.1650001,7.098000000000001 5.8240001,7.098000000000001 5.6040000999999995,7.3180000000000005 L 5.3180001,7.604000000000001 C 5.0980001,7.824000000000001 5.0980001,8.165000000000001 5.3180001,8.385000000000002 L 5.6150001,8.682 C 5.8350001,8.902000000000001 6.1760000999999995,8.902000000000001 6.3960001,8.682 L 6.6820001,8.385000000000002 C 6.9020001,8.165000000000001 6.9020001,7.824000000000001 6.6820001,7.604000000000001 L 6.3850001,7.3180000000000005" stroke-linejoin="round"/>', '<path class="dot" d="M 5.3850001,8.318 L 5.3850001,8.318 C 5.1650001,8.098 4.8240001,8.098 4.6040000999999995,8.318 L 4.3180001,8.604000000000001 C 4.0980001,8.824 4.0980001,9.165000000000001 4.3180001,9.385000000000002 L 4.6150001,9.682 C 4.8350001,9.902000000000001 5.1760000999999995,9.902000000000001 5.3960001,9.682 L 5.6820001,9.385000000000002 C 5.9020001,9.165000000000001 5.9020001,8.824 5.6820001,8.604000000000001 L 5.3850001,8.318000000000001" stroke-linejoin="round"/>', '<path class="dot" d="M 5.3850001,9.318 L 5.3850001,9.318 C 5.1650001,9.098 4.8240001,9.098 4.6040000999999995,9.318 L 4.3180001,9.604000000000001 C 4.0980001,9.824 4.0980001,10.165000000000001 4.3180001,10.385000000000002 L 4.6150001,10.682 C 4.8350001,10.902000000000001 5.1760000999999995,10.902000000000001 5.3960001,10.682 L 5.6820001,10.385000000000002 C 5.9020001,10.165000000000001 5.9020001,9.824 5.6820001,9.604000000000001 L 5.3850001,9.318000000000001" stroke-linejoin="round"/>', '<path class="dot" d="M 6.3850001,10.318 L 6.3850001,10.318 C 6.1650001,10.098 5.8240001,10.098 5.6040000999999995,10.318 L 5.3180001,10.604000000000001 C 5.0980001,10.824 5.0980001,11.165000000000001 5.3180001,11.385000000000002 L 5.6150001,11.682 C 5.8350001,11.902000000000001 6.1760000999999995,11.902000000000001 6.3960001,11.682 L 6.6820001,11.385000000000002 C 6.9020001,11.165000000000001 6.9020001,10.824 6.6820001,10.604000000000001 L 6.3850001,10.318000000000001" stroke-linejoin="round"/>', '<path class="dot" d="M 7.385,9.318 L 7.385,9.318 C 7.164999999999999,9.098 6.824,9.098 6.603999999999999,9.318 L 6.318,9.604000000000001 C 6.098,9.824 6.098,10.165000000000001 6.318,10.385000000000002 L 6.614999999999999,10.682 C 6.834999999999999,10.902000000000001 7.176,10.902000000000001 7.395999999999999,10.682 L 7.682,10.385000000000002 C 7.902,10.165000000000001 7.902,9.824 7.682,9.604000000000001 L 7.385,9.318000000000001" stroke-linejoin="round"/>', '<path class="dot" d="M 7.3850001,8.318 L 7.3850001,8.318 C 7.1650001,8.098 6.8240001,8.098 6.6040000999999995,8.318 L 6.3180001,8.604000000000001 C 6.0980001,8.824 6.0980001,9.165000000000001 6.3180001,9.385000000000002 L 6.6150001,9.682 C 6.8350001,9.902000000000001 7.1760000999999995,9.902000000000001 7.3960001,9.682 L 7.6820001,9.385000000000002 C 7.9020001,9.165000000000001 7.9020001,8.824 7.6820001,8.604000000000001 L 7.3850001,8.318000000000001" stroke-linejoin="round"/>', '<path class="dot" d="M 6.3850001,7.3180000000000005 L 6.3850001,7.3180000000000005 C 6.1650001,7.098000000000001 5.8240001,7.098000000000001 5.6040000999999995,7.3180000000000005 L 5.3180001,7.604000000000001 C 5.0980001,7.824000000000001 5.0980001,8.165000000000001 5.3180001,8.385000000000002 L 5.6150001,8.682 C 5.8350001,8.902000000000001 6.1760000999999995,8.902000000000001 6.3960001,8.682 L 6.6820001,8.385000000000002 C 6.9020001,8.165000000000001 6.9020001,7.824000000000001 6.6820001,7.604000000000001 L 6.3850001,7.3180000000000005" stroke-linejoin="round"/>']
            
            
            <path d="M 2.878679656440358,10.949747468305834 L 7.121320343559642,1.0502525316941673" fill="none"
            stroke="black"
            stroke-width="1"
            stroke-linecap="round"
            stroke-linejoin="round"
            />
            
            <path d="M 1.0,2.0 L 1.0,3.0 L 2.0,4.0 L 3.0,3.0 L 3.0,2.0 L 2.0,1.0 L 1.0,2.0 M 2.0,1.0 L 4.0,2.0 L 7.0,1.0 M 6.0000001,8.0 L 5.0000001,9.0 L 5.0000001,10.0 L 6.0000001,11.0 L 7.0,10.0 L 7.0000001,9.0 L 6.0000001,8.0" fill="none"
            stroke="black"
            stroke-width="1"
            stroke-linecap="round"
            stroke-linejoin="round"
            />
            
            
        </svg>