<?xml version="1.0"?><!DOCTYPE svg PUBLIC "-//W3C//DTD SVG 1.1//EN" "http://www.w3.org/Graphics/SVG/1.1/DTD/svg11.dtd"><svg xmlns="http://www.w3.org/2000/svg" xmlns:xlink="http://www.w3.org/1999/xlink" width="350" height="1000" viewBox="0 0 7 17" >
            
                ['<path class="dot" d="M 0.8850000000000005,10.318 L 0.8850000000000002,10.318 C 0.6650000000000003,10.098 0.3240000000000003,10.098 0.10400000000000026,10.318 L -0.18199999999999975,10.604000000000001 C -0.4019999999999998,10.824 -0.4019999999999998,11.165000000000001 -0.18199999999999975,11.385000000000002 L 0.11500000000000021,11.682 C 0.3350000000000002,11.902000000000001 0.6760000000000004,11.902000000000001 0.8960000000000001,11.682 L 1.1820000000000006,11.385000000000002 C 1.4020000000000006,11.165000000000001 1.4020000000000006,10.824 1.1820000000000006,10.604000000000001 L 0.8850000000000005,10.318000000000001" stroke-linejoin="round"/>', '<path class="dot" d="M 3.885,0.31800000000000006 L 3.885,0.31800000000000006 C 3.6649999999999996,0.09799999999999998 3.324,0.09799999999999995 3.1039999999999996,0.31800000000000006 L 2.8179999999999996,0.6040000000000002 C 2.5979999999999994,0.8240000000000002 2.5979999999999994,1.1650000000000003 2.8179999999999996,1.3850000000000002 L 3.1149999999999993,1.682 C 3.3349999999999995,1.902 3.6759999999999997,1.902 3.8959999999999995,1.682 L 4.182,1.3850000000000002 C 4.402,1.165 4.402,0.8240000000000002 4.182,0.6040000000000001 L 3.885,0.31800000000000006" stroke-linejoin="round"/>', '<path class="dot" d="M 6.885,10.318 L 6.885,10.318 C 6.664999999999999,10.098 6.324,10.098 6.103999999999999,10.318 L 5.818,10.604000000000001 C 5.598,10.824 5.598,11.165000000000001 5.818,11.385000000000002 L 6.114999999999999,11.682 C 6.334999999999999,11.902000000000001 6.676,11.902000000000001 6.895999999999999,11.682 L 7.182,11.385000000000002 C 7.402,11.165000000000001 7.402,10.824 7.182,10.604000000000001 L 6.885,10.318000000000001" stroke-linejoin="round"/>']
            
                ['<path class="dot" d="M 1.885,6.3180000000000005 L 1.8849999999999998,6.3180000000000005 C 1.6649999999999998,6.098000000000001 1.3239999999999998,6.098000000000001 1.1039999999999999,6.3180000000000005 L 0.8179999999999998,6.604000000000001 C 0.5979999999999998,6.824000000000001 0.5979999999999998,7.165000000000001 0.8179999999999998,7.385000000000001 L 1.1149999999999998,7.682 C 1.3349999999999997,7.902 1.676,7.902 1.8959999999999997,7.682 L 2.1820000000000004,7.385000000000001 C 2.402,7.165000000000001 2.402,6.824000000000001 2.1820000000000004,6.604000000000001 L 1.885,6.3180000000000005" stroke-linejoin="round"/>', '<path class="dot" d="M 5.885,6.3180000000000005 L 5.885,6.3180000000000005 C 5.664999999999999,6.098000000000001 5.324,6.098000000000001 5.103999999999999,6.3180000000000005 L 4.818,6.604000000000001 C 4.598,6.824000000000001 4.598,7.165000000000001 4.818,7.385000000000001 L 5.114999999999999,7.682 C 5.334999999999999,7.902 5.676,7.902 5.895999999999999,7.682 L 6.182,7.385000000000001 C 6.402,7.165000000000001 6.402,6.824000000000001 6.182,6.604000000000001 L 5.885,6.3180000000000005" stroke-linejoin="round"/>']
            
                ['<path class="dot" d="M 6.885,-2.682 L 6.885,-2.682 C 6.664999999999999,-2.902 6.324,-2.902 6.103999999999999,-2.682 L 5.818,-2.396 C 5.598,-2.1759999999999997 5.598,-1.8349999999999997 5.818,-1.6149999999999998 L 6.114999999999999,-1.318 C 6.334999999999999,-1.098 6.676,-1.098 6.895999999999999,-1.318 L 7.182,-1.6149999999999998 C 7.402,-1.835 7.402,-2.1759999999999997 7.182,-2.396 L 6.885,-2.682" stroke-linejoin="round"/>', '<path class="dot" d="M 5.885,-1.682 L 5.885,-1.682 C 5.664999999999999,-1.9020000000000001 5.324,-1.9020000000000001 5.103999999999999,-1.682 L 4.818,-1.396 C 4.598,-1.1759999999999997 4.598,-0.8349999999999997 4.818,-0.6149999999999998 L 5.114999999999999,-0.31800000000000006 C 5.334999999999999,-0.09800000000000009 5.676,-0.09800000000000009 5.895999999999999,-0.31800000000000006 L 6.182,-0.6149999999999998 C 6.402,-0.835 6.402,-1.1759999999999997 6.182,-1.396 L 5.885,-1.682" stroke-linejoin="round"/>', '<path class="dot" d="M 4.885,-2.682 L 4.885,-2.682 C 4.664999999999999,-2.902 4.324,-2.902 4.103999999999999,-2.682 L 3.8179999999999996,-2.396 C 3.5979999999999994,-2.1759999999999997 3.5979999999999994,-1.8349999999999997 3.8179999999999996,-1.6149999999999998 L 4.114999999999999,-1.318 C 4.334999999999999,-1.098 4.676,-1.098 4.895999999999999,-1.318 L 5.182,-1.6149999999999998 C 5.402,-1.835 5.402,-2.1759999999999997 5.182,-2.396 L 4.885,-2.682" stroke-linejoin="round"/>', '<path class="dot" d="M 5.885,-3.682 L 5.885,-3.682 C 5.664999999999999,-3.902 5.324,-3.902 5.103999999999999,-3.682 L 4.818,-3.396 C 4.598,-3.1759999999999997 4.598,-2.835 4.818,-2.6149999999999998 L 5.114999999999999,-2.318 C 5.334999999999999,-2.098 5.676,-2.098 5.895999999999999,-2.318 L 6.182,-2.6149999999999998 C 6.402,-2.835 6.402,-3.1759999999999997 6.182,-3.396 L 5.885,-3.682" stroke-linejoin="round"/>', '<path class="dot" d="M 2.885,-2.682 L 2.885,-2.682 C 2.665,-2.902 2.324,-2.902 2.1039999999999996,-2.682 L 1.8179999999999998,-2.396 C 1.5979999999999999,-2.1759999999999997 1.5979999999999996,-1.8349999999999997 1.8179999999999998,-1.6149999999999998 L 2.1149999999999998,-1.318 C 2.335,-1.098 2.676,-1.098 2.896,-1.318 L 3.1820000000000004,-1.6149999999999998 C 3.402,-1.835 3.402,-2.1759999999999997 3.1820000000000004,-2.396 L 2.885,-2.682" stroke-linejoin="round"/>', '<path class="dot" d="M 1.885,-1.682 L 1.8849999999999998,-1.682 C 1.6649999999999998,-1.9020000000000001 1.3239999999999998,-1.9020000000000001 1.1039999999999999,-1.682 L 0.8179999999999998,-1.396 C 0.5979999999999998,-1.1759999999999997 0.5979999999999998,-0.8349999999999997 0.8179999999999998,-0.6149999999999998 L 1.1149999999999998,-0.31800000000000006 C 1.3349999999999997,-0.09800000000000009 1.676,-0.09800000000000009 1.8959999999999997,-0.31800000000000006 L 2.1820000000000004,-0.6149999999999998 C 2.402,-0.835 2.402,-1.1759999999999997 2.1820000000000004,-1.396 L 1.885,-1.682" stroke-linejoin="round"/>', '<path class="dot" d="M 0.885,-2.6820002 L 0.8849999999999998,-2.6820002 C 0.6649999999999998,-2.9020002000000003 0.32399999999999984,-2.9020002000000003 0.10399999999999981,-2.6820002 L -0.1820000000000002,-2.3960002 C -0.40200000000000025,-2.1760002 -0.40200000000000025,-1.8350001999999999 -0.1820000000000002,-1.6150001999999999 L 0.11499999999999977,-1.3180002000000002 C 0.33499999999999974,-1.0980002000000002 0.6759999999999999,-1.0980002000000002 0.8959999999999997,-1.3180002000000002 L 1.1820000000000002,-1.6150001999999999 C 1.4020000000000001,-1.8350002 1.4020000000000001,-2.1760002 1.1820000000000002,-2.3960002 L 0.885,-2.6820002" stroke-linejoin="round"/>', '<path class="dot" d="M 1.885,-3.682 L 1.8849999999999998,-3.682 C 1.6649999999999998,-3.902 1.3239999999999998,-3.902 1.1039999999999999,-3.682 L 0.8179999999999998,-3.396 C 0.5979999999999998,-3.1759999999999997 0.5979999999999998,-2.835 0.8179999999999998,-2.6149999999999998 L 1.1149999999999998,-2.318 C 1.3349999999999997,-2.098 1.676,-2.098 1.8959999999999997,-2.318 L 2.1820000000000004,-2.6149999999999998 C 2.402,-2.835 2.402,-3.1759999999999997 2.1820000000000004,-3.396 L 1.885,-3.682" stroke-linejoin="round"/>', '<path class="dot" d="M 2.885,-2.682 L 2.885,-2.682 C 2.665,-2.902 2.324,-2.902 2.1039999999999996,-2.682 L 1.8179999999999998,-2.396 C 1.5979999999999999,-2.1759999999999997 1.5979999999999996,-1.8349999999999997 1.8179999999999998,-1.6149999999999998 L 2.1149999999999998,-1.318 C 2.335,-1.098 2.676,-1.098 2.896,-1.318 L 3.1820000000000004,-1.6149999999999998 C 3.402,-1.835 3.402,-2.1759999999999997 3.1820000000000004,-2.396 L 2.885,-2.682" stroke-linejoin="round"/>']
            
            
            <path d="M 0.5000000000000004,11.0 L 3.4999999999999996,1.0 L 6.5,11.0" fill="none"
            stroke="black"
            stroke-width="1"
            stroke-linecap="round"
            stroke-linejoin="round"
            />
            
            <path d="M 1.5,7.0 L 5.5,7.0" fill="none"
            stroke="black"
            stroke-width="1"
            stroke-linecap="round"
            stroke-linejoin="round"
            />
            
            <path d="M 6.5,-2.0 L 5.5,-1.0 L 4.5,-2.0 L 5.5,-3.0 L 6.5,-2.0 M 2.5,-2.0 L 1.5,-1.0 L 0.5,-2.0000002 L 1.5,-3.0 L 2.5,-2.0" fill="none"
            stroke="black"
            stroke-width="1"
            stroke-linecap="round"
            stroke-linejoin="round"
            />
            
            
        </svg>