<?xml version="1.0"?><!DOCTYPE svg PUBLIC "-//W3C//DTD SVG 1.1//EN" "http://www.w3.org/Graphics/SVG/1.1/DTD/svg11.dtd"><svg xmlns="http://www.w3.org/2000/svg" xmlns:xlink="http://www.w3.org/1999/xlink" width="350" height="1000" viewBox="0 0 7 17" >
            
                ['<path class="dot" d="M 1.263679656440358,10.267747468305833 L 1.2636796564403578,10.267747468305833 C 1.0436796564403579,10.047747468305834 0.7026796564403579,10.047747468305834 0.4826796564403579,10.267747468305833 L 0.19667965644035787,10.553747468305835 C -0.023320343559642187,10.773747468305833 -0.023320343559642215,11.114747468305834 0.19667965644035787,11.334747468305835 L 0.49367965644035783,11.631747468305834 C 0.7136796564403578,11.851747468305835 1.054679656440358,11.851747468305835 1.2746796564403577,11.631747468305834 L 1.5606796564403582,11.334747468305835 C 1.7806796564403582,11.114747468305834 1.7806796564403582,10.773747468305833 1.5606796564403582,10.553747468305835 L 1.263679656440358,10.267747468305835" stroke-linejoin="round"/>', '<path class="dot" d="M 5.506320343559642,0.3682525316941674 L 5.506320343559642,0.3682525316941674 C 5.286320343559641,0.1482525316941673 4.945320343559642,0.14825253169416727 4.725320343559641,0.3682525316941674 L 4.439320343559642,0.6542525316941675 C 4.219320343559642,0.8742525316941675 4.219320343559642,1.2152525316941676 4.439320343559642,1.4352525316941676 L 4.736320343559641,1.7322525316941673 C 4.956320343559641,1.9522525316941672 5.297320343559642,1.9522525316941672 5.517320343559641,1.7322525316941673 L 5.803320343559642,1.4352525316941676 C 6.023320343559642,1.2152525316941674 6.023320343559642,0.8742525316941675 5.803320343559642,0.6542525316941674 L 5.506320343559642,0.3682525316941674" stroke-linejoin="round"/>']
            
                ['<path class="dot" d="M 5.385,6.3180000000000005 L 5.385,6.3180000000000005 C 5.164999999999999,6.098000000000001 4.824,6.098000000000001 4.603999999999999,6.3180000000000005 L 4.318,6.604000000000001 C 4.098,6.824000000000001 4.098,7.165000000000001 4.318,7.385000000000001 L 4.614999999999999,7.682 C 4.834999999999999,7.902 5.176,7.902 5.395999999999999,7.682 L 5.682,7.385000000000001 C 5.902,7.165000000000001 5.902,6.824000000000001 5.682,6.604000000000001 L 5.385,6.3180000000000005" stroke-linejoin="round"/>', '<path class="dot" d="M 7.385,6.3180000000000005 L 7.385,6.3180000000000005 C 7.164999999999999,6.098000000000001 6.824,6.098000000000001 6.603999999999999,6.3180000000000005 L 6.318,6.604000000000001 C 6.098,6.824000000000001 6.098,7.165000000000001 6.318,7.385000000000001 L 6.614999999999999,7.682 C 6.834999999999999,7.902 7.176,7.902 7.395999999999999,7.682 L 7.682,7.385000000000001 C 7.902,7.165000000000001 7.902,6.824000000000001 7.682,6.604000000000001 L 7.385,6.3180000000000005" stroke-linejoin="round"/>']
            
                ['<path class="dot" d="M 5.385,0.31800000000000006 L 5.385,0.31800000000000006 C 5.164999999999999,0.09799999999999998 4.824,0.09799999999999995 4.603999999999999,0.31800000000000006 L 4.318,0.6040000000000002 C 4.098,0.8240000000000002 4.098,1.1650000000000003 4.318,1.3850000000000002 L 4.614999999999999,1.682 C 4.834999999999999,1.902 5.176,1.902 5.395999999999999,1.682 L 5.682,1.3850000000000002 C 5.902,1.165 5.902,0.8240000000000002 5.682,0.6040000000000001 L 5.385,0.31800000000000006" stroke-linejoin="round"/>', '<path class="dot" d="M 5.385,10.318 L 5.385,10.318 C 5.164999999999999,10.098 4.824,10.098 4.603999999999999,10.318 L 4.318,10.604000000000001 C 4.098,10.824 4.098,11.165000000000001 4.318,11.385000000000002 L 4.614999999999999,11.682 C 4.834999999999999,11.902000000000001 5.176,11.902000000000001 5.395999999999999,11.682 L 5.682,11.385000000000002 C 5.902,11.165000000000001 5.902,10.824 5.682,10.604000000000001 L 5.385,10.318000000000001" stroke-linejoin="round"/>']
            
                ['<path class="dot" d="M 5.385,0.31800000000000006 L 5.385,0.31800000000000006 C 5.164999999999999,0.09799999999999998 4.824,0.09799999999999995 4.603999999999999,0.31800000000000006 L 4.318,0.6040000000000002 C 4.098,0.8240000000000002 4.098,1.1650000000000003 4.318,1.3850000000000002 L 4.614999999999999,1.682 C 4.834999999999999,1.902 5.176,1.902 5.395999999999999,1.682 L 5.682,1.3850000000000002 C 5.902,1.165 5.902,0.8240000000000002 5.682,0.6040000000000001 L 5.385,0.31800000000000006" stroke-linejoin="round"/>', '<path class="dot" d="M 7.385,0.31800000000000006 L 7.385,0.31800000000000006 C 7.164999999999999,0.09799999999999998 6.824,0.09799999999999995 6.603999999999999,0.31800000000000006 L 6.318,0.6040000000000002 C 6.098,0.8240000000000002 6.098,1.1650000000000003 6.318,1.3850000000000002 L 6.614999999999999,1.682 C 6.834999999999999,1.902 7.176,1.902 7.395999999999999,1.682 L 7.682,1.3850000000000002 C 7.902,1.165 7.902,0.8240000000000002 7.682,0.6040000000000001 L 7.385,0.31800000000000006" stroke-linejoin="round"/>']
            
                ['<path class="dot" d="M 3.385,6.3180000000000005 L 3.385,6.3180000000000005 C 3.1649999999999996,6.098000000000001 2.824,6.098000000000001 2.6039999999999996,6.3180000000000005 L 2.3179999999999996,6.604000000000001 C 2.0979999999999994,6.824000000000001 2.0979999999999994,7.165000000000001 2.3179999999999996,7.385000000000001 L 2.6149999999999993,7.682 C 2.8349999999999995,7.902 3.1759999999999997,7.902 3.3959999999999995,7.682 L 3.682,7.385000000000001 C 3.902,7.165000000000001 3.902,6.824000000000001 3.682,6.604000000000001 L 3.385,6.3180000000000005" stroke-linejoin="round"/>', '<path class="dot" d="M 5.385,6.3180000000000005 L 5.385,6.3180000000000005 C 5.164999999999999,6.098000000000001 4.824,6.098000000000001 4.603999999999999,6.3180000000000005 L 4.318,6.604000000000001 C 4.098,6.824000000000001 4.098,7.165000000000001 4.318,7.385000000000001 L 4.614999999999999,7.682 C 4.834999999999999,7.902 5.176,7.902 5.395999999999999,7.682 L 5.682,7.385000000000001 C 5.902,7.165000000000001 5.902,6.824000000000001 5.682,6.604000000000001 L 5.385,6.3180000000000005" stroke-linejoin="round"/>']
            
                ['<path class="dot" d="M 5.385,10.318 L 5.385,10.318 C 5.164999999999999,10.098 4.824,10.098 4.603999999999999,10.318 L 4.318,10.604000000000001 C 4.098,10.824 4.098,11.165000000000001 4.318,11.385000000000002 L 4.614999999999999,11.682 C 4.834999999999999,11.902000000000001 5.176,11.902000000000001 5.395999999999999,11.682 L 5.682,11.385000000000002 C 5.902,11.165000000000001 5.902,10.824 5.682,10.604000000000001 L 5.385,10.318000000000001" stroke-linejoin="round"/>', '<path class="dot" d="M 7.385,10.318 L 7.385,10.318 C 7.164999999999999,10.098 6.824,10.098 6.603999999999999,10.318 L 6.318,10.604000000000001 C 6.098,10.824 6.098,11.165000000000001 6.318,11.385000000000002 L 6.614999999999999,11.682 C 6.834999999999999,11.902000000000001 7.176,11.902000000000001 7.395999999999999,11.682 L 7.682,11.385000000000002 C 7.902,11.165000000000001 7.902,10.824 7.682,10.604000000000001 L 7.385,10.318000000000001" stroke-linejoin="round"/>']
            
            
            <path d="M 0.8786796564403581,10.949747468305834 L 5.121320343559642,1.0502525316941673" fill="none"
            stroke="black"
            stroke-width="1"
            stroke-linecap="round"
            stroke-linejoin="round"
            />
            
            <path d="M 5.0,7.0 L 7.0,7.0" fill="none"
            stroke="black"
            stroke-width="1"
            stroke-linecap="round"
            stroke-linejoin="round"
            />
            
            <path d="M 5.0,1.0 L 5.0,11.0" fill="none"
            stroke="black"
            stroke-width="1"
            stroke-linecap="round"
            stroke-linejoin="round"
            />
            
            <path d="M 5.0,1.0 L 7.0,1.0" fill="none"
            stroke="black"
            stroke-width="1"
            stroke-linecap="round"
            stroke-linejoin="round"
            />
            
            <path d="M 3.0,7.0 L 5.0,7.0" fill="none"
            stroke="black"
            stroke-width="1"
            stroke-linecap="round"
            stroke-linejoin="round"
            />
            
            <path d="M 5.0,11.0 L 7.0,11.0" fill="none"
            stroke="black"
            stroke-width="1"
            stroke-linecap="round"
            stroke-linejoin="round"
            />
            
            
        </svg>