<?xml version="1.0"?><!DOCTYPE svg PUBLIC "-//W3C//DTD SVG 1.1//EN" "http://www.w3.org/Graphics/SVG/1.1/DTD/svg11.dtd"><svg xmlns="http://www.w3.org/2000/svg" xmlns:xlink="http://www.w3.org/1999/xlink" width="350" height="1000" viewBox="0 0 14 40" >
            
                ['<path class="dot" d="M 2.7909438775510207,6.777193877551018 L 2.79094387755102,6.777193877551018 C 2.3409438775510196,6.327193877551018 1.6434438775510198,6.327193877551018 1.19344387755102,6.777193877551018 L 0.6084438775510199,7.362193877551018 C 0.15844387755101996,7.812193877551018 0.15844387755101985,8.509693877551019 0.6084438775510199,8.959693877551018 L 1.2159438775510198,9.567193877551018 C 1.6659438775510198,10.017193877551017 2.3634438775510196,10.017193877551017 2.8134438775510198,9.567193877551018 L 3.3984438775510206,8.959693877551018 C 3.84844387755102,8.509693877551019 3.84844387755102,7.812193877551018 3.3984438775510206,7.362193877551018 L 2.7909438775510207,6.777193877551018" stroke-linejoin="round"/>', '<path class="dot" d="M 2.7909438775510207,20.777193877551017 L 2.79094387755102,20.777193877551017 C 2.3409438775510196,20.327193877551018 1.6434438775510198,20.327193877551018 1.19344387755102,20.777193877551017 L 0.6084438775510199,21.362193877551018 C 0.15844387755101996,21.812193877551017 0.15844387755101985,22.50969387755102 0.6084438775510199,22.959693877551018 L 1.2159438775510198,23.56719387755102 C 1.6659438775510198,24.01719387755102 2.3634438775510196,24.01719387755102 2.8134438775510198,23.56719387755102 L 3.3984438775510206,22.959693877551018 C 3.84844387755102,22.50969387755102 3.84844387755102,21.812193877551017 3.3984438775510206,21.362193877551018 L 2.7909438775510207,20.777193877551017" stroke-linejoin="round"/>']
            
                ['<path class="dot" d="M 2.7909438775510207,10.777193877551019 L 2.79094387755102,10.777193877551019 C 2.3409438775510196,10.327193877551018 1.6434438775510198,10.327193877551018 1.19344387755102,10.777193877551019 L 0.6084438775510199,11.362193877551018 C 0.15844387755101996,11.81219387755102 0.15844387755101985,12.509693877551019 0.6084438775510199,12.959693877551018 L 1.2159438775510198,13.567193877551018 C 1.6659438775510198,14.01719387755102 2.3634438775510196,14.01719387755102 2.8134438775510198,13.567193877551018 L 3.3984438775510206,12.959693877551018 C 3.84844387755102,12.509693877551019 3.84844387755102,11.81219387755102 3.3984438775510206,11.362193877551018 L 2.7909438775510207,10.777193877551019" stroke-linejoin="round"/>', '<path class="dot" d="M 4.790943877551021,7.777193877551018 L 4.79094387755102,7.777193877551018 C 4.34094387755102,7.327193877551018 3.64344387755102,7.327193877551018 3.19344387755102,7.777193877551018 L 2.60844387755102,8.362193877551018 C 2.1584438775510204,8.812193877551017 2.15844387755102,9.509693877551019 2.60844387755102,9.959693877551018 L 3.21594387755102,10.567193877551018 C 3.66594387755102,11.017193877551017 4.3634438775510205,11.017193877551017 4.81344387755102,10.567193877551018 L 5.398443877551021,9.959693877551018 C 5.84844387755102,9.509693877551019 5.84844387755102,8.812193877551017 5.398443877551021,8.362193877551018 L 4.790943877551021,7.777193877551018" stroke-linejoin="round"/>', '<path class="dot" d="M 6.790943877551021,6.777193877551018 L 6.79094387755102,6.777193877551018 C 6.34094387755102,6.327193877551018 5.64344387755102,6.327193877551018 5.1934438775510205,6.777193877551018 L 4.608443877551021,7.362193877551018 C 4.15844387755102,7.812193877551018 4.15844387755102,8.509693877551019 4.608443877551021,8.959693877551018 L 5.21594387755102,9.567193877551018 C 5.66594387755102,10.017193877551017 6.3634438775510205,10.017193877551017 6.81344387755102,9.567193877551018 L 7.398443877551021,8.959693877551018 C 7.84844387755102,8.509693877551019 7.84844387755102,7.812193877551018 7.398443877551021,7.362193877551018 L 6.790943877551021,6.777193877551018" stroke-linejoin="round"/>', '<path class="dot" d="M 8.79094387755102,6.777193877551018 L 8.790943877551019,6.777193877551018 C 8.34094387755102,6.327193877551018 7.64344387755102,6.327193877551018 7.1934438775510205,6.777193877551018 L 6.608443877551021,7.362193877551018 C 6.15844387755102,7.812193877551018 6.15844387755102,8.509693877551019 6.608443877551021,8.959693877551018 L 7.21594387755102,9.567193877551018 C 7.66594387755102,10.017193877551017 8.36344387755102,10.017193877551017 8.81344387755102,9.567193877551018 L 9.39844387755102,8.959693877551018 C 9.84844387755102,8.509693877551019 9.84844387755102,7.812193877551018 9.39844387755102,7.362193877551018 L 8.79094387755102,6.777193877551018" stroke-linejoin="round"/>', '<path class="dot" d="M 9.79094387755102,7.777193877551018 L 9.790943877551019,7.777193877551018 C 9.34094387755102,7.327193877551018 8.64344387755102,7.327193877551018 8.19344387755102,7.777193877551018 L 7.608443877551021,8.362193877551018 C 7.15844387755102,8.812193877551017 7.15844387755102,9.509693877551019 7.608443877551021,9.959693877551018 L 8.21594387755102,10.567193877551018 C 8.66594387755102,11.017193877551017 9.36344387755102,11.017193877551017 9.81344387755102,10.567193877551018 L 10.39844387755102,9.959693877551018 C 10.84844387755102,9.509693877551019 10.84844387755102,8.812193877551017 10.39844387755102,8.362193877551018 L 9.79094387755102,7.777193877551018" stroke-linejoin="round"/>', '<path class="dot" d="M 10.790943877551019,10.777193877551019 L 10.790943877551019,10.777193877551019 C 10.34094387755102,10.327193877551018 9.64344387755102,10.327193877551018 9.193443877551019,10.777193877551019 L 8.60844387755102,11.362193877551018 C 8.158443877551019,11.81219387755102 8.158443877551019,12.509693877551019 8.60844387755102,12.959693877551018 L 9.21594387755102,13.567193877551018 C 9.665943877551019,14.01719387755102 10.363443877551019,14.01719387755102 10.81344387755102,13.567193877551018 L 11.39844387755102,12.959693877551018 C 11.84844387755102,12.509693877551019 11.84844387755102,11.81219387755102 11.39844387755102,11.362193877551018 L 10.790943877551019,10.777193877551019" stroke-linejoin="round"/>', '<path class="dot" d="M 10.790943877551019,20.777193877551017 L 10.790943877551019,20.777193877551017 C 10.34094387755102,20.327193877551018 9.64344387755102,20.327193877551018 9.193443877551019,20.777193877551017 L 8.60844387755102,21.362193877551018 C 8.158443877551019,21.812193877551017 8.158443877551019,22.50969387755102 8.60844387755102,22.959693877551018 L 9.21594387755102,23.56719387755102 C 9.665943877551019,24.01719387755102 10.363443877551019,24.01719387755102 10.81344387755102,23.56719387755102 L 11.39844387755102,22.959693877551018 C 11.84844387755102,22.50969387755102 11.84844387755102,21.812193877551017 11.39844387755102,21.362193877551018 L 10.790943877551019,20.777193877551017" stroke-linejoin="round"/>']
            
                ['<path class="dot" d="M 2.7909438775510207,3.7771938775510177 L 2.79094387755102,3.7771938775510177 C 2.3409438775510196,3.327193877551018 1.6434438775510198,3.3271938775510175 1.19344387755102,3.7771938775510177 L 0.6084438775510199,4.362193877551018 C 0.15844387755101996,4.812193877551018 0.15844387755101985,5.509693877551018 0.6084438775510199,5.959693877551018 L 1.2159438775510198,6.567193877551018 C 1.6659438775510198,7.017193877551017 2.3634438775510196,7.017193877551017 2.8134438775510198,6.567193877551018 L 3.3984438775510206,5.959693877551018 C 3.84844387755102,5.509693877551018 3.84844387755102,4.812193877551018 3.3984438775510206,4.362193877551018 L 2.7909438775510207,3.777193877551018" stroke-linejoin="round"/>', '<path class="dot" d="M 2.7909438775510207,2.7771938775510177 L 2.79094387755102,2.7771938775510177 C 2.3409438775510196,2.327193877551018 1.6434438775510198,2.3271938775510175 1.19344387755102,2.7771938775510177 L 0.6084438775510199,3.362193877551018 C 0.15844387755101996,3.8121938775510182 0.15844387755101985,4.509693877551018 0.6084438775510199,4.959693877551018 L 1.2159438775510198,5.567193877551018 C 1.6659438775510198,6.017193877551017 2.3634438775510196,6.017193877551017 2.8134438775510198,5.567193877551018 L 3.3984438775510206,4.959693877551018 C 3.84844387755102,4.509693877551018 3.84844387755102,3.8121938775510182 3.3984438775510206,3.362193877551018 L 2.7909438775510207,2.777193877551018" stroke-linejoin="round"/>', '<path class="dot" d="M 4.790943877551021,0.7771938775510179 L 4.79094387755102,0.7771938775510179 C 4.34094387755102,0.3271938775510179 3.64344387755102,0.3271938775510178 3.19344387755102,0.7771938775510179 L 2.60844387755102,1.3621938775510183 C 2.1584438775510204,1.8121938775510182 2.15844387755102,2.509693877551018 2.60844387755102,2.959693877551018 L 3.21594387755102,3.567193877551018 C 3.66594387755102,4.017193877551017 4.3634438775510205,4.017193877551017 4.81344387755102,3.567193877551018 L 5.398443877551021,2.959693877551018 C 5.84844387755102,2.509693877551018 5.84844387755102,1.8121938775510182 5.398443877551021,1.362193877551018 L 4.790943877551021,0.7771938775510181" stroke-linejoin="round"/>', '<path class="dot" d="M 5.790943877551021,0.7771938775510179 L 5.79094387755102,0.7771938775510179 C 5.34094387755102,0.3271938775510179 4.64344387755102,0.3271938775510178 4.1934438775510205,0.7771938775510179 L 3.60844387755102,1.3621938775510183 C 3.1584438775510204,1.8121938775510182 3.15844387755102,2.509693877551018 3.60844387755102,2.959693877551018 L 4.21594387755102,3.567193877551018 C 4.66594387755102,4.017193877551017 5.3634438775510205,4.017193877551017 5.81344387755102,3.567193877551018 L 6.398443877551021,2.959693877551018 C 6.84844387755102,2.509693877551018 6.84844387755102,1.8121938775510182 6.398443877551021,1.362193877551018 L 5.790943877551021,0.7771938775510181" stroke-linejoin="round"/>', '<path class="dot" d="M 7.790943877551021,2.7771938775510177 L 7.79094387755102,2.7771938775510177 C 7.34094387755102,2.327193877551018 6.64344387755102,2.3271938775510175 6.1934438775510205,2.7771938775510177 L 5.608443877551021,3.362193877551018 C 5.15844387755102,3.8121938775510182 5.15844387755102,4.509693877551018 5.608443877551021,4.959693877551018 L 6.21594387755102,5.567193877551018 C 6.66594387755102,6.017193877551017 7.3634438775510205,6.017193877551017 7.81344387755102,5.567193877551018 L 8.39844387755102,4.959693877551018 C 8.84844387755102,4.509693877551018 8.84844387755102,3.8121938775510182 8.39844387755102,3.362193877551018 L 7.790943877551021,2.777193877551018" stroke-linejoin="round"/>', '<path class="dot" d="M 8.79094387755102,2.7771938775510177 L 8.790943877551019,2.7771938775510177 C 8.34094387755102,2.327193877551018 7.64344387755102,2.3271938775510175 7.1934438775510205,2.7771938775510177 L 6.608443877551021,3.362193877551018 C 6.15844387755102,3.8121938775510182 6.15844387755102,4.509693877551018 6.608443877551021,4.959693877551018 L 7.21594387755102,5.567193877551018 C 7.66594387755102,6.017193877551017 8.36344387755102,6.017193877551017 8.81344387755102,5.567193877551018 L 9.39844387755102,4.959693877551018 C 9.84844387755102,4.509693877551018 9.84844387755102,3.8121938775510182 9.39844387755102,3.362193877551018 L 8.79094387755102,2.777193877551018" stroke-linejoin="round"/>', '<path class="dot" d="M 10.790943877551019,0.7771938775510179 L 10.790943877551019,0.7771938775510179 C 10.34094387755102,0.3271938775510179 9.64344387755102,0.3271938775510178 9.193443877551019,0.7771938775510179 L 8.60844387755102,1.3621938775510183 C 8.158443877551019,1.8121938775510182 8.158443877551019,2.509693877551018 8.60844387755102,2.959693877551018 L 9.21594387755102,3.567193877551018 C 9.665943877551019,4.017193877551017 10.363443877551019,4.017193877551017 10.81344387755102,3.567193877551018 L 11.39844387755102,2.959693877551018 C 11.84844387755102,2.509693877551018 11.84844387755102,1.8121938775510182 11.39844387755102,1.362193877551018 L 10.790943877551019,0.7771938775510181" stroke-linejoin="round"/>', '<path class="dot" d="M 10.790943877551019,-0.22280612244898207 L 10.790943877551019,-0.22280612244898207 C 10.34094387755102,-0.6728061224489821 9.64344387755102,-0.6728061224489822 9.193443877551019,-0.22280612244898207 L 8.60844387755102,0.3621938775510183 C 8.158443877551019,0.8121938775510182 8.158443877551019,1.5096938775510182 8.60844387755102,1.9596938775510184 L 9.21594387755102,2.567193877551018 C 9.665943877551019,3.0171938775510174 10.363443877551019,3.0171938775510174 10.81344387755102,2.567193877551018 L 11.39844387755102,1.9596938775510184 C 11.84844387755102,1.5096938775510182 11.84844387755102,0.8121938775510182 11.39844387755102,0.36219387755101806 L 10.790943877551019,-0.2228061224489819" stroke-linejoin="round"/>']
            
            
            <path d="M 2.0,8.0 L 2.0,22.0" fill="none"
            stroke="black"
            stroke-width="2.5"
            stroke-linecap="round"
            stroke-linejoin="round"
            />
            
            <path d="M 2.0,12.0 L 4.0,9.0 L 6.0,8.0 L 8.0,8.0 L 9.0,9.0 L 10.0,12.0 L 10.0,22.0" fill="none"
            stroke="black"
            stroke-width="2.5"
            stroke-linecap="round"
            stroke-linejoin="round"
            />
            
            <path d="M 2.0,5.0 L 2.0,4.0 L 4.0,2.0 L 5.0,2.0 L 7.0,4.0 L 8.0,4.0 L 10.0,2.0 L 10.0,1.0" fill="none"
            stroke="black"
            stroke-width="2.5"
            stroke-linecap="round"
            stroke-linejoin="round"
            />
            
            
        </svg>