<?xml version="1.0"?><!DOCTYPE svg PUBLIC "-//W3C//DTD SVG 1.1//EN" "http://www.w3.org/Graphics/SVG/1.1/DTD/svg11.dtd"><svg xmlns="http://www.w3.org/2000/svg" xmlns:xlink="http://www.w3.org/1999/xlink" width="350" height="1000" viewBox="0 0 7 17" >
            
                ['<path class="dot" d="M 2.885,0.31800000000000006 L 2.885,0.31800000000000006 C 2.665,0.09799999999999998 2.324,0.09799999999999995 2.1039999999999996,0.31800000000000006 L 1.8179999999999998,0.6040000000000002 C 1.5979999999999999,0.8240000000000002 1.5979999999999996,1.1650000000000003 1.8179999999999998,1.3850000000000002 L 2.1149999999999998,1.682 C 2.335,1.902 2.676,1.902 2.896,1.682 L 3.1820000000000004,1.3850000000000002 C 3.402,1.165 3.402,0.8240000000000002 3.1820000000000004,0.6040000000000001 L 2.885,0.31800000000000006" stroke-linejoin="round"/>', '<path class="dot" d="M 4.885,0.31800000000000006 L 4.885,0.31800000000000006 C 4.664999999999999,0.09799999999999998 4.324,0.09799999999999995 4.103999999999999,0.31800000000000006 L 3.8179999999999996,0.6040000000000002 C 3.5979999999999994,0.8240000000000002 3.5979999999999994,1.1650000000000003 3.8179999999999996,1.3850000000000002 L 4.114999999999999,1.682 C 4.334999999999999,1.902 4.676,1.902 4.895999999999999,1.682 L 5.182,1.3850000000000002 C 5.402,1.165 5.402,0.8240000000000002 5.182,0.6040000000000001 L 4.885,0.31800000000000006" stroke-linejoin="round"/>']
            
                ['<path class="dot" d="M 4.885,0.31800000000000006 L 4.885,0.31800000000000006 C 4.664999999999999,0.09799999999999998 4.324,0.09799999999999995 4.103999999999999,0.31800000000000006 L 3.8179999999999996,0.6040000000000002 C 3.5979999999999994,0.8240000000000002 3.5979999999999994,1.1650000000000003 3.8179999999999996,1.3850000000000002 L 4.114999999999999,1.682 C 4.334999999999999,1.902 4.676,1.902 4.895999999999999,1.682 L 5.182,1.3850000000000002 C 5.402,1.165 5.402,0.8240000000000002 5.182,0.6040000000000001 L 4.885,0.31800000000000006" stroke-linejoin="round"/>', '<path class="dot" d="M 4.885,13.318 L 4.885,13.318 C 4.664999999999999,13.098 4.324,13.098 4.103999999999999,13.318 L 3.8179999999999996,13.604000000000001 C 3.5979999999999994,13.824 3.5979999999999994,14.165000000000001 3.8179999999999996,14.385000000000002 L 4.114999999999999,14.682 C 4.334999999999999,14.902000000000001 4.676,14.902000000000001 4.895999999999999,14.682 L 5.182,14.385000000000002 C 5.402,14.165000000000001 5.402,13.824 5.182,13.604000000000001 L 4.885,13.318000000000001" stroke-linejoin="round"/>']
            
                ['<path class="dot" d="M 2.885,13.318 L 2.885,13.318 C 2.665,13.098 2.324,13.098 2.1039999999999996,13.318 L 1.8179999999999998,13.604000000000001 C 1.5979999999999999,13.824 1.5979999999999996,14.165000000000001 1.8179999999999998,14.385000000000002 L 2.1149999999999998,14.682 C 2.335,14.902000000000001 2.676,14.902000000000001 2.896,14.682 L 3.1820000000000004,14.385000000000002 C 3.402,14.165000000000001 3.402,13.824 3.1820000000000004,13.604000000000001 L 2.885,13.318000000000001" stroke-linejoin="round"/>', '<path class="dot" d="M 4.885,13.318 L 4.885,13.318 C 4.664999999999999,13.098 4.324,13.098 4.103999999999999,13.318 L 3.8179999999999996,13.604000000000001 C 3.5979999999999994,13.824 3.5979999999999994,14.165000000000001 3.8179999999999996,14.385000000000002 L 4.114999999999999,14.682 C 4.334999999999999,14.902000000000001 4.676,14.902000000000001 4.895999999999999,14.682 L 5.182,14.385000000000002 C 5.402,14.165000000000001 5.402,13.824 5.182,13.604000000000001 L 4.885,13.318000000000001" stroke-linejoin="round"/>']
            
            
            <path d="M 2.5,1.0 L 4.5,1.0" fill="none"
            stroke="black"
            stroke-width="1"
            stroke-linecap="round"
            stroke-linejoin="round"
            />
            
            <path d="M 4.5,1.0 L 4.5,14.0" fill="none"
            stroke="black"
            stroke-width="1"
            stroke-linecap="round"
            stroke-linejoin="round"
            />
            
            <path d="M 2.5,14.0 L 4.5,14.0" fill="none"
            stroke="black"
            stroke-width="1"
            stroke-linecap="round"
            stroke-linejoin="round"
            />
            
            
        </svg>