<?xml version="1.0"?><!DOCTYPE svg PUBLIC "-//W3C//DTD SVG 1.1//EN" "http://www.w3.org/Graphics/SVG/1.1/DTD/svg11.dtd"><svg xmlns="http://www.w3.org/2000/svg" xmlns:xlink="http://www.w3.org/1999/xlink" width="350" height="1000" viewBox="0 0 7 17" >
            
                ['<path class="dot" d="M 2.385,3.318 L 2.385,3.318 C 2.165,3.098 1.8239999999999998,3.098 1.6039999999999999,3.318 L 1.3179999999999998,3.604 C 1.0979999999999999,3.8240000000000003 1.0979999999999996,4.165 1.3179999999999998,4.385 L 1.6149999999999998,4.682 C 1.8349999999999997,4.902 2.176,4.902 2.396,4.682 L 2.6820000000000004,4.385 C 2.902,4.165 2.902,3.8240000000000003 2.6820000000000004,3.604 L 2.385,3.318" stroke-linejoin="round"/>', '<path class="dot" d="M 6.385,3.318 L 6.385,3.318 C 6.164999999999999,3.098 5.824,3.098 5.603999999999999,3.318 L 5.318,3.604 C 5.098,3.8240000000000003 5.098,4.165 5.318,4.385 L 5.614999999999999,4.682 C 5.834999999999999,4.902 6.176,4.902 6.395999999999999,4.682 L 6.682,4.385 C 6.902,4.165 6.902,3.8240000000000003 6.682,3.604 L 6.385,3.318" stroke-linejoin="round"/>', '<path class="dot" d="M 4.385000099999999,10.318 L 4.385000099999999,10.318 C 4.1650000999999985,10.098 3.8240000999999992,10.098 3.604000099999999,10.318 L 3.318000099999999,10.604000000000001 C 3.098000099999999,10.824 3.098000099999999,11.165000000000001 3.318000099999999,11.385000000000002 L 3.6150000999999987,11.682 C 3.835000099999999,11.902000000000001 4.1760000999999995,11.902000000000001 4.396000099999998,11.682 L 4.6820001,11.385000000000002 C 4.9020000999999995,11.165000000000001 4.9020000999999995,10.824 4.6820001,10.604000000000001 L 4.385000099999999,10.318000000000001" stroke-linejoin="round"/>']
            
                ['<path class="dot" d="M 4.385,10.318 L 4.385,10.318 C 4.164999999999999,10.098 3.824,10.098 3.6039999999999996,10.318 L 3.3179999999999996,10.604000000000001 C 3.0979999999999994,10.824 3.0979999999999994,11.165000000000001 3.3179999999999996,11.385000000000002 L 3.6149999999999993,11.682 C 3.8349999999999995,11.902000000000001 4.176,11.902000000000001 4.395999999999999,11.682 L 4.682,11.385000000000002 C 4.902,11.165000000000001 4.902,10.824 4.682,10.604000000000001 L 4.385,10.318000000000001" stroke-linejoin="round"/>', '<path class="dot" d="M 3.385,12.318 L 3.385,12.318 C 3.1649999999999996,12.098 2.824,12.098 2.6039999999999996,12.318 L 2.3179999999999996,12.604000000000001 C 2.0979999999999994,12.824 2.0979999999999994,13.165000000000001 2.3179999999999996,13.385000000000002 L 2.6149999999999993,13.682 C 2.8349999999999995,13.902000000000001 3.1759999999999997,13.902000000000001 3.3959999999999995,13.682 L 3.682,13.385000000000002 C 3.902,13.165000000000001 3.902,12.824 3.682,12.604000000000001 L 3.385,12.318000000000001" stroke-linejoin="round"/>', '<path class="dot" d="M 2.385,13.318 L 2.385,13.318 C 2.165,13.098 1.8239999999999998,13.098 1.6039999999999999,13.318 L 1.3179999999999998,13.604000000000001 C 1.0979999999999999,13.824 1.0979999999999996,14.165000000000001 1.3179999999999998,14.385000000000002 L 1.6149999999999998,14.682 C 1.8349999999999997,14.902000000000001 2.176,14.902000000000001 2.396,14.682 L 2.6820000000000004,14.385000000000002 C 2.902,14.165000000000001 2.902,13.824 2.6820000000000004,13.604000000000001 L 2.385,13.318000000000001" stroke-linejoin="round"/>']
            
            
            <path d="M 2.0,4.0 L 4.000000099999999,11.0 M 6.0,4.0 L 4.000000099999999,11.0" fill="none"
            stroke="black"
            stroke-width="1"
            stroke-linecap="round"
            stroke-linejoin="round"
            />
            
            <path d="M 4.0,11.0 L 3.0,13.0 L 2.0,14.0" fill="none"
            stroke="black"
            stroke-width="1"
            stroke-linecap="round"
            stroke-linejoin="round"
            />
            
            
        </svg>