<?xml version="1.0"?><!DOCTYPE svg PUBLIC "-//W3C//DTD SVG 1.1//EN" "http://www.w3.org/Graphics/SVG/1.1/DTD/svg11.dtd"><svg xmlns="http://www.w3.org/2000/svg" xmlns:xlink="http://www.w3.org/1999/xlink" width="350" height="1000" viewBox="0 0 14 40" >
            
                ['<path class="dot" d="M 5.790943877551021,3.7771938775510177 L 5.79094387755102,3.7771938775510177 C 5.34094387755102,3.327193877551018 4.64344387755102,3.3271938775510175 4.1934438775510205,3.7771938775510177 L 3.60844387755102,4.362193877551018 C 3.1584438775510204,4.812193877551018 3.15844387755102,5.509693877551018 3.60844387755102,5.959693877551018 L 4.21594387755102,6.567193877551018 C 4.66594387755102,7.017193877551017 5.3634438775510205,7.017193877551017 5.81344387755102,6.567193877551018 L 6.398443877551021,5.959693877551018 C 6.84844387755102,5.509693877551018 6.84844387755102,4.812193877551018 6.398443877551021,4.362193877551018 L 5.790943877551021,3.777193877551018" stroke-linejoin="round"/>', '<path class="dot" d="M 6.790943877551021,2.7771938775510177 L 6.79094387755102,2.7771938775510177 C 6.34094387755102,2.327193877551018 5.64344387755102,2.3271938775510175 5.1934438775510205,2.7771938775510177 L 4.608443877551021,3.362193877551018 C 4.15844387755102,3.8121938775510182 4.15844387755102,4.509693877551018 4.608443877551021,4.959693877551018 L 5.21594387755102,5.567193877551018 C 5.66594387755102,6.017193877551017 6.3634438775510205,6.017193877551017 6.81344387755102,5.567193877551018 L 7.398443877551021,4.959693877551018 C 7.84844387755102,4.509693877551018 7.84844387755102,3.8121938775510182 7.398443877551021,3.362193877551018 L 6.790943877551021,2.777193877551018" stroke-linejoin="round"/>', '<path class="dot" d="M 8.79094387755102,-0.22280612244898207 L 8.790943877551019,-0.22280612244898207 C 8.34094387755102,-0.6728061224489821 7.64344387755102,-0.6728061224489822 7.1934438775510205,-0.22280612244898207 L 6.608443877551021,0.3621938775510183 C 6.15844387755102,0.8121938775510182 6.15844387755102,1.5096938775510182 6.608443877551021,1.9596938775510184 L 7.21594387755102,2.567193877551018 C 7.66594387755102,3.0171938775510174 8.36344387755102,3.0171938775510174 8.81344387755102,2.567193877551018 L 9.39844387755102,1.9596938775510184 C 9.84844387755102,1.5096938775510182 9.84844387755102,0.8121938775510182 9.39844387755102,0.36219387755101806 L 8.79094387755102,-0.2228061224489819" stroke-linejoin="round"/>', '<path class="dot" d="M 8.79094387755102,20.777193877551017 L 8.790943877551019,20.777193877551017 C 8.34094387755102,20.327193877551018 7.64344387755102,20.327193877551018 7.1934438775510205,20.777193877551017 L 6.608443877551021,21.362193877551018 C 6.15844387755102,21.812193877551017 6.15844387755102,22.50969387755102 6.608443877551021,22.959693877551018 L 7.21594387755102,23.56719387755102 C 7.66594387755102,24.01719387755102 8.36344387755102,24.01719387755102 8.81344387755102,23.56719387755102 L 9.39844387755102,22.959693877551018 C 9.84844387755102,22.50969387755102 9.84844387755102,21.812193877551017 9.39844387755102,21.362193877551018 L 8.79094387755102,20.777193877551017" stroke-linejoin="round"/>']
            
            
            <path d="M 5.0,5.0 L 6.0,4.0 L 8.0,1.0 L 8.0,22.0" fill="none"
            stroke="black"
            stroke-width="2.5"
            stroke-linecap="round"
            stroke-linejoin="round"
            />
            
            
        </svg>