<?xml version="1.0"?><!DOCTYPE svg PUBLIC "-//W3C//DTD SVG 1.1//EN" "http://www.w3.org/Graphics/SVG/1.1/DTD/svg11.dtd"><svg xmlns="http://www.w3.org/2000/svg" xmlns:xlink="http://www.w3.org/1999/xlink" width="350" height="1000" viewBox="0 0 10 26" >
            
                ['<path class="dot" d="M 4.519583333333333,0.1402708333333331 L 4.519583333333333,0.1402708333333331 C 4.229583333333333,-0.14972916666666694 3.7800833333333332,-0.149729166666667 3.490083333333333,0.1402708333333331 L 3.113083333333333,0.5172708333333332 C 2.823083333333333,0.8072708333333332 2.823083333333333,1.2567708333333332 3.113083333333333,1.5467708333333332 L 3.504583333333333,1.938270833333333 C 3.7945833333333328,2.228270833333333 4.244083333333333,2.228270833333333 4.534083333333333,1.938270833333333 L 4.911083333333334,1.5467708333333332 C 5.201083333333333,1.2567708333333332 5.201083333333333,0.8072708333333333 4.911083333333334,0.5172708333333331 L 4.519583333333333,0.14027083333333312" stroke-linejoin="round"/>', '<path class="dot" d="M 3.5195833333333333,1.1402710333333332 L 3.5195833333333333,1.1402710333333332 C 3.2295833333333333,0.8502710333333332 2.7800833333333332,0.8502710333333331 2.490083333333333,1.1402710333333332 L 2.113083333333333,1.5172710333333335 C 1.8230833333333332,1.8072710333333333 1.8230833333333332,2.256771033333333 2.113083333333333,2.546771033333333 L 2.504583333333333,2.938271033333333 C 2.7945833333333328,3.228271033333333 3.244083333333333,3.228271033333333 3.5340833333333332,2.938271033333333 L 3.9110833333333335,2.546771033333333 C 4.201083333333333,2.256771033333333 4.201083333333333,1.8072710333333335 3.9110833333333335,1.5172710333333332 L 3.5195833333333333,1.1402710333333332" stroke-linejoin="round"/>', '<path class="dot" d="M 2.5195833333333333,0.1402708333333331 L 2.5195833333333333,0.1402708333333331 C 2.2295833333333333,-0.14972916666666694 1.7800833333333332,-0.149729166666667 1.4900833333333332,0.1402708333333331 L 1.1130833333333332,0.5172708333333332 C 0.8230833333333332,0.8072708333333332 0.8230833333333331,1.2567708333333332 1.1130833333333332,1.5467708333333332 L 1.5045833333333332,1.938270833333333 C 1.794583333333333,2.228270833333333 2.244083333333333,2.228270833333333 2.5340833333333332,1.938270833333333 L 2.9110833333333335,1.5467708333333332 C 3.2010833333333335,1.2567708333333332 3.2010833333333335,0.8072708333333333 2.9110833333333335,0.5172708333333331 L 2.5195833333333333,0.14027083333333312" stroke-linejoin="round"/>', '<path class="dot" d="M 3.5195833333333333,-0.8597291666666669 L 3.5195833333333333,-0.8597291666666669 C 3.2295833333333333,-1.149729166666667 2.7800833333333332,-1.149729166666667 2.490083333333333,-0.8597291666666669 L 2.113083333333333,-0.48272916666666676 C 1.8230833333333332,-0.19272916666666684 1.8230833333333332,0.25677083333333317 2.113083333333333,0.5467708333333332 L 2.504583333333333,0.9382708333333329 C 2.7945833333333328,1.228270833333333 3.244083333333333,1.228270833333333 3.5340833333333332,0.9382708333333329 L 3.9110833333333335,0.5467708333333332 C 4.201083333333333,0.25677083333333317 4.201083333333333,-0.19272916666666673 3.9110833333333335,-0.4827291666666669 L 3.5195833333333333,-0.8597291666666669" stroke-linejoin="round"/>', '<path class="dot" d="M 4.519583333333333,0.1402708333333331 L 4.519583333333333,0.1402708333333331 C 4.229583333333333,-0.14972916666666694 3.7800833333333332,-0.149729166666667 3.490083333333333,0.1402708333333331 L 3.113083333333333,0.5172708333333332 C 2.823083333333333,0.8072708333333332 2.823083333333333,1.2567708333333332 3.113083333333333,1.5467708333333332 L 3.504583333333333,1.938270833333333 C 3.7945833333333328,2.228270833333333 4.244083333333333,2.228270833333333 4.534083333333333,1.938270833333333 L 4.911083333333334,1.5467708333333332 C 5.201083333333333,1.2567708333333332 5.201083333333333,0.8072708333333333 4.911083333333334,0.5172708333333331 L 4.519583333333333,0.14027083333333312" stroke-linejoin="round"/>', '<path class="dot" d="M 4.519583333333333,3.1402708333333327 L 4.519583333333333,3.1402708333333327 C 4.229583333333333,2.8502708333333326 3.7800833333333332,2.8502708333333326 3.490083333333333,3.1402708333333327 L 3.113083333333333,3.517270833333333 C 2.823083333333333,3.807270833333333 2.823083333333333,4.2567708333333325 3.113083333333333,4.546770833333333 L 3.504583333333333,4.938270833333332 C 3.7945833333333328,5.228270833333333 4.244083333333333,5.228270833333333 4.534083333333333,4.938270833333332 L 4.911083333333334,4.546770833333333 C 5.201083333333333,4.2567708333333325 5.201083333333333,3.807270833333333 4.911083333333334,3.517270833333333 L 4.519583333333333,3.140270833333333" stroke-linejoin="round"/>', '<path class="dot" d="M 2.5195833333333333,5.140270833333333 L 2.5195833333333333,5.140270833333333 C 2.2295833333333333,4.850270833333333 1.7800833333333332,4.850270833333333 1.4900833333333332,5.140270833333333 L 1.1130833333333332,5.517270833333333 C 0.8230833333333332,5.807270833333333 0.8230833333333331,6.2567708333333325 1.1130833333333332,6.546770833333333 L 1.5045833333333332,6.938270833333332 C 1.794583333333333,7.228270833333333 2.244083333333333,7.228270833333333 2.5340833333333332,6.938270833333332 L 2.9110833333333335,6.546770833333333 C 3.2010833333333335,6.2567708333333325 3.2010833333333335,5.807270833333333 2.9110833333333335,5.517270833333333 L 2.5195833333333333,5.140270833333333" stroke-linejoin="round"/>']
            
                ['<path class="dot" d="M 8.519583333333333,0.1402708333333331 L 8.519583333333333,0.1402708333333331 C 8.229583333333332,-0.14972916666666694 7.780083333333333,-0.149729166666667 7.490083333333333,0.1402708333333331 L 7.113083333333333,0.5172708333333332 C 6.823083333333333,0.8072708333333332 6.823083333333333,1.2567708333333332 7.113083333333333,1.5467708333333332 L 7.504583333333333,1.938270833333333 C 7.794583333333333,2.228270833333333 8.244083333333332,2.228270833333333 8.534083333333333,1.938270833333333 L 8.911083333333334,1.5467708333333332 C 9.201083333333333,1.2567708333333332 9.201083333333333,0.8072708333333333 8.911083333333334,0.5172708333333331 L 8.519583333333333,0.14027083333333312" stroke-linejoin="round"/>', '<path class="dot" d="M 7.519583333333333,1.1402710333333332 L 7.519583333333332,1.1402710333333332 C 7.229583333333332,0.8502710333333332 6.780083333333333,0.8502710333333331 6.490083333333333,1.1402710333333332 L 6.113083333333333,1.5172710333333335 C 5.823083333333333,1.8072710333333333 5.823083333333333,2.256771033333333 6.113083333333333,2.546771033333333 L 6.504583333333333,2.938271033333333 C 6.794583333333333,3.228271033333333 7.244083333333332,3.228271033333333 7.534083333333332,2.938271033333333 L 7.911083333333333,2.546771033333333 C 8.201083333333333,2.256771033333333 8.201083333333333,1.8072710333333335 7.911083333333333,1.5172710333333332 L 7.519583333333333,1.1402710333333332" stroke-linejoin="round"/>', '<path class="dot" d="M 6.519583333333333,0.1402708333333331 L 6.519583333333332,0.1402708333333331 C 6.229583333333332,-0.14972916666666694 5.780083333333333,-0.149729166666667 5.490083333333333,0.1402708333333331 L 5.113083333333333,0.5172708333333332 C 4.823083333333333,0.8072708333333332 4.823083333333333,1.2567708333333332 5.113083333333333,1.5467708333333332 L 5.504583333333333,1.938270833333333 C 5.794583333333333,2.228270833333333 6.244083333333332,2.228270833333333 6.534083333333332,1.938270833333333 L 6.911083333333333,1.5467708333333332 C 7.201083333333333,1.2567708333333332 7.201083333333333,0.8072708333333333 6.911083333333333,0.5172708333333331 L 6.519583333333333,0.14027083333333312" stroke-linejoin="round"/>', '<path class="dot" d="M 7.519583333333333,-0.8597291666666669 L 7.519583333333332,-0.8597291666666669 C 7.229583333333332,-1.149729166666667 6.780083333333333,-1.149729166666667 6.490083333333333,-0.8597291666666669 L 6.113083333333333,-0.48272916666666676 C 5.823083333333333,-0.19272916666666684 5.823083333333333,0.25677083333333317 6.113083333333333,0.5467708333333332 L 6.504583333333333,0.9382708333333329 C 6.794583333333333,1.228270833333333 7.244083333333332,1.228270833333333 7.534083333333332,0.9382708333333329 L 7.911083333333333,0.5467708333333332 C 8.201083333333333,0.25677083333333317 8.201083333333333,-0.19272916666666673 7.911083333333333,-0.4827291666666669 L 7.519583333333333,-0.8597291666666669" stroke-linejoin="round"/>', '<path class="dot" d="M 8.519583333333333,0.1402708333333331 L 8.519583333333333,0.1402708333333331 C 8.229583333333332,-0.14972916666666694 7.780083333333333,-0.149729166666667 7.490083333333333,0.1402708333333331 L 7.113083333333333,0.5172708333333332 C 6.823083333333333,0.8072708333333332 6.823083333333333,1.2567708333333332 7.113083333333333,1.5467708333333332 L 7.504583333333333,1.938270833333333 C 7.794583333333333,2.228270833333333 8.244083333333332,2.228270833333333 8.534083333333333,1.938270833333333 L 8.911083333333334,1.5467708333333332 C 9.201083333333333,1.2567708333333332 9.201083333333333,0.8072708333333333 8.911083333333334,0.5172708333333331 L 8.519583333333333,0.14027083333333312" stroke-linejoin="round"/>', '<path class="dot" d="M 8.519583333333333,3.1402708333333327 L 8.519583333333333,3.1402708333333327 C 8.229583333333332,2.8502708333333326 7.780083333333333,2.8502708333333326 7.490083333333333,3.1402708333333327 L 7.113083333333333,3.517270833333333 C 6.823083333333333,3.807270833333333 6.823083333333333,4.2567708333333325 7.113083333333333,4.546770833333333 L 7.504583333333333,4.938270833333332 C 7.794583333333333,5.228270833333333 8.244083333333332,5.228270833333333 8.534083333333333,4.938270833333332 L 8.911083333333334,4.546770833333333 C 9.201083333333333,4.2567708333333325 9.201083333333333,3.807270833333333 8.911083333333334,3.517270833333333 L 8.519583333333333,3.140270833333333" stroke-linejoin="round"/>', '<path class="dot" d="M 6.519583333333333,5.140270833333333 L 6.519583333333332,5.140270833333333 C 6.229583333333332,4.850270833333333 5.780083333333333,4.850270833333333 5.490083333333333,5.140270833333333 L 5.113083333333333,5.517270833333333 C 4.823083333333333,5.807270833333333 4.823083333333333,6.2567708333333325 5.113083333333333,6.546770833333333 L 5.504583333333333,6.938270833333332 C 5.794583333333333,7.228270833333333 6.244083333333332,7.228270833333333 6.534083333333332,6.938270833333332 L 6.911083333333333,6.546770833333333 C 7.201083333333333,6.2567708333333325 7.201083333333333,5.807270833333333 6.911083333333333,5.517270833333333 L 6.519583333333333,5.140270833333333" stroke-linejoin="round"/>']
            
            
            <path d="M 4.0,1.0 L 3.0,2.0000002 L 2.0,1.0 L 3.0,0.0 L 4.0,1.0 L 4.0,4.0 L 2.0,6.0" fill="none"
            stroke="black"
            stroke-width="1.5"
            stroke-linecap="round"
            stroke-linejoin="round"
            />
            
            <path d="M 8.0,1.0 L 7.0,2.0000002 L 6.0,1.0 L 7.0,0.0 L 8.0,1.0 L 8.0,4.0 L 6.0,6.0" fill="none"
            stroke="black"
            stroke-width="1.5"
            stroke-linecap="round"
            stroke-linejoin="round"
            />
            
            
        </svg>