<?xml version="1.0"?><!DOCTYPE svg PUBLIC "-//W3C//DTD SVG 1.1//EN" "http://www.w3.org/Graphics/SVG/1.1/DTD/svg11.dtd"><svg xmlns="http://www.w3.org/2000/svg" xmlns:xlink="http://www.w3.org/1999/xlink" width="350" height="1000" viewBox="0 0 14 40" >
            
                ['<path class="dot" d="M 2.7909438775510207,6.777193877551018 L 2.79094387755102,6.777193877551018 C 2.3409438775510196,6.327193877551018 1.6434438775510198,6.327193877551018 1.19344387755102,6.777193877551018 L 0.6084438775510199,7.362193877551018 C 0.15844387755101996,7.812193877551018 0.15844387755101985,8.509693877551019 0.6084438775510199,8.959693877551018 L 1.2159438775510198,9.567193877551018 C 1.6659438775510198,10.017193877551017 2.3634438775510196,10.017193877551017 2.8134438775510198,9.567193877551018 L 3.3984438775510206,8.959693877551018 C 3.84844387755102,8.509693877551019 3.84844387755102,7.812193877551018 3.3984438775510206,7.362193877551018 L 2.7909438775510207,6.777193877551018" stroke-linejoin="round"/>', '<path class="dot" d="M 12.790943877551019,6.777193877551018 L 12.790943877551019,6.777193877551018 C 12.34094387755102,6.327193877551018 11.64344387755102,6.327193877551018 11.193443877551019,6.777193877551018 L 10.60844387755102,7.362193877551018 C 10.158443877551019,7.812193877551018 10.158443877551019,8.509693877551019 10.60844387755102,8.959693877551018 L 11.21594387755102,9.567193877551018 C 11.665943877551019,10.017193877551017 12.363443877551019,10.017193877551017 12.81344387755102,9.567193877551018 L 13.39844387755102,8.959693877551018 C 13.84844387755102,8.509693877551019 13.84844387755102,7.812193877551018 13.39844387755102,7.362193877551018 L 12.790943877551019,6.777193877551018" stroke-linejoin="round"/>', '<path class="dot" d="M 7.790943877551021,20.777193877551017 L 7.79094387755102,20.777193877551017 C 7.34094387755102,20.327193877551018 6.64344387755102,20.327193877551018 6.1934438775510205,20.777193877551017 L 5.608443877551021,21.362193877551018 C 5.15844387755102,21.812193877551017 5.15844387755102,22.50969387755102 5.608443877551021,22.959693877551018 L 6.21594387755102,23.56719387755102 C 6.66594387755102,24.01719387755102 7.3634438775510205,24.01719387755102 7.81344387755102,23.56719387755102 L 8.39844387755102,22.959693877551018 C 8.84844387755102,22.50969387755102 8.84844387755102,21.812193877551017 8.39844387755102,21.362193877551018 L 7.790943877551021,20.777193877551017" stroke-linejoin="round"/>']
            
            
            <path d="M 2.0,8.0 L 7.0,22.0 M 12.0,8.0 L 7.0,22.0" fill="none"
            stroke="black"
            stroke-width="2.5"
            stroke-linecap="round"
            stroke-linejoin="round"
            />
            
            
        </svg>