<?xml version="1.0"?><!DOCTYPE svg PUBLIC "-//W3C//DTD SVG 1.1//EN" "http://www.w3.org/Graphics/SVG/1.1/DTD/svg11.dtd"><svg xmlns="http://www.w3.org/2000/svg" xmlns:xlink="http://www.w3.org/1999/xlink" width="350" height="1000" viewBox="0 0 7 17" >
            
                ['<path class="dot" d="M 0.885,0.31800000000000006 L 0.8849999999999998,0.31800000000000006 C 0.6649999999999998,0.09799999999999998 0.32399999999999984,0.09799999999999995 0.10399999999999981,0.31800000000000006 L -0.1820000000000002,0.6040000000000002 C -0.40200000000000025,0.8240000000000002 -0.40200000000000025,1.1650000000000003 -0.1820000000000002,1.3850000000000002 L 0.11499999999999977,1.682 C 0.33499999999999974,1.902 0.6759999999999999,1.902 0.8959999999999997,1.682 L 1.1820000000000002,1.3850000000000002 C 1.4020000000000001,1.165 1.4020000000000001,0.8240000000000002 1.1820000000000002,0.6040000000000001 L 0.885,0.31800000000000006" stroke-linejoin="round"/>', '<path class="dot" d="M 3.885,10.318 L 3.885,10.318 C 3.6649999999999996,10.098 3.324,10.098 3.1039999999999996,10.318 L 2.8179999999999996,10.604000000000001 C 2.5979999999999994,10.824 2.5979999999999994,11.165000000000001 2.8179999999999996,11.385000000000002 L 3.1149999999999993,11.682 C 3.3349999999999995,11.902000000000001 3.6759999999999997,11.902000000000001 3.8959999999999995,11.682 L 4.182,11.385000000000002 C 4.402,11.165000000000001 4.402,10.824 4.182,10.604000000000001 L 3.885,10.318000000000001" stroke-linejoin="round"/>', '<path class="dot" d="M 6.885,0.31800000000000006 L 6.885,0.31800000000000006 C 6.664999999999999,0.09799999999999998 6.324,0.09799999999999995 6.103999999999999,0.31800000000000006 L 5.818,0.6040000000000002 C 5.598,0.8240000000000002 5.598,1.1650000000000003 5.818,1.3850000000000002 L 6.114999999999999,1.682 C 6.334999999999999,1.902 6.676,1.902 6.895999999999999,1.682 L 7.182,1.3850000000000002 C 7.402,1.165 7.402,0.8240000000000002 7.182,0.6040000000000001 L 6.885,0.31800000000000006" stroke-linejoin="round"/>']
            
            
            <path d="M 0.5,1.0 L 3.5,11.0 L 6.5,1.0" fill="none"
            stroke="black"
            stroke-width="1"
            stroke-linecap="round"
            stroke-linejoin="round"
            />
            
            
        </svg>