<?xml version="1.0" encoding="UTF-8" standalone="no"?>
<svg
   xmlns:dc="http://purl.org/dc/elements/1.1/"
   xmlns:cc="http://creativecommons.org/ns#"
   xmlns:rdf="http://www.w3.org/1999/02/22-rdf-syntax-ns#"
   xmlns:svg="http://www.w3.org/2000/svg"
   xmlns="http://www.w3.org/2000/svg"
   xmlns:sodipodi="http://sodipodi.sourceforge.net/DTD/sodipodi-0.dtd"
   xmlns:inkscape="http://www.inkscape.org/namespaces/inkscape"
   data-dec="103"
   width="14"
   height="40"
   version="1.1"
   id="svg1764"
   sodipodi:docname="103.svg"
   inkscape:version="0.92.2 5c3e80d, 2017-08-06">
  <metadata
     id="metadata1770">
    <rdf:RDF>
      <cc:Work
         rdf:about="">
        <dc:format>image/svg+xml</dc:format>
        <dc:type
           rdf:resource="http://purl.org/dc/dcmitype/StillImage" />
        <dc:title></dc:title>
      </cc:Work>
    </rdf:RDF>
  </metadata>
  <defs
     id="defs1768" />
  <sodipodi:namedview
     pagecolor="#ffffff"
     bordercolor="#666666"
     borderopacity="1"
     objecttolerance="10"
     gridtolerance="10"
     guidetolerance="10"
     inkscape:pageopacity="0"
     inkscape:pageshadow="2"
     inkscape:window-width="1363"
     inkscape:window-height="817"
     id="namedview1766"
     showgrid="true"
     showguides="true"
     inkscape:guide-bbox="true"
     inkscape:zoom="16.68772"
     inkscape:cx="0.42959357"
     inkscape:cy="25.855416"
     inkscape:window-x="24"
     inkscape:window-y="42"
     inkscape:window-maximized="0"
     inkscape:current-layer="svg1764">
    <inkscape:grid
       type="xygrid"
       id="grid2315" />
    <sodipodi:guide
       position="9,18"
       orientation="0,1"
       id="guide2317"
       inkscape:locked="false" />
    <sodipodi:guide
       position="10,32"
       orientation="0,1"
       id="guide2319"
       inkscape:locked="false" />
  </sodipodi:namedview>
  <path
     sodipodi:nodetypes="cccccccccccc"
     inkscape:connector-curvature="0"
     id="path1133"
     style="fill:none;stroke:none;stroke-width:2.02366948;stroke-linecap:round;stroke-linejoin:round;stroke-opacity:1"
     d="m 11,11 -1,-2.0000004 -2.0000001,-1 h -2 l -2,1 -2,4.0000004 v 4 l 2,4 2,1 h 2 L 10,21 11,19" />
  <path
     sodipodi:nodetypes="cc"
     inkscape:connector-curvature="0"
     id="path1133-7"
     style="fill:none;stroke:none;stroke-width:2.02366948;stroke-linecap:round;stroke-linejoin:round;stroke-opacity:1"
     d="M 11,8 V 22" />
  <path
     style="fill:none;stroke:#000000;stroke-width:1px;stroke-linecap:butt;stroke-linejoin:miter;stroke-opacity:1"
     d="m 4,28 2,1 h 2 l 2,-2 1,-3 v -2"
     id="path2432"
     inkscape:connector-curvature="0" />
</svg>
