<?xml version="1.0"?><!DOCTYPE svg PUBLIC "-//W3C//DTD SVG 1.1//EN" "http://www.w3.org/Graphics/SVG/1.1/DTD/svg11.dtd"><svg xmlns="http://www.w3.org/2000/svg" xmlns:xlink="http://www.w3.org/1999/xlink" width="350" height="1000" viewBox="0 0 7 17" >
            
                ['<path class="dot" d="M 3.384999999999999,0.31800000000000006 L 3.384999999999999,0.31800000000000006 C 3.1649999999999987,0.09799999999999998 2.823999999999999,0.09799999999999995 2.6039999999999988,0.31800000000000006 L 2.3179999999999987,0.6040000000000002 C 2.0979999999999985,0.8240000000000002 2.0979999999999985,1.1650000000000003 2.3179999999999987,1.3850000000000002 L 2.6149999999999984,1.682 C 2.8349999999999986,1.902 3.175999999999999,1.902 3.3959999999999986,1.682 L 3.681999999999999,1.3850000000000002 C 3.9019999999999992,1.165 3.9019999999999992,0.8240000000000002 3.681999999999999,0.6040000000000001 L 3.384999999999999,0.31800000000000006" stroke-linejoin="round"/>', '<path class="dot" d="M 5.384999999999999,2.318 L 5.384999999999999,2.318 C 5.164999999999999,2.098 4.823999999999999,2.098 4.603999999999998,2.318 L 4.317999999999999,2.604 C 4.097999999999999,2.8240000000000003 4.097999999999999,3.165 4.317999999999999,3.3850000000000002 L 4.614999999999998,3.682 C 4.834999999999999,3.902 5.175999999999998,3.902 5.395999999999999,3.682 L 5.681999999999999,3.3850000000000002 C 5.901999999999999,3.165 5.901999999999999,2.8240000000000003 5.681999999999999,2.604 L 5.384999999999999,2.318" stroke-linejoin="round"/>', '<path class="dot" d="M 6.385,5.3180000000000005 L 6.385,5.3180000000000005 C 6.164999999999999,5.098000000000001 5.824,5.098000000000001 5.603999999999999,5.3180000000000005 L 5.318,5.604000000000001 C 5.098,5.824000000000001 5.098,6.165000000000001 5.318,6.385000000000001 L 5.614999999999999,6.682 C 5.834999999999999,6.902 6.176,6.902 6.395999999999999,6.682 L 6.682,6.385000000000001 C 6.902,6.165000000000001 6.902,5.824000000000001 6.682,5.604000000000001 L 6.385,5.3180000000000005" stroke-linejoin="round"/>', '<path class="dot" d="M 6.385,8.318 L 6.385,8.318 C 6.164999999999999,8.098 5.824,8.098 5.603999999999999,8.318 L 5.318,8.604000000000001 C 5.098,8.824 5.098,9.165000000000001 5.318,9.385000000000002 L 5.614999999999999,9.682 C 5.834999999999999,9.902000000000001 6.176,9.902000000000001 6.395999999999999,9.682 L 6.682,9.385000000000002 C 6.902,9.165000000000001 6.902,8.824 6.682,8.604000000000001 L 6.385,8.318000000000001" stroke-linejoin="round"/>', '<path class="dot" d="M 5.385000000000001,11.318 L 5.385000000000001,11.318 C 5.165000000000001,11.098 4.824000000000001,11.098 4.604,11.318 L 4.3180000000000005,11.604000000000001 C 4.098000000000001,11.824 4.098000000000001,12.165000000000001 4.3180000000000005,12.385000000000002 L 4.615,12.682 C 4.835000000000001,12.902000000000001 5.176,12.902000000000001 5.396000000000001,12.682 L 5.682,12.385000000000002 C 5.902000000000001,12.165000000000001 5.902000000000001,11.824 5.682,11.604000000000001 L 5.385000000000001,11.318000000000001" stroke-linejoin="round"/>', '<path class="dot" d="M 3.3850000000000007,13.318 L 3.3850000000000007,13.318 C 3.1650000000000005,13.098 2.8240000000000007,13.098 2.6040000000000005,13.318 L 2.3180000000000005,13.604000000000001 C 2.0980000000000003,13.824 2.0980000000000003,14.165000000000001 2.3180000000000005,14.385000000000002 L 2.615,14.682 C 2.8350000000000004,14.902000000000001 3.1760000000000006,14.902000000000001 3.3960000000000004,14.682 L 3.682000000000001,14.385000000000002 C 3.902000000000001,14.165000000000001 3.902000000000001,13.824 3.682000000000001,13.604000000000001 L 3.3850000000000007,13.318000000000001" stroke-linejoin="round"/>']
            
            
            <path d="M 2.999999999999999,1.0 L 4.999999999999999,3.0 L 6.0,6.0 L 6.0,9.0 L 5.000000000000001,12.0 L 3.000000000000001,14.0" fill="none"
            stroke="black"
            stroke-width="1"
            stroke-linecap="round"
            stroke-linejoin="round"
            />
            
            
        </svg>