<?xml version="1.0"?><!DOCTYPE svg PUBLIC "-//W3C//DTD SVG 1.1//EN" "http://www.w3.org/Graphics/SVG/1.1/DTD/svg11.dtd"><svg xmlns="http://www.w3.org/2000/svg" xmlns:xlink="http://www.w3.org/1999/xlink" width="350" height="1000" viewBox="0 0 10 26" >
            
                ['<path class="dot" d="M 7.519583333333333,-1.8597295242945362 L 7.519583333333332,-1.8597295242945362 C 7.229583333333332,-2.1497295242945365 6.780083333333333,-2.1497295242945365 6.490083333333333,-1.8597295242945362 L 6.113083333333333,-1.4827295242945362 C 5.823083333333333,-1.1927295242945362 5.823083333333333,-0.7432295242945361 6.113083333333333,-0.4532295242945361 L 6.504583333333333,-0.061729524294536375 C 6.794583333333333,0.22827047570546366 7.244083333333332,0.22827047570546366 7.534083333333332,-0.061729524294536375 L 7.911083333333333,-0.4532295242945361 C 8.201083333333333,-0.7432295242945361 8.201083333333333,-1.1927295242945362 7.911083333333333,-1.4827295242945362 L 7.519583333333333,-1.8597295242945362" stroke-linejoin="round"/>', '<path class="dot" d="M 5.519583333333333,-3.859729481922406 L 5.519583333333333,-3.859729481922406 C 5.229583333333333,-4.149729481922406 4.780083333333333,-4.149729481922406 4.490083333333333,-3.859729481922406 L 4.113083333333333,-3.482729481922406 C 3.823083333333333,-3.192729481922406 3.823083333333333,-2.743229481922406 4.113083333333333,-2.453229481922406 L 4.504583333333333,-2.061729481922406 C 4.794583333333333,-1.771729481922406 5.244083333333333,-1.771729481922406 5.534083333333333,-2.061729481922406 L 5.911083333333334,-2.453229481922406 C 6.201083333333333,-2.743229481922406 6.201083333333333,-3.192729481922406 5.911083333333334,-3.482729481922406 L 5.519583333333333,-3.8597294819224057" stroke-linejoin="round"/>', '<path class="dot" d="M 3.5195833333333333,-1.8597295242945362 L 3.5195833333333333,-1.8597295242945362 C 3.2295833333333333,-2.1497295242945365 2.7800833333333332,-2.1497295242945365 2.490083333333333,-1.8597295242945362 L 2.113083333333333,-1.4827295242945362 C 1.8230833333333332,-1.1927295242945362 1.8230833333333332,-0.7432295242945361 2.113083333333333,-0.4532295242945361 L 2.504583333333333,-0.061729524294536375 C 2.7945833333333328,0.22827047570546366 3.244083333333333,0.22827047570546366 3.5340833333333332,-0.061729524294536375 L 3.9110833333333335,-0.4532295242945361 C 4.201083333333333,-0.7432295242945361 4.201083333333333,-1.1927295242945362 3.9110833333333335,-1.4827295242945362 L 3.5195833333333333,-1.8597295242945362" stroke-linejoin="round"/>']
            
                ['<path class="dot" d="M 4.519583333333333,0.1402708333333331 L 4.519583333333333,0.1402708333333331 C 4.229583333333333,-0.14972916666666694 3.7800833333333332,-0.149729166666667 3.490083333333333,0.1402708333333331 L 3.113083333333333,0.5172708333333332 C 2.823083333333333,0.8072708333333332 2.823083333333333,1.2567708333333332 3.113083333333333,1.5467708333333332 L 3.504583333333333,1.938270833333333 C 3.7945833333333328,2.228270833333333 4.244083333333333,2.228270833333333 4.534083333333333,1.938270833333333 L 4.911083333333334,1.5467708333333332 C 5.201083333333333,1.2567708333333332 5.201083333333333,0.8072708333333333 4.911083333333334,0.5172708333333331 L 4.519583333333333,0.14027083333333312" stroke-linejoin="round"/>', '<path class="dot" d="M 6.519583333333333,0.1402708333333331 L 6.519583333333332,0.1402708333333331 C 6.229583333333332,-0.14972916666666694 5.780083333333333,-0.149729166666667 5.490083333333333,0.1402708333333331 L 5.113083333333333,0.5172708333333332 C 4.823083333333333,0.8072708333333332 4.823083333333333,1.2567708333333332 5.113083333333333,1.5467708333333332 L 5.504583333333333,1.938270833333333 C 5.794583333333333,2.228270833333333 6.244083333333332,2.228270833333333 6.534083333333332,1.938270833333333 L 6.911083333333333,1.5467708333333332 C 7.201083333333333,1.2567708333333332 7.201083333333333,0.8072708333333333 6.911083333333333,0.5172708333333331 L 6.519583333333333,0.14027083333333312" stroke-linejoin="round"/>', '<path class="dot" d="M 7.519583333333333,1.1402708333333331 L 7.519583333333332,1.1402708333333331 C 7.229583333333332,0.8502708333333331 6.780083333333333,0.850270833333333 6.490083333333333,1.1402708333333331 L 6.113083333333333,1.5172708333333333 C 5.823083333333333,1.8072708333333332 5.823083333333333,2.2567708333333334 6.113083333333333,2.5467708333333334 L 6.504583333333333,2.938270833333333 C 6.794583333333333,3.228270833333333 7.244083333333332,3.228270833333333 7.534083333333332,2.938270833333333 L 7.911083333333333,2.5467708333333334 C 8.201083333333333,2.2567708333333334 8.201083333333333,1.8072708333333334 7.911083333333333,1.5172708333333331 L 7.519583333333333,1.1402708333333331" stroke-linejoin="round"/>', '<path class="dot" d="M 8.519583333333333,5.140270833333333 L 8.519583333333333,5.140270833333333 C 8.229583333333332,4.850270833333333 7.780083333333333,4.850270833333333 7.490083333333333,5.140270833333333 L 7.113083333333333,5.517270833333333 C 6.823083333333333,5.807270833333333 6.823083333333333,6.2567708333333325 7.113083333333333,6.546770833333333 L 7.504583333333333,6.938270833333332 C 7.794583333333333,7.228270833333333 8.244083333333332,7.228270833333333 8.534083333333333,6.938270833333332 L 8.911083333333334,6.546770833333333 C 9.201083333333333,6.2567708333333325 9.201083333333333,5.807270833333333 8.911083333333334,5.517270833333333 L 8.519583333333333,5.140270833333333" stroke-linejoin="round"/>', '<path class="dot" d="M 8.519583833333332,9.140270833333332 L 8.519583833333332,9.140270833333332 C 8.229583833333331,8.850270833333333 7.7800838333333315,8.850270833333333 7.4900838333333315,9.140270833333332 L 7.113083833333332,9.517270833333333 C 6.823083833333332,9.807270833333334 6.823083833333332,10.256770833333333 7.113083833333332,10.546770833333333 L 7.5045838333333315,10.938270833333332 C 7.7945838333333315,11.228270833333333 8.244083833333331,11.228270833333333 8.534083833333332,10.938270833333332 L 8.911083833333333,10.546770833333333 C 9.201083833333332,10.256770833333333 9.201083833333332,9.807270833333334 8.911083833333333,9.517270833333333 L 8.519583833333332,9.140270833333332" stroke-linejoin="round"/>', '<path class="dot" d="M 7.519583333333333,13.140270833333332 L 7.519583333333332,13.140270833333332 C 7.229583333333332,12.850270833333333 6.780083333333333,12.850270833333333 6.490083333333333,13.140270833333332 L 6.113083333333333,13.517270833333333 C 5.823083333333333,13.807270833333334 5.823083333333333,14.256770833333333 6.113083333333333,14.546770833333333 L 6.504583333333333,14.938270833333332 C 6.794583333333333,15.228270833333333 7.244083333333332,15.228270833333333 7.534083333333332,14.938270833333332 L 7.911083333333333,14.546770833333333 C 8.201083333333333,14.256770833333333 8.201083333333333,13.807270833333334 7.911083333333333,13.517270833333333 L 7.519583333333333,13.140270833333332" stroke-linejoin="round"/>', '<path class="dot" d="M 6.519583333333333,14.140270833333332 L 6.519583333333332,14.140270833333332 C 6.229583333333332,13.850270833333333 5.780083333333333,13.850270833333333 5.490083333333333,14.140270833333332 L 5.113083333333333,14.517270833333333 C 4.823083333333333,14.807270833333334 4.823083333333333,15.256770833333333 5.113083333333333,15.546770833333333 L 5.504583333333333,15.938270833333332 C 5.794583333333333,16.228270833333333 6.244083333333332,16.228270833333333 6.534083333333332,15.938270833333332 L 6.911083333333333,15.546770833333333 C 7.201083333333333,15.256770833333333 7.201083333333333,14.807270833333334 6.911083333333333,14.517270833333333 L 6.519583333333333,14.140270833333332" stroke-linejoin="round"/>', '<path class="dot" d="M 4.519583333333333,14.140270833333332 L 4.519583333333333,14.140270833333332 C 4.229583333333333,13.850270833333333 3.7800833333333332,13.850270833333333 3.490083333333333,14.140270833333332 L 3.113083333333333,14.517270833333333 C 2.823083333333333,14.807270833333334 2.823083333333333,15.256770833333333 3.113083333333333,15.546770833333333 L 3.504583333333333,15.938270833333332 C 3.7945833333333328,16.228270833333333 4.244083333333333,16.228270833333333 4.534083333333333,15.938270833333332 L 4.911083333333334,15.546770833333333 C 5.201083333333333,15.256770833333333 5.201083333333333,14.807270833333334 4.911083333333334,14.517270833333333 L 4.519583333333333,14.140270833333332" stroke-linejoin="round"/>', '<path class="dot" d="M 3.5195833333333333,13.140270833333332 L 3.5195833333333333,13.140270833333332 C 3.2295833333333333,12.850270833333333 2.7800833333333332,12.850270833333333 2.490083333333333,13.140270833333332 L 2.113083333333333,13.517270833333333 C 1.8230833333333332,13.807270833333334 1.8230833333333332,14.256770833333333 2.113083333333333,14.546770833333333 L 2.504583333333333,14.938270833333332 C 2.7945833333333328,15.228270833333333 3.244083333333333,15.228270833333333 3.5340833333333332,14.938270833333332 L 3.9110833333333335,14.546770833333333 C 4.201083333333333,14.256770833333333 4.201083333333333,13.807270833333334 3.9110833333333335,13.517270833333333 L 3.5195833333333333,13.140270833333332" stroke-linejoin="round"/>', '<path class="dot" d="M 2.5195833333333333,9.140270833333332 L 2.5195833333333333,9.140270833333332 C 2.2295833333333333,8.850270833333333 1.7800833333333332,8.850270833333333 1.4900833333333332,9.140270833333332 L 1.1130833333333332,9.517270833333333 C 0.8230833333333332,9.807270833333334 0.8230833333333331,10.256770833333333 1.1130833333333332,10.546770833333333 L 1.5045833333333332,10.938270833333332 C 1.794583333333333,11.228270833333333 2.244083333333333,11.228270833333333 2.5340833333333332,10.938270833333332 L 2.9110833333333335,10.546770833333333 C 3.2010833333333335,10.256770833333333 3.2010833333333335,9.807270833333334 2.9110833333333335,9.517270833333333 L 2.5195833333333333,9.140270833333332" stroke-linejoin="round"/>', '<path class="dot" d="M 2.5195833333333333,5.140270833333333 L 2.5195833333333333,5.140270833333333 C 2.2295833333333333,4.850270833333333 1.7800833333333332,4.850270833333333 1.4900833333333332,5.140270833333333 L 1.1130833333333332,5.517270833333333 C 0.8230833333333332,5.807270833333333 0.8230833333333331,6.2567708333333325 1.1130833333333332,6.546770833333333 L 1.5045833333333332,6.938270833333332 C 1.794583333333333,7.228270833333333 2.244083333333333,7.228270833333333 2.5340833333333332,6.938270833333332 L 2.9110833333333335,6.546770833333333 C 3.2010833333333335,6.2567708333333325 3.2010833333333335,5.807270833333333 2.9110833333333335,5.517270833333333 L 2.5195833333333333,5.140270833333333" stroke-linejoin="round"/>', '<path class="dot" d="M 3.5195833333333333,1.1402708333333331 L 3.5195833333333333,1.1402708333333331 C 3.2295833333333333,0.8502708333333331 2.7800833333333332,0.850270833333333 2.490083333333333,1.1402708333333331 L 2.113083333333333,1.5172708333333333 C 1.8230833333333332,1.8072708333333332 1.8230833333333332,2.2567708333333334 2.113083333333333,2.5467708333333334 L 2.504583333333333,2.938270833333333 C 2.7945833333333328,3.228270833333333 3.244083333333333,3.228270833333333 3.5340833333333332,2.938270833333333 L 3.9110833333333335,2.5467708333333334 C 4.201083333333333,2.2567708333333334 4.201083333333333,1.8072708333333334 3.9110833333333335,1.5172708333333331 L 3.5195833333333333,1.1402708333333331" stroke-linejoin="round"/>', '<path class="dot" d="M 4.519583333333333,0.1402708333333331 L 4.519583333333333,0.1402708333333331 C 4.229583333333333,-0.14972916666666694 3.7800833333333332,-0.149729166666667 3.490083333333333,0.1402708333333331 L 3.113083333333333,0.5172708333333332 C 2.823083333333333,0.8072708333333332 2.823083333333333,1.2567708333333332 3.113083333333333,1.5467708333333332 L 3.504583333333333,1.938270833333333 C 3.7945833333333328,2.228270833333333 4.244083333333333,2.228270833333333 4.534083333333333,1.938270833333333 L 4.911083333333334,1.5467708333333332 C 5.201083333333333,1.2567708333333332 5.201083333333333,0.8072708333333333 4.911083333333334,0.5172708333333331 L 4.519583333333333,0.14027083333333312" stroke-linejoin="round"/>']
            
            
            <path d="M 7.0,-1.0000003576278693 L 5.0,-3.0000003152557393 L 3.0,-1.0000003576278693" fill="none"
            stroke="black"
            stroke-width="1.5"
            stroke-linecap="round"
            stroke-linejoin="round"
            />
            
            <path d="M 4.0,1.0 L 6.0,1.0 L 7.0,2.0 L 8.0,6.0 L 8.000000499999999,10.0 L 7.0,14.0 L 6.0,15.0 L 4.0,15.0 L 3.0,14.0 L 2.0,10.0 L 2.0,6.0 L 3.0,2.0 L 4.0,1.0" fill="none"
            stroke="black"
            stroke-width="1.5"
            stroke-linecap="round"
            stroke-linejoin="round"
            />
            
            
        </svg>