<?xml version="1.0" encoding="UTF-8" standalone="no"?>
<svg
   data-dec="102"
   width="4"
   height="4"
   version="1.1"
   id="svg4"
   sodipodi:docname="fut-queue-2.svg"
   inkscape:version="1.3.2 (091e20ef0f, 2023-11-25, custom)"
   xmlns:inkscape="http://www.inkscape.org/namespaces/inkscape"
   xmlns:sodipodi="http://sodipodi.sourceforge.net/DTD/sodipodi-0.dtd"
   xmlns="http://www.w3.org/2000/svg"
   xmlns:svg="http://www.w3.org/2000/svg"
   xmlns:rdf="http://www.w3.org/1999/02/22-rdf-syntax-ns#"
   xmlns:cc="http://creativecommons.org/ns#"
   xmlns:dc="http://purl.org/dc/elements/1.1/">
  <metadata
     id="metadata10">
    <rdf:RDF>
      <cc:Work
         rdf:about="">
        <dc:format>image/svg+xml</dc:format>
        <dc:type
           rdf:resource="http://purl.org/dc/dcmitype/StillImage" />
      </cc:Work>
    </rdf:RDF>
  </metadata>
  <defs
     id="defs8" />
  <sodipodi:namedview
     pagecolor="#ffffff"
     bordercolor="#666666"
     borderopacity="1"
     objecttolerance="10"
     gridtolerance="10"
     guidetolerance="10"
     inkscape:pageopacity="0"
     inkscape:pageshadow="2"
     inkscape:window-width="1706"
     inkscape:window-height="1221"
     id="namedview6"
     showgrid="true"
     inkscape:zoom="66.75088"
     inkscape:cx="1.573013"
     inkscape:cy="4.344512"
     inkscape:window-x="26"
     inkscape:window-y="23"
     inkscape:window-maximized="0"
     inkscape:current-layer="svg4"
     showguides="true"
     inkscape:guide-bbox="true"
     inkscape:showpageshadow="2"
     inkscape:pagecheckerboard="0"
     inkscape:deskcolor="#d1d1d1">
    <inkscape:grid
       type="xygrid"
       id="grid817"
       originx="0"
       originy="-1"
       spacingy="1"
       spacingx="1"
       units="px"
       visible="true" />
    <sodipodi:guide
       position="0,8"
       orientation="0,1"
       id="guide3685"
       inkscape:locked="false" />
    <sodipodi:guide
       position="0,12"
       orientation="0,1"
       id="guide3687"
       inkscape:locked="false" />
    <sodipodi:guide
       position="1,26"
       orientation="0,1"
       id="guide3689"
       inkscape:locked="false" />
    <sodipodi:guide
       position="-1,22"
       orientation="0,1"
       id="guide3691"
       inkscape:locked="false" />
  </sodipodi:namedview>
  <path
     style="fill:none;stroke:none;stroke-width:0.714286px;stroke-linecap:butt;stroke-linejoin:miter;stroke-opacity:1"
     d="M 0,4 H 2 L 4,2 V 0"
     id="path874"
     inkscape:connector-curvature="0"
     sodipodi:nodetypes="cccc" />
</svg>
