<?xml version="1.0" encoding="UTF-8" standalone="no"?>
<svg
   data-dec="63"
   width="9.9999971"
   height="14"
   version="1.1"
   id="svg1"
   xmlns="http://www.w3.org/2000/svg"
   xmlns:svg="http://www.w3.org/2000/svg">
  <defs
     id="defs1" />
  <path
     d="M 0,5 V 4 l 0.999999,-2 1,-1 2,-1 h 2 l 2,1 1,1 0.999998,2 v 2 l -0.999998,2 -1,1 -3.0000003,2 v 3"
     style="fill:none;stroke:none;stroke-width:2;stroke-linecap:round;stroke-linejoin:round"
     id="path1" />
</svg>
