<?xml version="1.0"?><!DOCTYPE svg PUBLIC "-//W3C//DTD SVG 1.1//EN" "http://www.w3.org/Graphics/SVG/1.1/DTD/svg11.dtd"><svg xmlns="http://www.w3.org/2000/svg" xmlns:xlink="http://www.w3.org/1999/xlink" width="350" height="1000" viewBox="0 0 10 26" >
            
                ['<path class="dot" d="M 2.5195833333333333,0.140269798412735 L 2.5195833333333333,0.140269798412735 C 2.2295833333333333,-0.14973020158726505 1.7800833333333332,-0.1497302015872651 1.4900833333333332,0.140269798412735 L 1.1130833333333332,0.5172697984127351 C 0.8230833333333332,0.807269798412735 0.8230833333333331,1.256769798412735 1.1130833333333332,1.546769798412735 L 1.5045833333333332,1.9382697984127348 C 1.794583333333333,2.228269798412735 2.244083333333333,2.228269798412735 2.5340833333333332,1.9382697984127348 L 2.9110833333333335,1.546769798412735 C 3.2010833333333335,1.256769798412735 3.2010833333333335,0.8072697984127352 2.9110833333333335,0.517269798412735 L 2.5195833333333333,0.14026979841273501" stroke-linejoin="round"/>', '<path class="dot" d="M 8.519583333333333,0.140269798412735 L 8.519583333333333,0.140269798412735 C 8.229583333333332,-0.14973020158726505 7.780083333333333,-0.1497302015872651 7.490083333333333,0.140269798412735 L 7.113083333333333,0.5172697984127351 C 6.823083333333333,0.807269798412735 6.823083333333333,1.256769798412735 7.113083333333333,1.546769798412735 L 7.504583333333333,1.9382697984127348 C 7.794583333333333,2.228269798412735 8.244083333333332,2.228269798412735 8.534083333333333,1.9382697984127348 L 8.911083333333334,1.546769798412735 C 9.201083333333333,1.256769798412735 9.201083333333333,0.8072697984127352 8.911083333333334,0.517269798412735 L 8.519583333333333,0.14026979841273501" stroke-linejoin="round"/>', '<path class="dot" d="M 4.519583433333333,14.140270815873032 L 4.519583433333333,14.140270815873032 C 4.229583433333333,13.850270815873033 3.7800834333333326,13.850270815873033 3.4900834333333326,14.140270815873032 L 3.1130834333333324,14.517270815873033 C 2.8230834333333323,14.807270815873032 2.8230834333333323,15.256770815873033 3.1130834333333324,15.546770815873034 L 3.5045834333333326,15.938270815873032 C 3.794583433333332,16.22827081587303 4.244083433333333,16.22827081587303 4.534083433333333,15.938270815873032 L 4.911083433333333,15.546770815873034 C 5.2010834333333325,15.256770815873033 5.2010834333333325,14.807270815873034 4.911083433333333,14.517270815873033 L 4.519583433333333,14.140270815873032" stroke-linejoin="round"/>']
            
            
            <path d="M 2.0,0.9999989650794019 L 8.0,0.9999989650794019 L 4.000000099999999,14.9999999825397" fill="none"
            stroke="black"
            stroke-width="1.5"
            stroke-linecap="round"
            stroke-linejoin="round"
            />
            
            
        </svg>