<?xml version="1.0"?><!DOCTYPE svg PUBLIC "-//W3C//DTD SVG 1.1//EN" "http://www.w3.org/Graphics/SVG/1.1/DTD/svg11.dtd"><svg xmlns="http://www.w3.org/2000/svg" xmlns:xlink="http://www.w3.org/1999/xlink" width="350" height="1000" viewBox="0 0 10 26" >
            
                ['<path class="dot" d="M 5.519583333333333,14.140270833333332 L 5.519583333333333,14.140270833333332 C 5.229583333333333,13.850270833333333 4.780083333333333,13.850270833333333 4.490083333333333,14.140270833333332 L 4.113083333333333,14.517270833333333 C 3.823083333333333,14.807270833333334 3.823083333333333,15.256770833333333 4.113083333333333,15.546770833333333 L 4.504583333333333,15.938270833333332 C 4.794583333333333,16.228270833333333 5.244083333333333,16.228270833333333 5.534083333333333,15.938270833333332 L 5.911083333333334,15.546770833333333 C 6.201083333333333,15.256770833333333 6.201083333333333,14.807270833333334 5.911083333333334,14.517270833333333 L 5.519583333333333,14.140270833333332" stroke-linejoin="round"/>', '<path class="dot" d="M 5.519583333333333,0.1402708333333331 L 5.519583333333333,0.1402708333333331 C 5.229583333333333,-0.14972916666666694 4.780083333333333,-0.149729166666667 4.490083333333333,0.1402708333333331 L 4.113083333333333,0.5172708333333332 C 3.823083333333333,0.8072708333333332 3.823083333333333,1.2567708333333332 4.113083333333333,1.5467708333333332 L 4.504583333333333,1.938270833333333 C 4.794583333333333,2.228270833333333 5.244083333333333,2.228270833333333 5.534083333333333,1.938270833333333 L 5.911083333333334,1.5467708333333332 C 6.201083333333333,1.2567708333333332 6.201083333333333,0.8072708333333333 5.911083333333334,0.5172708333333331 L 5.519583333333333,0.14027083333333312" stroke-linejoin="round"/>']
            
                ['<path class="dot" d="M 3.5195833333333333,14.140270833333332 L 3.5195833333333333,14.140270833333332 C 3.2295833333333333,13.850270833333333 2.7800833333333332,13.850270833333333 2.490083333333333,14.140270833333332 L 2.113083333333333,14.517270833333333 C 1.8230833333333332,14.807270833333334 1.8230833333333332,15.256770833333333 2.113083333333333,15.546770833333333 L 2.504583333333333,15.938270833333332 C 2.7945833333333328,16.228270833333333 3.244083333333333,16.228270833333333 3.5340833333333332,15.938270833333332 L 3.9110833333333335,15.546770833333333 C 4.201083333333333,15.256770833333333 4.201083333333333,14.807270833333334 3.9110833333333335,14.517270833333333 L 3.5195833333333333,14.140270833333332" stroke-linejoin="round"/>', '<path class="dot" d="M 7.519583333333333,14.140270833333332 L 7.519583333333332,14.140270833333332 C 7.229583333333332,13.850270833333333 6.780083333333333,13.850270833333333 6.490083333333333,14.140270833333332 L 6.113083333333333,14.517270833333333 C 5.823083333333333,14.807270833333334 5.823083333333333,15.256770833333333 6.113083333333333,15.546770833333333 L 6.504583333333333,15.938270833333332 C 6.794583333333333,16.228270833333333 7.244083333333332,16.228270833333333 7.534083333333332,15.938270833333332 L 7.911083333333333,15.546770833333333 C 8.201083333333333,15.256770833333333 8.201083333333333,14.807270833333334 7.911083333333333,14.517270833333333 L 7.519583333333333,14.140270833333332" stroke-linejoin="round"/>']
            
                ['<path class="dot" d="M 3.5195833333333333,0.1402708333333331 L 3.5195833333333333,0.1402708333333331 C 3.2295833333333333,-0.14972916666666694 2.7800833333333332,-0.149729166666667 2.490083333333333,0.1402708333333331 L 2.113083333333333,0.5172708333333332 C 1.8230833333333332,0.8072708333333332 1.8230833333333332,1.2567708333333332 2.113083333333333,1.5467708333333332 L 2.504583333333333,1.938270833333333 C 2.7945833333333328,2.228270833333333 3.244083333333333,2.228270833333333 3.5340833333333332,1.938270833333333 L 3.9110833333333335,1.5467708333333332 C 4.201083333333333,1.2567708333333332 4.201083333333333,0.8072708333333333 3.9110833333333335,0.5172708333333331 L 3.5195833333333333,0.14027083333333312" stroke-linejoin="round"/>', '<path class="dot" d="M 7.519583333333333,0.1402708333333331 L 7.519583333333332,0.1402708333333331 C 7.229583333333332,-0.14972916666666694 6.780083333333333,-0.149729166666667 6.490083333333333,0.1402708333333331 L 6.113083333333333,0.5172708333333332 C 5.823083333333333,0.8072708333333332 5.823083333333333,1.2567708333333332 6.113083333333333,1.5467708333333332 L 6.504583333333333,1.938270833333333 C 6.794583333333333,2.228270833333333 7.244083333333332,2.228270833333333 7.534083333333332,1.938270833333333 L 7.911083333333333,1.5467708333333332 C 8.201083333333333,1.2567708333333332 8.201083333333333,0.8072708333333333 7.911083333333333,0.5172708333333331 L 7.519583333333333,0.14027083333333312" stroke-linejoin="round"/>']
            
                ['<path class="dot" d="M 4.519583333333333,-2.8597291666666673 L 4.519583333333333,-2.8597291666666673 C 4.229583333333333,-3.1497291666666674 3.7800833333333332,-3.1497291666666674 3.490083333333333,-2.8597291666666673 L 3.113083333333333,-2.482729166666667 C 2.823083333333333,-2.192729166666667 2.823083333333333,-1.743229166666667 3.113083333333333,-1.453229166666667 L 3.504583333333333,-1.0617291666666673 C 3.7945833333333328,-0.7717291666666672 4.244083333333333,-0.7717291666666672 4.534083333333333,-1.0617291666666673 L 4.911083333333334,-1.453229166666667 C 5.201083333333333,-1.743229166666667 5.201083333333333,-2.192729166666667 4.911083333333334,-2.482729166666667 L 4.519583333333333,-2.859729166666667" stroke-linejoin="round"/>', '<path class="dot" d="M 3.5195833333333333,-1.859729166666667 L 3.5195833333333333,-1.859729166666667 C 3.2295833333333333,-2.1497291666666674 2.7800833333333332,-2.1497291666666674 2.490083333333333,-1.859729166666667 L 2.113083333333333,-1.482729166666667 C 1.8230833333333332,-1.192729166666667 1.8230833333333332,-0.743229166666667 2.113083333333333,-0.453229166666667 L 2.504583333333333,-0.06172916666666728 C 2.7945833333333328,0.22827083333333276 3.244083333333333,0.22827083333333276 3.5340833333333332,-0.06172916666666728 L 3.9110833333333335,-0.453229166666667 C 4.201083333333333,-0.743229166666667 4.201083333333333,-1.192729166666667 3.9110833333333335,-1.482729166666667 L 3.5195833333333333,-1.859729166666667" stroke-linejoin="round"/>', '<path class="dot" d="M 2.5195833333333333,-2.859729366666667 L 2.5195833333333333,-2.859729366666667 C 2.2295833333333333,-3.149729366666667 1.7800833333333332,-3.149729366666667 1.4900833333333332,-2.859729366666667 L 1.1130833333333332,-2.4827293666666668 C 0.8230833333333332,-2.1927293666666667 0.8230833333333331,-1.7432293666666667 1.1130833333333332,-1.4532293666666667 L 1.5045833333333332,-1.061729366666667 C 1.794583333333333,-0.7717293666666669 2.244083333333333,-0.7717293666666669 2.5340833333333332,-1.061729366666667 L 2.9110833333333335,-1.4532293666666667 C 3.2010833333333335,-1.7432293666666667 3.2010833333333335,-2.1927293666666667 2.9110833333333335,-2.4827293666666668 L 2.5195833333333333,-2.8597293666666666" stroke-linejoin="round"/>', '<path class="dot" d="M 3.5195833333333333,-3.8597291666666673 L 3.5195833333333333,-3.8597291666666673 C 3.2295833333333333,-4.149729166666667 2.7800833333333332,-4.149729166666667 2.490083333333333,-3.8597291666666673 L 2.113083333333333,-3.482729166666667 C 1.8230833333333332,-3.192729166666667 1.8230833333333332,-2.743229166666667 2.113083333333333,-2.453229166666667 L 2.504583333333333,-2.0617291666666673 C 2.7945833333333328,-1.7717291666666672 3.244083333333333,-1.7717291666666672 3.5340833333333332,-2.0617291666666673 L 3.9110833333333335,-2.453229166666667 C 4.201083333333333,-2.743229166666667 4.201083333333333,-3.192729166666667 3.9110833333333335,-3.482729166666667 L 3.5195833333333333,-3.859729166666667" stroke-linejoin="round"/>', '<path class="dot" d="M 8.519583333333333,-2.8597291666666673 L 8.519583333333333,-2.8597291666666673 C 8.229583333333332,-3.1497291666666674 7.780083333333333,-3.1497291666666674 7.490083333333333,-2.8597291666666673 L 7.113083333333333,-2.482729166666667 C 6.823083333333333,-2.192729166666667 6.823083333333333,-1.743229166666667 7.113083333333333,-1.453229166666667 L 7.504583333333333,-1.0617291666666673 C 7.794583333333333,-0.7717291666666672 8.244083333333332,-0.7717291666666672 8.534083333333333,-1.0617291666666673 L 8.911083333333334,-1.453229166666667 C 9.201083333333333,-1.743229166666667 9.201083333333333,-2.192729166666667 8.911083333333334,-2.482729166666667 L 8.519583333333333,-2.859729166666667" stroke-linejoin="round"/>', '<path class="dot" d="M 7.519583333333333,-1.859729166666667 L 7.519583333333332,-1.859729166666667 C 7.229583333333332,-2.1497291666666674 6.780083333333333,-2.1497291666666674 6.490083333333333,-1.859729166666667 L 6.113083333333333,-1.482729166666667 C 5.823083333333333,-1.192729166666667 5.823083333333333,-0.743229166666667 6.113083333333333,-0.453229166666667 L 6.504583333333333,-0.06172916666666728 C 6.794583333333333,0.22827083333333276 7.244083333333332,0.22827083333333276 7.534083333333332,-0.06172916666666728 L 7.911083333333333,-0.453229166666667 C 8.201083333333333,-0.743229166666667 8.201083333333333,-1.192729166666667 7.911083333333333,-1.482729166666667 L 7.519583333333333,-1.859729166666667" stroke-linejoin="round"/>', '<path class="dot" d="M 6.519583333333333,-2.8597291666666673 L 6.519583333333332,-2.8597291666666673 C 6.229583333333332,-3.1497291666666674 5.780083333333333,-3.1497291666666674 5.490083333333333,-2.8597291666666673 L 5.113083333333333,-2.482729166666667 C 4.823083333333333,-2.192729166666667 4.823083333333333,-1.743229166666667 5.113083333333333,-1.453229166666667 L 5.504583333333333,-1.0617291666666673 C 5.794583333333333,-0.7717291666666672 6.244083333333332,-0.7717291666666672 6.534083333333332,-1.0617291666666673 L 6.911083333333333,-1.453229166666667 C 7.201083333333333,-1.743229166666667 7.201083333333333,-2.192729166666667 6.911083333333333,-2.482729166666667 L 6.519583333333333,-2.859729166666667" stroke-linejoin="round"/>', '<path class="dot" d="M 7.519583333333333,-3.8597291666666673 L 7.519583333333332,-3.8597291666666673 C 7.229583333333332,-4.149729166666667 6.780083333333333,-4.149729166666667 6.490083333333333,-3.8597291666666673 L 6.113083333333333,-3.482729166666667 C 5.823083333333333,-3.192729166666667 5.823083333333333,-2.743229166666667 6.113083333333333,-2.453229166666667 L 6.504583333333333,-2.0617291666666673 C 6.794583333333333,-1.7717291666666672 7.244083333333332,-1.7717291666666672 7.534083333333332,-2.0617291666666673 L 7.911083333333333,-2.453229166666667 C 8.201083333333333,-2.743229166666667 8.201083333333333,-3.192729166666667 7.911083333333333,-3.482729166666667 L 7.519583333333333,-3.859729166666667" stroke-linejoin="round"/>', '<path class="dot" d="M 8.519583333333333,-2.8597291666666673 L 8.519583333333333,-2.8597291666666673 C 8.229583333333332,-3.1497291666666674 7.780083333333333,-3.1497291666666674 7.490083333333333,-2.8597291666666673 L 7.113083333333333,-2.482729166666667 C 6.823083333333333,-2.192729166666667 6.823083333333333,-1.743229166666667 7.113083333333333,-1.453229166666667 L 7.504583333333333,-1.0617291666666673 C 7.794583333333333,-0.7717291666666672 8.244083333333332,-0.7717291666666672 8.534083333333333,-1.0617291666666673 L 8.911083333333334,-1.453229166666667 C 9.201083333333333,-1.743229166666667 9.201083333333333,-2.192729166666667 8.911083333333334,-2.482729166666667 L 8.519583333333333,-2.859729166666667" stroke-linejoin="round"/>']
            
            
            <path d="M 5.0,15.0 L 5.0,1.0" fill="none"
            stroke="black"
            stroke-width="1.5"
            stroke-linecap="round"
            stroke-linejoin="round"
            />
            
            <path d="M 3.0,15.0 L 7.0,15.0" fill="none"
            stroke="black"
            stroke-width="1.5"
            stroke-linecap="round"
            stroke-linejoin="round"
            />
            
            <path d="M 3.0,1.0 L 7.0,1.0" fill="none"
            stroke="black"
            stroke-width="1.5"
            stroke-linecap="round"
            stroke-linejoin="round"
            />
            
            <path d="M 4.0,-2.0 L 3.0,-1.0 L 2.0,-2.0000002 L 3.0,-3.0 L 4.0,-2.0 M 8.0,-2.0 L 7.0,-1.0 L 6.0,-2.0 L 7.0,-3.0 L 8.0,-2.0" fill="none"
            stroke="black"
            stroke-width="1.5"
            stroke-linecap="round"
            stroke-linejoin="round"
            />
            
            
        </svg>