SplineFontDB: 3.0
FontName: Untitled1
FullName: Untitled1
FamilyName: Untitled1
Weight: Medium
Copyright: Created by Gelgon,,, with FontForge 2.0 (http://fontforge.sf.net)
UComments: "2015-3-11: Created." 
Version: 001.000
ItalicAngle: 0
UnderlinePosition: -100
UnderlineWidth: 50
Ascent: 800
Descent: 200
LayerCount: 2
Layer: 0 0 "Arri+AOgA-re"  1
Layer: 1 0 "Avant"  0
XUID: [1021 848 686947482 8446260]
OS2Version: 0
OS2_WeightWidthSlopeOnly: 0
OS2_UseTypoMetrics: 1
CreationTime: 1426077031
ModificationTime: 1427146863
OS2TypoAscent: 0
OS2TypoAOffset: 1
OS2TypoDescent: 0
OS2TypoDOffset: 1
OS2TypoLinegap: 0
OS2WinAscent: 0
OS2WinAOffset: 1
OS2WinDescent: 0
OS2WinDOffset: 1
HheadAscent: 0
HheadAOffset: 1
HheadDescent: 0
HheadDOffset: 1
OS2Vendor: 'PfEd'
DEI: 91125
Encoding: ISO8859-1
UnicodeInterp: none
NameList: Adobe Glyph List
DisplaySize: -48
AntiAlias: 1
FitToEm: 1
WinInfo: 25 25 10
Grid
-1000 498.5 m 0
 2000 498.5 l 0
  Named: "X" 
78.625 1300 m 0
 78.625 -700 l 0
EndSplineSet
BeginChars: 256 11

StartChar: a
Encoding: 97 97 0
Width: 1061
VWidth: 0
Flags: W
HStem: -10 49<132.666 258.784 670 792.47> -0.000976562 21G<398.125 416 980.125 998> 471 39<216.247 318.721>
VStem: 35 105<325 371.021> 37 116<54.9834 154.519> 330.999 15.334<76.7139 151.663> 338 8.33301<133.5 151.663> 357.751 58.249<0.000976562 25.1203> 584 138<57.3606 154.566> 864 134<70 272 304 458.683> 874 8<90.167 118>
LayerCount: 2
Back
SplineSet
1441 -0.000976562 m 1x50
 1405.25 0.00195312 1369.5 0 1333.75 0.000976562 c 1
 1307 70 l 17x60
 1307 380 l 2
 1307 416 1270.91 424.168 1234.99 404 c 0
 1178 372 1173 325 1173 325 c 9
 1025 311 l 1
 1025 331 1035.39 357.822 1064 393 c 1
 1109 446 1202 510 1301 510 c 0
 1372 510 1416 482 1434 430 c 0
 1438 416 1441 402 1441 387 c 2
 1441 -0.000976562 l 1x50
1325 118 m 1
 1325 38 1220 -10 1143 -10 c 0
 1083 -10 1027 32 1027 91 c 1
 1025 175 1115 228 1174 255 c 0
 1220 276 1284 299 1333 319 c 1
 1335 307 1341 240 1341 240 c 1
 1247 208 1172 190 1172 125 c 0
 1172 125 1171 88 1225 88 c 0xa0
 1309 88 1314 250 1314 250 c 1
 1325 118 l 1
3376.5 0 m 17
 3376.25 57 l 17
 3376.25 430 l 2
 3376.25 466 3340.25 474 3304.24 454 c 0
 3230.3 412.938 3242.25 325 3242.25 325 c 9
 3094.25 311 l 1
 3094.25 331 3104.64 357.822 3133.25 393 c 1
 3178.25 446 3271.25 510 3370.25 510 c 0
 3441.25 510 3485.25 482 3503.25 430 c 0
 3507.25 416 3510.25 402 3510.25 387 c 2
 3510.25 0 l 2
3394.25 118 m 1
 3394.25 43 3289.25 -10 3212.25 -10 c 0
 3152.25 -10 3096.25 32 3096.25 91 c 1
 3094.25 175 3187.25 213 3246.25 240 c 0
 3292.25 261 3356.25 284 3405.25 304 c 1
 3407.25 292 3406.25 272 3406.25 272 c 1
 3312.25 240 3234.25 229 3234.25 125 c 0
 3234.25 80.9883 3243.25 45 3297.25 45 c 0
 3332.25 45 3386.25 90.167 3386.25 139 c 1
 3394.25 118 l 1
2887.25 430 m 2
 2886.92 57 l 9
 2886.92 57 2884.92 0 2897.92 0 c 9
 3032.25 0.000976562 l 17
 3019.25 0 3021.25 57 3021.25 57 c 25
 3021.25 57 3021.25 46 3021.25 62 c 2
 3021.25 387 l 2
 3021.25 402 3018.25 416 3014.25 430 c 0
 2996.25 482 2952.25 510 2881.25 510 c 0
 2782.25 510 2689.25 446 2644.25 393 c 1
 2615.64 357.822 2605.25 331 2605.25 311 c 1
 2753.25 325 l 17
 2753.25 325 2741.3 412.938 2815.24 454 c 0
 2851.25 474 2887.25 466 2887.25 430 c 2
2905.25 118 m 1
 2897.25 139 l 1
 2897.25 90.167 2843.25 45 2808.25 45 c 0
 2754.25 45 2745.25 80.9883 2745.25 125 c 0
 2745.25 229 2823.25 240 2917.25 272 c 1
 2917.25 272 2918.25 292 2916.25 304 c 1
 2867.25 284 2803.25 261 2757.25 240 c 0
 2698.25 213 2605.25 175 2607.25 91 c 1
 2607.25 32 2663.25 -10 2723.25 -10 c 0
 2800.25 -10 2905.25 43 2905.25 118 c 1
2081 311 m 1
 2221 325 l 17
2363 414 m 1
 2363 70 l 2
 2363 17 2402 -10 2461 -10 c 0
 2501 -10 2545 19 2561 40 c 1
 2554 45 l 1
 2540 35 2528 31 2520 33 c 0
 2506 37 2497 46 2497 62 c 2
 2497 387 l 2
 2497 402 2494 416 2490 430 c 0
 2472 482 2428 510 2357 510 c 0
 2258 510 2165 446 2120 393 c 1
 2091.39 357.822 2081 331 2081 311 c 1
 2221 325 l 17
 2221 325 2210.05 411.938 2283.99 453 c 0
 2320 473 2363 450 2363 414 c 1
2381 118 m 1
 2373 139 l 1
 2373 90.167 2319 45 2284 45 c 0
 2230 45 2221 80.9883 2221 125 c 0
 2221 229 2299 240 2393 272 c 1
 2393 272 2394 292 2392 304 c 1
 2343 284 2279 261 2233 240 c 0
 2174 213 2081 175 2083 91 c 1
 2083 32 2139 -10 2199 -10 c 0
 2276 -10 2381 43 2381 118 c 1
1524 311 m 1
1940 1 m 2
 1940 387 l 2
 1940 402 1937 416 1933 430 c 0
 1915 482 1871 510 1800 510 c 0
 1701 510 1608 446 1563 393 c 1
 1534.39 357.822 1524 331 1524 311 c 1
 1664 325 l 17
 1664 325 1644.49 452.6 1724.5 480 c 0
 1797.5 505 1806 444 1806 408 c 1
 1799 0 l 2
 1874 0 l 0
1824 118 m 1
 1816 139 l 1
 1816 90.167 1762 45 1727 45 c 0
 1673 45 1664 80.9883 1664 125 c 0
 1664 229 1742 240 1836 272 c 1
 1836 272 1837 292 1835 304 c 1
 1786 284 1722 261 1676 240 c 0
 1617 213 1524 175 1526 91 c 1
 1526 32 1582 -10 1642 -10 c 0
 1719 -10 1824 43 1824 118 c 1
310 118 m 5xd4
 310 43 205 -10 128 -10 c 4
 68 -10 12 32 12 91 c 5
 10 175 103 213 162 240 c 4
 208 261 272 284 321 304 c 5
 323 292 324 286 325 285 c 5
 231 253 146 236 150 125 c 4
 151 81 159 35 213 35 c 4
 248 35 302 80.1666 302 129 c 5
 310 118 l 5xd4
159 363 m 5xe8
 159 302 132 252 75 253 c 4
 40 253 9 277 10 311 c 4
 10 334 23 361 49 393 c 4
 94 446 187 510 286 510 c 4
 357 510 401 482 419 430 c 4
 423 416 426 402 426 387 c 6
 426 62 l 6
 426 46 435 37 449 33 c 4
 457 31 469 35 483 45 c 5
 490 40 l 5
 474 19 430 -10 390 -10 c 4
 331 -10 292 17 292 70 c 6
 292 430 l 6
 292 463 287 488 253 489 c 5
 198 489 158 465 158 410 c 5
 159 363 l 5xe8
EndSplineSet
Fore
SplineSet
998 -0.000976562 m 1x61c0
 962.25 0.00195312 926.5 0 890.751 0.000976562 c 1
 863.999 70 l 17
 864 430 l 2
 864 466 828 474 791.988 454 c 0
 718.055 412.939 730 325 730 325 c 9
 582 311 l 1
 582 331 592.39 357.822 621 393 c 1
 666 446 759 510 858 510 c 0
 929 510 973 482 991 430 c 0
 995 416 998 402 998 387 c 2
 998 -0.000976562 l 1x61c0
882 118 m 1xa1a0
 882 43 777 -10 700 -10 c 0
 640 -10 584 32 584 91 c 1
 582 175 675 213 734 240 c 0
 780 261 844 284 893 304 c 1
 895 292 894 272 894 272 c 1
 800 240 722 229 722 125 c 0
 722 80.9883 731 45 785 45 c 0
 820 45 874 90.167 874 139 c 1
 882 118 l 1xa1a0
35 311 m 1x7580
 35 382.5 160.5 512.5 276 510 c 0
 346.983 508.464 391 482 409 430 c 0
 413 416 416 402 416 387 c 2
 416 -0.000976562 l 1
 380.25 0.00195312 393.5 0 357.751 0.000976562 c 1
 330.999 96 l 17
 331 386.5 l 1
 331 435.5 327.463 470.81 272.5 471 c 1
 194.5 471 140 366 140 325 c 9
 35 311 l 1x7580
346.333 151.663 m 1
 346.333 76.7139 290.666 -10 162.666 -10 c 1
 102.666 -10 37 32 37 91 c 1
 35 175 129.225 212.47 187 242 c 0
 232 265 308 301 357 321 c 1
 359 309 358 284 358 284 c 1
 358 284 153 222 153 113 c 5
 153 62 179 39 227 39 c 1
 285.333 39 346 133.5 338 176 c 1xab80
 346.333 151.663 l 1
EndSplineSet
EndChar

StartChar: n
Encoding: 110 110 1
Width: 1184
VWidth: 0
Flags: W
HStem: 0.000976562 21G<77.6451 163.5 386.5 470.5 689.98 824 999 1133>
VStem: 77.625 85.875<0.000976562 358.001 407.001 424.001> 386.5 84<0.000976562 418.318> 690 134<0.000976562 353.001> 805 19<353.001 410.001> 999 134<0.000976562 399.917>
LayerCount: 2
Back
SplineSet
484.5 0 m 9xb0
 350.5 0 l 18
 350.5 266.844 l 1
 350.5 527.344 131.432 285.87 156.5 281 c 1
 156.5 410 l 1
 398.5 597 484.5 492 484.5 365 c 2
 484.5 0 l 9xb0
42 498.501 m 2
 149.248 498.499 l 1
 175.5 424 l 17xb0
 175.5 0 l 9
 41.5 0 l 17xd0
 42 498.501 l 2
EndSplineSet
Fore
SplineSet
1133 0.000976562 m 9xec
 999 0.000976562 l 18
 999 295.001 l 1
 999.443 554.278 800.512 350.192 805 353.001 c 1
 805 410.001 l 1
 1047 597.001 1133 492.001 1133 365.001 c 2
 1133 0.000976562 l 9xec
689.5 498.502 m 2
 797.748 498.5 l 1
 824 424.001 l 17xec
 824 0.000976562 l 9
 690 0.000976562 l 17xf4
 689.5 498.502 l 2
470.5 0.000976562 m 13
 386.5 0.000976562 l 22
 386.5 314.001 l 5
 386.5 411.976 365.312 521.977 151.5 358.001 c 5
 142.5 407.001 l 5
 409.5 599.5 469.5 498.5 470.5 334 c 5
 470.5 334 469.53 112.466 470.5 0.000976562 c 13
78.125 498.501 m 6
 137.248 498.5 l 5
 163.5 424.001 l 21
 163.5 0.000976562 l 13
 77.625 0 l 21
 78.125 498.501 l 6
EndSplineSet
EndChar

StartChar: b
Encoding: 98 98 2
Width: 1252
VWidth: 0
Flags: W
HStem: -11 35<205.188 313.8 867.399 978.978> 446 65<218.276 300.395 877.583 963.657>
VStem: 130.957 30<71.25 135 261 429> 372.957 104.376<138.184 351.412> 794.376 30<71.25 135 261 429> 1035.38 145<154.974 353.115>
LayerCount: 2
Back
SplineSet
76.125 498.501 m 6
 135.248 498.5 l 5
 161.5 424.001 l 21
 161.5 0.000976562 l 13
 75.625 0 l 21
 76.125 498.501 l 6
EndSplineSet
Fore
SplineSet
824.376 71.25 m 17
 824.376 800 l 9
 687.376 800 l 18
 687.128 -0.00195312 l 1
 722.877 0.000976562 758.627 -0.000976562 794.376 0 c 1
 824.376 71.25 l 17
984.376 511 m 0
 832.376 511 795.376 429 795.376 261 c 1
 794.376 135 l 2
 793.376 47 845.376 -11 928.376 -11 c 0
 1080.38 -11 1180.38 119 1180.38 271 c 0
 1180.38 401 1112.38 511 984.376 511 c 0
824.376 255 m 0
 824.376 343 814.376 447 903.376 446 c 0
 997.376 444 1035.38 328 1035.38 230 c 0
 1035.38 89 999.376 24 926.376 24 c 0
 813.376 24 824.376 141 824.376 255 c 0
160.957 71.25 m 17
 160.957 800 l 9
 74 800 l 18
 73.752 -0.00195312 l 1
 109.501 0.000976562 95.208 -0.000976562 130.957 0 c 1
 160.957 71.25 l 17
304.333 515.9 m 0
 200.349 514.139 131.957 429 131.957 261 c 1
 130.957 135 l 2
 129.957 47 181.96 -10.4004 264.957 -11 c 0
 403.291 -12 477.333 119 477.333 271 c 0
 477.333 401 422.333 517.9 304.333 515.9 c 0
160.957 255 m 0
 160.957 343 150.957 447 239.957 446 c 0
 333.957 444 372.957 328 372.957 230 c 0
 372.957 89 327.291 24 262.957 24 c 0
 149.957 24 160.957 141 160.957 255 c 0
EndSplineSet
EndChar

StartChar: c
Encoding: 99 99 3
Width: 496
VWidth: 0
Flags: W
HStem: -11 94<220.161 357.056> 467 43<201.803 321.119>
LayerCount: 2
Back
SplineSet
329 368 m 1
 350 465 304 494 270 493 c 1
 88 493 112 90 336 90 c 0
 373 90 432 93 476 163 c 1
 486 162 l 1
 486 162 440 -10 269 -10 c 0
 121 -10 10 100 10 249 c 1
 11 397 125 510 272 510 c 0
 394 510 461 407 461 330 c 0
 461 268 423 254 393 254 c 0
 349 254 313 300 329 368 c 1
EndSplineSet
Fore
SplineSet
482.521 309.5 m 17
 469.057 407.845 387.796 510 267.5 510 c 0
 120.5 510 7.5 396 7.5 249 c 0
 7.5 100 118.5 -11 266.5 -11 c 1
 439.5 -11 483.5 158.917 483.5 162 c 1
 414 167 l 1
 414 167 370 83 292 83 c 1
 98 83 85.5 467 267.5 467 c 0
 336.257 467 346.659 407.906 348.225 324 c 9
 482.521 309.5 l 17
EndSplineSet
EndChar

StartChar: d
Encoding: 100 100 4
Width: 540
VWidth: 0
Flags: W
HStem: -10 51<229.315 308.131> -0.00195312 21G<485.373 503.267> 461 49<200.217 331.511>
VStem: 10 144<143.378 346.306> 366 138<70.198 800> 366 28<73 242 361 448>
LayerCount: 2
Fore
SplineSet
366 71.25 m 17x78
 366 800 l 9
 504 800 l 18
 503.248 -0.00195312 l 1
 467.499 0.000976562 431.749 -0.000976562 396 0 c 1
 366 71.25 l 17x78
436 108 m 0
205 -10 m 0xb4
 78 -10 10 101 10 232 c 0
 10 383 111 510 262 510 c 0
 346 510 397 448 395 361 c 1
 394 242 l 1
 394 73 358 -10 205 -10 c 0xb4
366 248 m 0xb8
 366 361 377 461 263 461 c 0
 191 461 154 413 154 273 c 0
 154 174 193 42 286 41 c 1
 376 39 366 159 366 248 c 0xb8
EndSplineSet
EndChar

StartChar: e
Encoding: 101 101 5
Width: 521
VWidth: 0
Flags: W
HStem: -11 94<-527.339 -390.444> 281 36<-623 -271> 467 43<-545.278 -427.597>
VStem: -740 341<281 387>
LayerCount: 2
Back
SplineSet
-547 249 m 0xf0
 -547 396 -434 510 -287 510 c 0
 -155 510 -70 386 -70 238 c 1xf0
 -206 238 l 1
 -206 319 -207 421 -287 421 c 0
 -469 421 -473.5 98 -279.5 98 c 1
 -175.5 98 -161.5 168 -161.5 168 c 1
 -79.5 160 l 1xe8
 -79.5 156.917 -115 -11 -288 -11 c 1
 -436 -11 -547 100 -547 249 c 0xf0
-70 238 m 1
 -430 238 l 1
 -443 317 l 1
 -78 317 l 1
 -70 238 l 1
478 311 m 1
 330 325 l 17
 330 325 354.57 466.669 270 466.669 c 0
 88 466.669 113.5 90 311 90 c 0
 311 90 390 95.833 411.999 167 c 1
 475 162 l 1
 475 162 436 -10 265 -10 c 0
 117 -10 10 100 10 249 c 1
 11 397 125.034 513.178 272 510 c 1
 358.5 510 478 440.994 478 311 c 1
EndSplineSet
Fore
SplineSet
10 249 m 4
 10 396 123 510 270 510 c 4
 402 510 487 387 487 281 c 5
 351 281 l 5
 351 387 350 467 270 467 c 4
 88 467 100.5 83 294.5 83 c 5
 372.5 83 416.5 167 416.5 167 c 5
 486 162 l 5
 486 158.917 442 -11 269 -11 c 5
 121 -11 10 100 10 249 c 4
487 281 m 5
 127 281 l 5
 114 317 l 5
 479 317 l 5
 487 281 l 5
EndSplineSet
EndChar

StartChar: space
Encoding: 32 32 6
Width: 320
VWidth: 0
Flags: W
LayerCount: 2
EndChar

StartChar: f
Encoding: 102 102 7
Width: 397
VWidth: 0
Flags: W
HStem: 0.00292969 21G<90.7858 223.842> 434 50.2998<40.3418 305.342> 726.5 81.5<213.415 248.09>
VStem: 90.8418 133<0.00292969 598.322>
LayerCount: 2
Back
SplineSet
-19 480 m 5
 -32 434 l 5
213 0.00292969 m 5
 213 441 l 5
 80 441 l 5
 80 0.00292969 l 5
 213 0.00292969 l 5
299 434 m 5
 24 434 l 5
 24 443 l 5
 105 555 130 807 258 807 c 4
 316 807 354 744 354 701 c 5
 353 662 328 637 297 637 c 4
 264 637 233 650 233 696 c 5
 233 726.667 253.667 776.661 219.347 776.661 c 5
 208.333 776.661 184.398 764.625 180 720 c 5
 180 628 216 542 216 480 c 5
 312 480 l 5
 299 434 l 5
EndSplineSet
Fore
SplineSet
318.342 484 m 17
 305.342 434 l 1
 30.3418 434 l 1
 40.3418 484.3 l 9
 318.342 484 l 17
89.4668 491 m 1
 89.4668 491 129.842 808 273.384 808 c 1
 273.384 808 322.842 807 351.342 754.5 c 0
 365.187 728.996 369.842 673 365.342 648.5 c 1
 243.842 658.5 l 17
 243.842 658.5 264.342 726.5 224.342 726.5 c 0
 206.342 726.5 197.342 698 197.342 666.5 c 5
 197.342 593.5 223.842 566 223.842 477 c 1
 223.842 0.00292969 l 1
 90.8418 0.00292969 l 1
 89.4668 491 l 1
EndSplineSet
EndChar

StartChar: h
Encoding: 104 104 8
Width: 522
VWidth: 0
Flags: W
HStem: 0 21G<77.6376 163.5 386.5 470.5 714.5 848.5 1023.5 1157.5>
VStem: 77.625 85.875<0.000976562 358.001 407.001 800.016> 386.5 84<0.000976562 418.318> 714.5 134<0 353 424 799.844> 829.5 19<353 410> 1023.5 134<0 399.916>
LayerCount: 2
Back
SplineSet
1158 0 m 9xb0
 1024 0 l 18
 1024 266.844 l 1
 1024 527.344 804.932 285.87 830 281 c 1
 830 410 l 1
 1072 597 1158 492 1158 365 c 2
 1158 0 l 9xb0
715.5 799.846 m 2
 715.5 799.846 813.751 799.845 849.5 799.844 c 1
 849 424 l 17
 849 0 l 9
 715 0 l 17xd0
 715.5 799.846 l 2
EndSplineSet
Fore
SplineSet
163.495 800.016 m 17xe4
 163.5 0.000976562 l 9
 77.625 0 l 17
 78.127 800.018 l 9
 163.495 800.016 l 17xe4
470.5 0.000976562 m 9
 386.5 0.000976562 l 18
 386.5 314.001 l 1
 386.5 411.976 365.312 521.977 151.5 358.001 c 1
 142.5 407.001 l 1
 409.5 599.5 469.5 498.5 470.5 334 c 1
 470.5 334 469.53 112.466 470.5 0.000976562 c 9
1157.5 0 m 9
 1023.5 0 l 18
 1023.5 295 l 2
 1023.5 554 829.5 353 829.5 353 c 1
 829.5 410 l 1xec
 1071.5 597 1157.5 492 1157.5 365 c 2
 1157.5 0 l 9
715 799.846 m 2
 715 799.846 813.251 799.846 849 799.844 c 1
 848.5 424 l 17
 848.5 0 l 9
 714.5 0 l 17xf4
 715 799.846 l 2
EndSplineSet
EndChar

StartChar: r
Encoding: 114 114 9
Width: 450
VWidth: 0
Flags: W
HStem: 0 21G<111.043 245.043> 381.9 128<345.503 417.045>
VStem: 111.043 134<0 375.9 404 429.198>
LayerCount: 2
Back
SplineSet
245 59 m 2xb0
 245 46 249 35 260 27 c 0
 269 20 279 15 290 12 c 2
 305 8 l 1
 305 0 l 1
 222.831 10.7295 138.832 10.7246 51 0 c 1
 51 2 51 5 50 8 c 1
 65 12 l 2
 76 14 86 19 95 27 c 1
 106 35 111 44 110 54 c 1
 111 320 l 2
 111 350 103 375 87 394 c 0
 71 413 50 426 24 433 c 1
 24 439 l 1
 78 447 120 455 151 463 c 0
 182 471 211 483 238 500 c 1
 245 499 l 1
 245 59 l 2xb0
302 414 m 0xd0
 273 414 240 311 226 291 c 1
 232 348 l 1
 268 400 296 510 384 510 c 0
 431 510 457 474 457 427 c 0
 457 383 429 346 391 346 c 0
 356 346 330 365 313 404 c 0
 311 411 307 414 302 414 c 0xd0
EndSplineSet
Fore
SplineSet
450 381.9 m 1
 318.781 373.11 l 17
 307.781 506.11 222.521 276.9 225.043 271 c 1
 230.521 375.9 l 1
 287.859 494.641 340.932 509.9 387.521 509.9 c 1
 453.72 509.16 466.521 438.9 450 381.9 c 1
111.543 498.501 m 2
 111.543 498.501 183.042 498.5 218.791 498.499 c 1
 245.043 404 l 17
 245.043 0 l 9
 111.043 0 l 17
 111.543 498.501 l 2
EndSplineSet
EndChar

StartChar: i
Encoding: 105 105 10
Width: 298
VWidth: 0
Flags: W
HStem: 556.9 175<117.804 228.626>
VStem: 90 167<585.97 702.981>
LayerCount: 2
Back
SplineSet
90 724 m 4xf8
 90 771 125 811 173 811 c 4
 221 811 257 771 257 724 c 4
 257 676 221 636 173 636 c 4
 125 636 90 676 90 724 c 4xf8
10 439 m 5
 107 454 159 461 224 501 c 5
 231 500 l 5
 231 59 l 5
 230 33 255 17 276 12 c 6
 291 8 l 5
 291 0 l 5
 205.195 10.7272 121.135 10.7226 37 0 c 5
 37 2 37 5 36 8 c 5
 51 12 l 6
 69 16 97 33 96 54 c 5xf4
 97 320 l 6
 97 383 61 420 10 433 c 5
 10 439 l 5
EndSplineSet
Fore
SplineSet
231 498 m 1
 97 498.002 l 2
 96.5 0 l 9
 230.5 0 l 17
 231 498 l 1
90 644.9 m 4
 90 691.9 125 731.9 173 731.9 c 4
 221 731.9 257 691.9 257 644.9 c 4
 257 596.9 221 556.9 173 556.9 c 4
 125 556.9 90 596.9 90 644.9 c 4
EndSplineSet
EndChar
EndChars
EndSplineFont
