<?xml version="1.0" standalone="yes"?>
<svg width="445" height="1001">
<path style="stroke:#020202; fill:none;" d="M118 148C182.314 119.357 265.938 138.96 298.02 205C305.786 220.986 310.212 241.258 310.961 259C311.702 276.587 305.93 298.709 299.536 315C292.533 332.844 279.809 348.855 265.83 361.753C254.754 371.973 243.341 378.274 236.478 392C233.514 397.929 222.697 410.574 223.785 417C227.261 437.535 248.472 448.509 262 461.089C284.969 482.449 304.492 506.417 315.739 536C350.588 627.659 303.827 742.715 202 761.69C173.142 767.067 144.409 764.355 116 757.665C103.23 754.658 90.0074 746.116 77 746M155 414L222 416"/>
</svg>
