<?xml version="1.0" encoding="UTF-8" standalone="no"?>
<svg
   xmlns:dc="http://purl.org/dc/elements/1.1/"
   xmlns:cc="http://creativecommons.org/ns#"
   xmlns:rdf="http://www.w3.org/1999/02/22-rdf-syntax-ns#"
   xmlns:svg="http://www.w3.org/2000/svg"
   xmlns="http://www.w3.org/2000/svg"
   xmlns:sodipodi="http://sodipodi.sourceforge.net/DTD/sodipodi-0.dtd"
   xmlns:inkscape="http://www.inkscape.org/namespaces/inkscape"
   width="445"
   height="1001"
   id="svg2"
   version="1.1"
   inkscape:version="0.48.4 r9939"
   sodipodi:docname="dollar.svg">
  <metadata
     id="metadata10">
    <rdf:RDF>
      <cc:Work
         rdf:about="">
        <dc:format>image/svg+xml</dc:format>
        <dc:type
           rdf:resource="http://purl.org/dc/dcmitype/StillImage" />
      </cc:Work>
    </rdf:RDF>
  </metadata>
  <defs
     id="defs8" />
  <sodipodi:namedview
     pagecolor="#ffffff"
     bordercolor="#666666"
     borderopacity="1"
     objecttolerance="10"
     gridtolerance="10"
     guidetolerance="10"
     inkscape:pageopacity="0"
     inkscape:pageshadow="2"
     inkscape:window-width="640"
     inkscape:window-height="480"
     id="namedview6"
     showgrid="false"
     inkscape:zoom="0.27628621"
     inkscape:cx="222.5"
     inkscape:cy="500.5"
     inkscape:window-x="0"
     inkscape:window-y="20"
     inkscape:window-maximized="0"
     inkscape:current-layer="svg2" />
  <path
     style="font-size:medium;font-style:normal;font-variant:normal;font-weight:normal;font-stretch:normal;text-indent:0;text-align:start;text-decoration:none;line-height:normal;letter-spacing:normal;word-spacing:normal;text-transform:none;direction:ltr;block-progression:tb;writing-mode:lr-tb;text-anchor:start;baseline-shift:baseline;color:#000000;fill:#020202;fill-opacity:1;stroke:none;stroke-width:1;marker:none;visibility:visible;display:inline;overflow:visible;enable-background:accumulate;font-family:Sans;-inkscape-font-specification:Sans"
     d="M 226.5 35 C 226.5 57.626637 227.81002 80.611698 224.0625 102.90625 C 223.27064 107.61701 221.35829 112.88407 220.625 118.0625 C 219.89171 123.24093 220.37952 128.41336 224.46875 132.78125 C 225.93471 134.34786 227.94584 134.97858 230 135.28125 C 232.05416 135.58392 234.18981 135.56583 235.9375 135.78125 C 245.93372 137.0124 255.99755 138.22449 265.90625 139.9375 C 281.1891 142.57963 295.69384 154.25671 308.75 162.4375 L 309.25 161.5625 C 296.27616 153.43329 281.7569 141.64537 266.09375 138.9375 C 256.15045 137.21851 246.05628 136.0121 236.0625 134.78125 C 234.21619 134.55367 232.10634 134.56858 230.15625 134.28125 C 228.20616 133.99392 226.46179 133.42214 225.21875 132.09375 C 221.36898 127.98164 220.91279 123.21707 221.625 118.1875 C 222.33721 113.15793 224.24736 107.94299 225.0625 103.09375 C 228.83498 80.650702 227.5 57.587563 227.5 35 L 226.5 35 z M 223.75 132.5625 C 222.51744 133.27342 219.51835 134.03544 216.9375 135.09375 C 215.64707 135.62291 214.4486 136.22808 213.5625 137.03125 C 212.6764 137.83442 212.12223 138.89311 212.28125 140.125 C 212.75203 143.77329 215.60842 146.25288 218.375 148.71875 C 221.14158 151.18462 223.8082 153.61981 224.34375 157.0625 C 226.1578 168.72794 224.5 182.03794 224.5 194 C 224.5 213.67695 225.5 233.30591 225.5 253 C 225.5 274.58702 224.58504 296.42358 225.53125 318.03125 C 226.13882 331.89487 229.28187 348.44194 227.34375 361.9375 C 226.95452 364.64697 225.23829 367.16843 222.875 369.625 C 220.51171 372.08157 217.53957 374.43976 214.71875 376.84375 C 211.89793 379.24774 209.23782 381.71135 207.53125 384.375 C 205.82468 387.03865 205.08902 389.95835 206.21875 393.15625 C 213.18499 412.87554 224.69611 430.64327 233.78125 449.21875 C 238.19016 458.23369 241.52336 471.78879 247.875 479.75 C 251.18335 483.8968 257.01943 485.55795 262.90625 487.125 C 268.79307 488.69205 274.77106 490.16689 278.5 493.59375 C 289.34873 503.56259 297.96488 517.63929 305.5625 530.25 C 323.67467 560.31276 340.45149 596.81331 338.40625 632.96875 C 335.66938 681.33781 315.30906 717.35023 277.6875 747.4375 C 273.74802 750.58765 266.84416 751.90266 260.21875 753.40625 C 253.59334 754.90984 247.18668 756.60194 244.25 761.03125 C 238.17799 770.1882 236.23798 785.48803 233.875 795.875 C 225.99576 830.50619 225.5 865.72541 225.5 901 L 226.5 901 C 226.5 865.73459 226.99504 830.62181 234.84375 796.125 C 237.22677 785.64997 239.25376 770.4008 245.09375 761.59375 C 247.71707 757.63706 253.84041 755.87216 260.4375 754.375 C 267.03459 752.87784 274.04198 751.6336 278.3125 748.21875 C 316.10094 717.99802 336.65512 681.65219 339.40625 633.03125 C 341.47101 596.53069 324.59333 559.88524 306.4375 529.75 C 298.83712 517.13471 290.15552 502.95091 279.15625 492.84375 C 275.14519 489.15761 269.02768 487.7192 263.15625 486.15625 C 257.28482 484.5933 251.6849 482.9212 248.65625 479.125 C 242.54589 471.46621 239.14934 457.96831 234.65625 448.78125 C 225.53539 430.13273 214.07001 412.41446 207.15625 392.84375 C 206.13348 389.94865 206.77476 387.40395 208.375 384.90625 C 209.97524 382.40855 212.54182 380.01289 215.34375 377.625 C 218.14568 375.23711 221.16172 372.84052 223.59375 370.3125 C 226.02578 367.78448 227.90848 365.09253 228.34375 362.0625 C 230.31963 348.30406 227.13368 331.71513 226.53125 317.96875 C 225.58751 296.41842 226.5 274.61498 226.5 253 C 226.5 233.27209 225.5 213.64305 225.5 194 C 225.5 182.13206 227.1897 168.80806 225.34375 156.9375 C 224.7423 153.07119 221.83217 150.43738 219.0625 147.96875 C 216.29283 145.50012 213.69247 143.18671 213.28125 140 C 213.16777 139.12089 213.515 138.44746 214.25 137.78125 C 214.985 137.11504 216.1053 136.50784 217.34375 136 C 219.82065 134.98431 222.70856 134.32658 224.25 133.4375 L 223.75 132.5625 z M 210.90625 139.5 C 200.08887 141.538 185.82119 141.46486 175.78125 146.75 C 143.43037 163.78272 127.13395 192.38798 122.21875 223.96875 C 117.30355 255.54952 123.71947 290.12516 136.6875 319.21875 C 149.6669 348.3385 171.21014 382.69787 204.90625 388.5 L 205.09375 387.5 C 171.97986 381.79813 150.52435 347.7915 137.59375 318.78125 C 124.69578 289.84484 118.34095 255.46548 123.21875 224.125 C 128.09655 192.78452 144.15363 164.50728 176.21875 147.625 C 185.90481 142.52614 200.11713 142.568 211.09375 140.5 L 210.90625 139.5 z M 247.65625 480.65625 C 244.6241 483.6884 239.35843 487.75347 234.65625 492.15625 C 229.95407 496.55903 225.75098 501.27129 224.90625 505.90625 C 221.37869 525.26498 226.5 549.37913 226.5 569 C 226.5 609.05068 225.5 648.95167 225.5 689 C 225.5 696.06602 224.43339 705.23544 223.96875 714.3125 C 223.50411 723.38956 223.62009 732.39304 226.125 739.1875 C 227.56779 743.10039 230.83509 746.71898 234.40625 750.09375 C 237.97741 753.46852 241.88652 756.57402 244.65625 759.34375 L 245.34375 758.65625 C 242.50748 755.81998 238.62334 752.71048 235.09375 749.375 C 231.56416 746.03952 228.40471 742.45261 227.0625 738.8125 C 224.65341 732.27796 224.50639 723.40744 224.96875 714.375 C 225.43111 705.34256 226.5 696.16698 226.5 689 C 226.5 648.96833 227.5 609.06732 227.5 569 C 227.5 549.20687 222.43581 525.13902 225.90625 506.09375 C 226.66552 501.92771 230.68943 497.23297 235.34375 492.875 C 239.99807 488.51703 245.2199 484.4676 248.34375 481.34375 L 247.65625 480.65625 z M 72.0625 713.5 L 71.9375 714.5 L 106.78125 718.46875 L 106.8125 718.5 L 178.78125 755.46875 L 178.84375 755.53125 L 178.90625 755.53125 L 240.90625 765.5 L 241.09375 764.5 L 179.09375 754.53125 L 107.21875 717.5625 L 107.15625 717.53125 L 107.0625 717.53125 L 72.0625 713.5 z "
     id="path4" />
</svg>
