<?xml version="1.0" standalone="yes"?>
<svg width="304" height="1001">
<path style="stroke:#020202; fill:none;" d="M287 317C275.385 326.641 263.398 334.637 253.171 346C233.12 368.278 218.312 396.671 206.424 424C200.435 437.769 194.726 451.855 189.692 466C187.195 473.016 186.15 481.417 182.697 487.985C176.273 500.204 157.581 505.499 152.603 519C146.485 535.594 157.515 557.406 151.397 574C146.129 588.287 126.054 592.944 119.569 606.004C95.3196 654.832 81.6762 709.125 49.2546 754C35.7282 772.722 19.1531 785.062 2 800M27 324C53.8389 347.225 74.2073 372.052 90.1914 404C98.9878 421.582 107.649 440.386 113.997 459C117.386 468.938 119.109 483.274 124.728 492C131.185 502.028 143.523 510.523 152 519M152 576C160.041 584.041 173.122 592.627 179.066 602.09C184.382 610.555 185.847 621.846 189.861 631C202.628 660.112 214.79 689.872 229.63 718C245.927 748.89 265.839 771.362 292 794"/>
</svg>
