<?xml version="1.0" encoding="UTF-8" standalone="no"?>
<svg
   xmlns:dc="http://purl.org/dc/elements/1.1/"
   xmlns:cc="http://creativecommons.org/ns#"
   xmlns:rdf="http://www.w3.org/1999/02/22-rdf-syntax-ns#"
   xmlns:svg="http://www.w3.org/2000/svg"
   xmlns="http://www.w3.org/2000/svg"
   xmlns:sodipodi="http://sodipodi.sourceforge.net/DTD/sodipodi-0.dtd"
   xmlns:inkscape="http://www.inkscape.org/namespaces/inkscape"
   width="390"
   height="1001"
   id="svg2"
   version="1.1"
   inkscape:version="0.48.4 r9939"
   sodipodi:docname="germandbls.svg">
  <metadata
     id="metadata10">
    <rdf:RDF>
      <cc:Work
         rdf:about="">
        <dc:format>image/svg+xml</dc:format>
        <dc:type
           rdf:resource="http://purl.org/dc/dcmitype/StillImage" />
      </cc:Work>
    </rdf:RDF>
  </metadata>
  <defs
     id="defs8" />
  <sodipodi:namedview
     pagecolor="#ffffff"
     bordercolor="#666666"
     borderopacity="1"
     objecttolerance="10"
     gridtolerance="10"
     guidetolerance="10"
     inkscape:pageopacity="0"
     inkscape:pageshadow="2"
     inkscape:window-width="484"
     inkscape:window-height="441"
     id="namedview6"
     showgrid="false"
     inkscape:zoom="0.23576424"
     inkscape:cx="195"
     inkscape:cy="500.5"
     inkscape:window-x="0"
     inkscape:window-y="20"
     inkscape:window-maximized="0"
     inkscape:current-layer="svg2" />
  <path
     style="font-size:medium;font-style:normal;font-variant:normal;font-weight:normal;font-stretch:normal;text-indent:0;text-align:start;text-decoration:none;line-height:normal;letter-spacing:normal;word-spacing:normal;text-transform:none;direction:ltr;block-progression:tb;writing-mode:lr-tb;text-anchor:start;baseline-shift:baseline;color:#000000;fill:#020202;fill-opacity:1;stroke:none;stroke-width:1;marker:none;visibility:visible;display:inline;overflow:visible;enable-background:accumulate;font-family:Sans;-inkscape-font-specification:Sans"
     d="M 190.125 143.1875 C 178.4156 143.4122 166.45578 145.52662 155.84375 149.25 C 126.04244 159.70473 109.43534 185.77761 100.3125 215.75 C 91.189664 245.72239 89.5 279.63356 89.5 306 C 89.5 457.1938 88.5 608.6968 88.5 760 L 89.5 760 C 89.5 608.7012 90.5 457.1982 90.5 306 C 90.5 279.67644 92.209636 245.83536 101.28125 216.03125 C 110.35286 186.22714 126.73536 160.50877 156.15625 150.1875 C 172.15754 144.57322 191.33115 142.68615 207.90625 145.40625 C 221.30491 147.60451 234.17912 149.41796 245.75 156.625 C 254.01605 161.77377 260.86627 168.27286 267.59375 175.34375 C 279.16032 187.50284 286.04106 204.00718 290 220.125 C 304.62988 279.70175 276.40464 333.72997 266.75 391.90625 C 264.93284 402.85622 270.93941 415.9128 273.625 426.125 C 282.11798 458.42038 299.02667 487.20892 306 520.09375 C 309.65205 537.31741 310.39009 555.47258 311.59375 573.03125 C 314.90751 621.38292 311.76125 676.70259 282.96875 717.71875 C 261.22312 748.69707 228.68998 770.42194 202.625 797.65625 L 203.375 798.34375 C 229.33602 771.21806 261.89288 749.46293 283.78125 718.28125 C 312.79675 676.94741 315.91399 621.41508 312.59375 572.96875 C 311.39141 555.42942 310.6447 537.24259 306.96875 519.90625 C 299.95208 486.81708 283.04077 457.99562 274.59375 425.875 C 271.86934 415.5152 266.01316 402.55978 267.75 392.09375 C 277.36936 334.13003 305.70287 279.87625 290.96875 219.875 C 286.98369 203.65082 280.05393 186.99916 268.3125 174.65625 C 261.56198 167.56114 254.62595 160.99848 246.25 155.78125 C 234.46088 148.43829 221.47709 146.63324 208.09375 144.4375 C 203.90152 143.74952 199.54582 143.33954 195.125 143.21875 C 193.46719 143.17345 191.79777 143.1554 190.125 143.1875 z "
     id="path4" />
</svg>
