<?xml version="1.0" standalone="yes"?>
<svg width="281" height="1001">
<path style="fill:#020202; stroke:none;" d="M0 813C17.0306 807.04 32.9768 799.867 45.9779 786.972C65.6586 767.452 74.6848 740.747 83.0721 715C92.9265 684.749 102.33 654.347 111.882 624C143.368 523.968 174.721 423.892 206.649 324C232.116 244.321 258.853 164.97 280 84C263.018 89.9234 247.168 97.0874 234.308 110.052C214.62 129.901 205.743 157.002 197.394 183C187.664 213.297 178.241 243.693 168.539 274C111.182 453.175 48.1105 631.019 0 813z"/>
</svg>
