<?xml version="1.0" standalone="yes"?>
<svg width="212" height="1001">
<path style="fill:#010101; stroke:none;" d="M52 313L10 313L10 385L52 385L52 801L135 801L135 385L192 385L192 313L135 313C135.035 281.427 132.996 246.821 148.802 218.252C162.106 194.208 188.943 183.42 202.867 160.555C214.233 141.888 211.766 117.889 211 97C185.859 97.2554 160.23 97.6517 136.002 105.165C125.485 108.426 115.417 113.067 106.243 119.171C42.6024 161.52 48.3671 246.039 52 313z"/>
</svg>
