<?xml version="1.0" standalone="yes"?>
<svg width="705" height="1001">
<path style="fill:#020202; stroke:none;" d="M334 86.8787C306.11 88.3499 278.379 93.2286 252 102.512C165.01 133.127 100.453 208.932 69.1506 294C9.47264 456.18 45.1261 674.055 201.001 769.962C221.592 782.631 243.79 792.648 267 799.441C299.616 808.987 334.087 812.62 368 810.828C396.195 809.338 424.312 804.262 451 794.969C620.634 735.899 680.377 534.816 654.362 372C649.217 339.8 640.723 308.038 627.952 278C592.899 195.558 525.391 123.977 438 98.1967C404.417 88.2899 368.901 85.0377 334 86.8787z"/>
<path style="fill:#ffffff; stroke:none;" d="M331 137.216C230.685 145.292 154.757 220.007 122.502 312C72.9445 453.347 97.9753 647.833 237 729.333C254.849 739.797 274.034 748.059 294 753.521C319.317 760.447 345.839 762.858 372 760.802C470.615 753.054 548.563 677.173 581.098 587C632.225 445.295 606.277 248.813 466 167.302C447.871 156.768 428.309 148.685 408 143.461C382.942 137.017 356.768 135.141 331 137.216z"/>
<path style="fill:#020202; stroke:none;" d="M239 204L239 693L322 693L322 508L323 508C337.966 540.519 353.357 572.876 369.155 605C383.883 634.95 401.193 666.376 432.116 682.164C453.238 692.947 476.829 693.357 500 693L404 501C436.063 481.038 467.199 458.208 485.142 423.98C521.504 354.616 488.934 266.898 423.972 227.617C369.073 194.42 300.304 200.265 239 204z"/>
<path style="fill:#ffffff; stroke:none;" d="M322 276L322 440C341.058 433.47 360.199 426.478 375.798 413.289C383.079 407.133 389.44 399.844 394.248 391.595C398.149 384.901 400.997 377.59 402.485 369.98C412.607 318.19 363.455 289.875 322 276z"/>
</svg>
