<?xml version="1.0" standalone="yes"?>
<svg width="390" height="1006">
<path style="fill:#010101; stroke:none;" d="M338 301C324.296 310.745 311.324 321.093 298.712 332.213C291.026 338.99 282.249 347.741 271.486 348.751C260.237 349.806 249.805 342 240.93 336.158C227.374 327.236 213.646 318.547 198 313.766C134.096 294.237 77.2442 348.375 53.7064 403C38.7886 437.62 33.5233 475.676 30.7738 513C26.0503 577.121 27.557 645.574 51.8048 706C72.7702 758.246 123.246 817.333 186 801.838C213.282 795.101 235.622 776.252 257 759L257 1006L340 1006L340 567C340 478.471 342.182 389.449 338 301z"/>
<path style="fill:#ffffff; stroke:none;" d="M184.029 394.44C153.625 396.818 135.377 428.876 127.785 455.003C119.896 482.155 118.681 510.911 117.786 539C116.569 577.15 116.672 616.829 126.405 653.998C133.898 682.619 153.818 722.117 188.982 719.83C219.363 717.855 237.879 686.005 245.636 659.995C254.821 629.197 255.524 595.906 255.88 564C256.271 528.947 256.246 493.075 246.95 459.001C239.21 430.629 218.937 391.711 184.029 394.44z"/>
</svg>
