<?xml version="1.0" encoding="UTF-8" standalone="no"?>
<svg
   xmlns:dc="http://purl.org/dc/elements/1.1/"
   xmlns:cc="http://creativecommons.org/ns#"
   xmlns:rdf="http://www.w3.org/1999/02/22-rdf-syntax-ns#"
   xmlns:svg="http://www.w3.org/2000/svg"
   xmlns="http://www.w3.org/2000/svg"
   xmlns:sodipodi="http://sodipodi.sourceforge.net/DTD/sodipodi-0.dtd"
   xmlns:inkscape="http://www.inkscape.org/namespaces/inkscape"
   width="334"
   height="1010"
   id="svg2"
   version="1.1"
   inkscape:version="0.48.4 r9939"
   sodipodi:docname="ccedilla.svg">
  <metadata
     id="metadata10">
    <rdf:RDF>
      <cc:Work
         rdf:about="">
        <dc:format>image/svg+xml</dc:format>
        <dc:type
           rdf:resource="http://purl.org/dc/dcmitype/StillImage" />
      </cc:Work>
    </rdf:RDF>
  </metadata>
  <defs
     id="defs8" />
  <sodipodi:namedview
     pagecolor="#ffffff"
     bordercolor="#666666"
     borderopacity="1"
     objecttolerance="10"
     gridtolerance="10"
     guidetolerance="10"
     inkscape:pageopacity="0"
     inkscape:pageshadow="2"
     inkscape:window-width="640"
     inkscape:window-height="480"
     id="namedview6"
     showgrid="false"
     inkscape:zoom="0.27382426"
     inkscape:cx="167"
     inkscape:cy="505"
     inkscape:window-x="0"
     inkscape:window-y="20"
     inkscape:window-maximized="0"
     inkscape:current-layer="svg2" />
  <path
     style="font-size:medium;font-style:normal;font-variant:normal;font-weight:normal;font-stretch:normal;text-indent:0;text-align:start;text-decoration:none;line-height:normal;letter-spacing:normal;word-spacing:normal;text-transform:none;direction:ltr;block-progression:tb;writing-mode:lr-tb;text-anchor:start;baseline-shift:baseline;color:#000000;fill:#020202;fill-opacity:1;stroke:none;stroke-width:1;marker:none;visibility:visible;display:inline;overflow:visible;enable-background:accumulate;font-family:Sans;-inkscape-font-specification:Sans"
     d="M 181.875 361.4375 C 180.91909 361.43461 179.94146 361.45064 178.96875 361.5 C 176.37487 361.63163 173.71147 361.93911 170.90625 362.5 C 159.92228 364.69639 147.58574 366.52465 137.75 372.5 C 120.00527 383.27902 108.47825 401.4783 100.0625 419.78125 C 82.851784 457.21673 77.497458 502.28498 76.5 543 C 76.141661 557.62704 74.581929 572.25499 75.59375 587.03125 C 78.973675 636.38828 87.58909 694.98124 123.6875 732.34375 C 136.09538 745.18664 150.12934 750.15809 166.875 754.34375 C 169.40279 754.97596 173.90984 755.48063 178.03125 756.46875 C 180.09195 756.96281 182.06707 757.57135 183.59375 758.375 C 185.12043 759.17865 186.17846 760.15038 186.59375 761.3125 C 191.9766 776.38351 182.23393 792.73482 176.96875 806.8125 C 174.60431 813.13647 172.96751 820.16579 169.34375 825.71875 C 165.1782 832.10196 160.31782 837.48223 156.90625 843.375 C 153.49468 849.26777 151.54233 855.70919 153.3125 864.09375 C 154.30242 868.78399 157.35346 871.59106 161.03125 873.5625 C 164.70904 875.53394 169.04755 876.73215 172.8125 878.3125 C 185.0853 883.4654 198.55928 890.62151 205.46875 902.25 C 224.15248 933.6998 206.43095 973.34384 171.875 983.09375 C 148.0663 989.81086 120.82346 983.5381 95.96875 985.5 L 96.03125 986.5 C 120.66054 984.5559 147.9697 990.87739 172.125 984.0625 C 207.27705 974.14441 225.35802 933.7562 206.34375 901.75 C 199.23522 889.78649 185.5227 882.58535 173.1875 877.40625 C 169.33845 875.7906 165.03671 874.58331 161.5 872.6875 C 157.96329 870.79169 155.23458 868.27501 154.3125 863.90625 C 152.59367 855.76481 154.41357 849.63798 157.75 843.875 C 161.08643 838.11202 165.9368 832.74704 170.15625 826.28125 C 173.91449 820.52221 175.57469 813.42353 177.90625 807.1875 C 183.11707 793.25518 193.1184 776.61174 187.53125 760.96875 C 186.99454 759.46687 185.68001 758.36791 184.03125 757.5 C 182.38249 756.63209 180.3863 755.97344 178.28125 755.46875 C 174.07116 754.45937 169.49121 753.96679 167.125 753.375 C 150.43266 749.20266 136.64237 744.32136 124.40625 731.65625 C 88.61606 694.61276 79.969425 636.26372 76.59375 586.96875 C 75.589771 572.30701 77.140339 557.68096 77.5 543 C 78.495742 502.35502 83.852266 457.44927 100.96875 420.21875 C 109.345 402.0017 120.76873 383.96273 138.25 373.34375 C 147.84426 367.5151 160.07372 365.70361 171.09375 363.5 C 182.12886 361.29357 190.92182 362.77899 201.875 365.375 C 214.39136 368.34282 225.72442 371.75018 236.75 378.4375 L 237.25 377.5625 C 226.09358 370.79582 214.67664 367.38243 202.125 364.40625 C 194.9149 362.69738 188.56634 361.4577 181.875 361.4375 z M 252.5 707 C 252.5 723.52638 243.60725 735.01777 231.0625 743 C 218.51775 750.98223 202.33717 755.3816 187.9375 757.5 L 188.0625 758.5 C 202.55183 756.3684 218.86075 751.94577 231.59375 743.84375 C 244.32675 735.74173 253.5 723.88662 253.5 707 L 252.5 707 z "
     id="path4" />
</svg>
