

















                                ___                         ___
                               /\__\          ___          /\__\.
                              /:/ _/_        /\  \        /:/ _/_
                             /:/ /\  \       \:\  \      /:/ /\  \.
                            /:/ /::\  \       \:\  \    /:/ /::\  \.
                           /:/_/:/\:\__\  ___  \:\__\  /:/__\/\:\__\.
                           \:\/:/ /:/  / /\  \ |:|  |  \:\  \ /:/  /
                            \::/ /:/  /  \:\  \|:|  |   \:\  /:/  /
                             \/_/:/  /    \:\__|:|__|    \:\/:/  /
                               /:/  /      \::::/__/      \::/  /
                               \/__/        ~~~~           \/__/











                                                                              | is an XML-based vector image format for two-dimensional
                                                                              | graphics with support for interactivity and animation.
                                                                              | The SVG specification is an open standard developed by
                                                                              | the World Wide Web Consortium (W3C) since 1999.










                                             C
                                              O
                                               N
                                                V
                                                 E     .
                                                  R     S
                                                   T     V
                                                          G

                                                              T O    .
                                                                      J
                                                                       P
                                                                        G    W
                                                                              I
                                                                               T    I
                                                                                H    M
                                                                                      A
                                                                                       G
                                                                                        E
                                                                                         M
                                                                                          A
                                                                                           G
                                                                                            I
                                                                                             C
                                                                                              K






                              C H O O S E                     tape the number

                                  Y O U R

                              O P T I O N

                                          1 : S K E L E T O N

                                          2 : F L E S H
