<?xml version="1.0" standalone="yes"?>
<svg width="216" height="1001">
<path style="fill:#020202; stroke:none;" d="M1 115C36.3504 158.351 74.5128 211.087 124.999 237.629C141.664 246.39 159.622 250.607 178 254C149.253 206.327 117.247 147.057 62.9978 124.835C43.2545 116.748 22.0617 115.597 1 115z"/>
</svg>
