<?xml version="1.0" standalone="no"?>
<!DOCTYPE svg PUBLIC "-//W3C//DTD SVG 1.1//EN" "http://www.w3.org/Graphics/SVG/1.1/DTD/svg11.dtd" >
<svg viewBox="0 -205 1024 1024">
  <g transform="matrix(1 0 0 -1 0 819)">
   <path fill="currentColor"
d="M34 258l104 30l2 -44l16 -8l-16 -38v-168l10 -18l-88 -2l8 22v170l-10 30zM178 270l36 28l32 -4l18 -24v-30l-26 -28l-26 4l-24 30l-20 4z" />
  </g>

</svg>
