<?xml version="1.0" standalone="yes"?>
<svg width="371" height="1001">
<path style="fill:#020202; stroke:none;" d="M93 115C128.9 158.475 167.805 212.233 218.997 238.482C235.376 246.881 253.013 250.805 271 254C241.877 208.357 208.78 148.111 156.993 125.358C136.75 116.464 114.772 115.483 93 115M44 313C44 392.964 45.2734 473.05 43.7397 553C42.7336 605.454 35.2898 660.502 48.5331 712C62.3572 765.757 112.515 817.205 172 801.469C201.994 793.534 225.579 771.228 248 751L248 801L322 801L322 313L239 313C239.08 417.062 249.31 522.254 237.584 626C233.954 658.111 222.746 719.269 179.055 717.423C136.124 715.609 129.909 656.952 127.973 625C121.688 521.301 127 416.813 127 313L44 313z"/>
</svg>
