<?xml version="1.0" standalone="yes"?>
<svg width="390" height="1001">
<path style="fill:#010101; stroke:none;" d="M52 313L10 313L10 385L52 385L52 801L135 801L135 385L192 385L192 313L135 313C135.031 281.391 132.959 246.853 148.797 218.25C162.114 194.201 188.921 183.396 202.885 160.548C214.305 141.862 211.808 117.918 211 97C185.859 97.2554 160.23 97.6517 136.002 105.165C125.485 108.426 115.417 113.067 106.243 119.171C42.5768 161.537 48.438 246.03 52 313M255 117L255 220L338 220L338 117L255 117M255 313L255 801L338 801L338 313L255 313z"/>
</svg>
