<?xml version="1.0" standalone="yes"?>
<svg width="297" height="1001">
<path style="fill:#020202; stroke:none;" d="M5 85C39.2568 127.966 90.0051 163.617 106.646 218C130.585 296.239 92.6351 388.522 150.673 456.448C159.209 466.439 169.13 475.273 180.102 482.51C197.22 493.803 216.497 500.201 236 506L236 507C216.503 512.43 197.315 518.576 180.156 529.606C169.292 536.589 159.447 545.139 150.973 554.883C90.6304 624.268 132.272 719.442 104.586 799C86.2277 851.754 32.5807 881.325 4 928C29.737 924.573 55.7018 920.812 79.9994 911.236C95.4073 905.164 109.836 896.777 122.516 886.103C171.381 844.968 181.761 781.478 182.819 721C183.412 687.146 180.501 652.023 189.541 619C196.658 593.001 212.035 572.09 229.448 552C241.341 538.278 257.841 521.823 256.267 502.063C254.487 479.733 232.5 462.839 219.256 446.758C202.232 426.089 191.42 402.346 186.767 376C173.605 301.473 198.126 217.218 148.734 152.228C140.676 141.625 131.219 132.077 120.73 123.875C107.826 113.783 93.3399 105.878 77.9999 100.164C54.5476 91.4275 29.7169 87.9722 5 85z"/>
</svg>
