<?xml version="1.0" encoding="UTF-8"?>
<glyph name="Atilde" format="1">
  <advance width="834"/>
  <unicode hex="00C3"/>
  <outline>
    <component base="A"/>
    <component base="asciitilde" xOffset="165" yOffset="369"/>
  </outline>
  <lib>
    <dict>
      <key>com.fontlab.hintData</key>
      <dict>
	<key>hhints</key>
	<array>
	  <dict>
	    <key>position</key>	    <integer>0</integer>
	    <key>width</key>	    <integer>8</integer>
	  </dict>
	  <dict>
	    <key>position</key>	    <integer>246</integer>
	    <key>width</key>	    <integer>16</integer>
	  </dict>
	  <dict>
	    <key>position</key>	    <integer>798</integer>
	    <key>width</key>	    <integer>20</integer>
	  </dict>
	  <dict>
	    <key>position</key>	    <integer>879</integer>
	    <key>width</key>	    <integer>70</integer>
	  </dict>
	  <dict>
	    <key>position</key>	    <integer>962</integer>
	    <key>width</key>	    <integer>69</integer>
	  </dict>
	</array>
	<key>vhints</key>
	<array>
	  <dict>
	    <key>position</key>
	    <integer>280</integer>
	    <key>width</key>
	    <integer>322</integer>
	  </dict>
	</array>
      </dict>
    </dict>
  </lib>
</glyph>
