<?xml version="1.0" standalone="yes"?>
<svg width="445" height="1001">
<path style="stroke:#020202; fill:none;" d="M317 501C311.335 498.098 305.793 500.965 300 502.576C290.195 505.301 280.108 507.468 270 508.714C257.317 510.276 244.693 509.219 232 510.09C221.046 510.84 210.01 514.159 199 513.946C181.387 513.605 163.469 505.678 150 494.739C92.9756 448.429 81.9779 365.54 88.831 297C91.0244 275.064 94.2859 253.858 101.783 233C112.453 203.315 128.605 175.65 154 156.236C167.552 145.876 182.457 141.458 199 138.754C226.571 134.247 259.595 137.072 284 151.927C322.718 175.494 343.922 225.079 351.144 268C356.977 302.662 360.921 337.924 357.166 373C352.633 415.335 343.498 466.248 317 501M317 501C316.705 515.27 312.694 529.96 310.25 544C308.338 554.982 307.538 567.53 303.672 578C293.87 604.548 277.471 630.494 263.421 655C242.662 691.211 220.224 726.589 189 754.83C175.209 767.304 159.046 774.624 144 785"/>
</svg>
