<?xml version="1.0" encoding="UTF-8"?>
<glyph name="A" format="1">
  <advance width="834"/>
  <unicode hex="0041"/>
  <outline>
    <contour>
      <point x="729" y="91" type="line" smooth="yes"/>
      <point x="753" y="30"/>
      <point x="826" y="8"/>
      <point x="826" y="8" type="curve"/>
      <point x="826" y="0" type="line"/>
      <point x="780" y="6"/>
      <point x="714" y="9"/>
      <point x="647" y="9" type="curve" smooth="yes"/>
      <point x="577" y="9"/>
      <point x="507" y="6"/>
      <point x="459" y="0" type="curve"/>
      <point x="459" y="8" type="line"/>
      <point x="459" y="8"/>
      <point x="545" y="22"/>
      <point x="545" y="67" type="curve" smooth="yes"/>
      <point x="545" y="72"/>
      <point x="543" y="77"/>
      <point x="541" y="83" type="curve"/>
      <point x="476" y="246" type="line"/>
      <point x="240" y="246" type="line"/>
      <point x="211" y="171" type="line" smooth="yes"/>
      <point x="203" y="150"/>
      <point x="199" y="132"/>
      <point x="199" y="116" type="curve" smooth="yes"/>
      <point x="199" y="21"/>
      <point x="324" y="8"/>
      <point x="324" y="8" type="curve"/>
      <point x="324" y="0" type="line"/>
      <point x="276" y="5"/>
      <point x="218" y="8"/>
      <point x="160" y="8" type="curve" smooth="yes"/>
      <point x="108" y="8"/>
      <point x="55" y="6"/>
      <point x="10" y="0" type="curve"/>
      <point x="10" y="8" type="line"/>
      <point x="122" y="11"/>
      <point x="195" y="179"/>
      <point x="195" y="179" type="curve"/>
      <point x="349" y="563" type="line"/>
      <point x="336" y="586"/>
      <point x="322" y="598"/>
      <point x="302" y="598" type="curve"/>
      <point x="299" y="603" type="line"/>
      <point x="343" y="636"/>
      <point x="351" y="655"/>
      <point x="379" y="698" type="curve" smooth="yes"/>
      <point x="400" y="730"/>
      <point x="434" y="816"/>
      <point x="434" y="816" type="curve"/>
      <point x="441" y="818" type="line"/>
    </contour>
    <contour>
      <point x="358" y="546" type="curve"/>
      <point x="247" y="262" type="line"/>
      <point x="470" y="262" type="line"/>
      <point x="362" y="537" type="line" smooth="yes"/>
      <point x="361" y="540"/>
      <point x="359" y="543"/>
    </contour>
  </outline>
  <lib>
    <dict>
      <key>com.fontlab.hintData</key>
      <dict>
	<key>hhints</key>
	<array>
	  <dict>
	    <key>position</key>	    <integer>0</integer>
	    <key>width</key>	    <integer>8</integer>
	  </dict>
	  <dict>
	    <key>position</key>	    <integer>246</integer>
	    <key>width</key>	    <integer>16</integer>
	  </dict>
	  <dict>
	    <key>position</key>	    <integer>798</integer>
	    <key>width</key>	    <integer>20</integer>
	  </dict>
	</array>
      </dict>
    </dict>
  </lib>
</glyph>
