<?xml version="1.0" standalone="yes"?>
<svg width="334" height="1001">
<path style="stroke:#010101; fill:none;" d="M106 562C129.757 554.453 154.482 554.163 179 551.83C196.049 550.208 212.206 545.471 229 543"/>
</svg>
