<?xml version="1.0" standalone="yes"?>
<svg width="371" height="1001">
<path style="fill:#010101; stroke:none;" d="M48 96L48 801L131 801L131 606C131 565.809 129.163 525.041 133.232 485C136.481 453.028 148.941 394.048 191.936 396.381C234.719 398.703 241.024 456.878 242.975 489C249.273 592.67 244 697.211 244 801L327 801C327 722.031 325.825 642.957 327.238 564C328.168 512.091 334.959 458.163 323.227 407C311.181 354.469 266.762 301.919 208 309.78C179.281 313.622 154.642 330.448 131 346L131 96L48 96z"/>
</svg>
