<?xml version="1.0" encoding="UTF-8"?>
<glyph name="K" format="1">
  <advance width="844"/>
  <unicode hex="004B"/>
  <outline>
    <contour>
      <point x="125" y="85" type="curve" smooth="yes"/>
      <point x="125" y="715" type="line" smooth="yes"/>
      <point x="125" y="778"/>
      <point x="32" y="792"/>
      <point x="32" y="792" type="curve"/>
      <point x="32" y="800" type="line"/>
      <point x="76" y="791"/>
      <point x="142" y="786"/>
      <point x="210" y="786" type="curve" smooth="yes"/>
      <point x="275" y="786"/>
      <point x="341" y="791"/>
      <point x="392" y="800" type="curve"/>
      <point x="392" y="792" type="line"/>
      <point x="392" y="792"/>
      <point x="299" y="778"/>
      <point x="299" y="715" type="curve" smooth="yes"/>
      <point x="299" y="372" type="line"/>
      <point x="394" y="475"/>
      <point x="535" y="640"/>
      <point x="535" y="640" type="curve"/>
      <point x="570" y="678"/>
      <point x="583" y="705"/>
      <point x="583" y="727" type="curve" smooth="yes"/>
      <point x="583" y="775"/>
      <point x="522" y="792"/>
      <point x="522" y="792" type="curve"/>
      <point x="522" y="800" type="line"/>
      <point x="566" y="791"/>
      <point x="609" y="786"/>
      <point x="652" y="786" type="curve" smooth="yes"/>
      <point x="694" y="786"/>
      <point x="734" y="791"/>
      <point x="775" y="800" type="curve"/>
      <point x="775" y="797"/>
      <point x="776" y="792"/>
      <point x="776" y="792" type="curve"/>
      <point x="730,889" y="791,844"/>
      <point x="633" y="719,5"/>
      <point x="549" y="632" type="curve"/>
      <point x="470" y="542" type="line"/>
      <point x="762" y="64" type="line"/>
      <point x="762" y="64"/>
      <point x="794" y="19"/>
      <point x="820" y="12" type="curve" smooth="yes"/>
      <point x="835" y="8" type="line"/>
      <point x="835" y="0" type="line"/>
      <point x="792" y="6"/>
      <point x="737" y="8"/>
      <point x="684" y="8" type="curve" smooth="yes"/>
      <point x="630" y="8"/>
      <point x="577" y="6"/>
      <point x="536" y="0" type="curve"/>
      <point x="536" y="8" type="line"/>
      <point x="551" y="12" type="line" smooth="yes"/>
      <point x="564" y="15"/>
      <point x="571" y="24"/>
      <point x="571" y="36" type="curve" smooth="yes"/>
      <point x="571" y="43"/>
      <point x="569" y="50"/>
      <point x="563" y="58" type="curve"/>
      <point x="348" y="402" type="line"/>
      <point x="299" y="346" type="line"/>
      <point x="299" y="85" type="line" smooth="yes"/>
      <point x="299" y="21"/>
      <point x="392" y="8"/>
      <point x="392" y="8" type="curve"/>
      <point x="392" y="1" type="line"/>
      <point x="343" y="6"/>
      <point x="277" y="9"/>
      <point x="212" y="9" type="curve" smooth="yes"/>
      <point x="144" y="9"/>
      <point x="77" y="6"/>
      <point x="32" y="1" type="curve"/>
      <point x="32" y="8" type="line"/>
      <point x="32" y="8"/>
      <point x="125" y="22"/>
    </contour>
  </outline>
  <lib>
    <dict>
      <key>com.fontlab.hintData</key>
      <dict>
	<key>hhints</key>
	<array>
	  <dict>
	    <key>position</key>	    <integer>1</integer>
	    <key>width</key>	    <integer>7</integer>
	  </dict>
	  <dict>
	    <key>position</key>	    <integer>9</integer>
	    <key>width</key>	    <integer>777</integer>
	  </dict>
	  <dict>
	    <key>position</key>	    <integer>792</integer>
	    <key>width</key>	    <integer>8</integer>
	  </dict>
	</array>
	<key>vhints</key>
	<array>
	  <dict>
	    <key>position</key>
	    <integer>125</integer>
	    <key>width</key>
	    <integer>174</integer>
	  </dict>
	</array>
      </dict>
    </dict>
  </lib>
</glyph>
