<?xml version="1.0" standalone="yes"?>
<svg width="205" height="1001">
<path style="fill:#010101; stroke:none;" d="M138 108C116.624 120.185 95.3171 133.26 80.5496 153.467C49.1672 196.409 60 262.894 60 313L8 313L8 385L60 385L60 801L143 801L143 385L195 385L195 313L143 313C143 244.885 145.686 175.799 138 108z"/>
</svg>
