<?xml version="1.0" standalone="yes"?>
<svg width="279" height="1001">
<path style="fill:#020202; stroke:none;" d="M22 706C22.7965 732.664 25.315 759.465 44.0625 780.182C63.4611 801.618 91.9767 808.876 120 808.216C176.048 806.896 233.138 772.772 247.396 715.999C264.907 646.275 216.771 579.955 179.374 526C160.833 499.25 132.566 466.041 136.456 431.097C137.123 425.101 138.888 419.245 141.712 413.91C161.358 376.795 205.879 388.706 238 398C236.378 372.559 232.786 347.246 213.741 328.475C162.512 277.984 66.3588 316.08 43.0654 377.032C30.8277 409.055 37.9712 444.291 50.629 475C65.499 511.076 87.591 543.57 108.97 576C123.797 598.491 140.296 621.786 147.758 648C158.468 685.624 135.555 726.729 93.9844 727.837C68.6942 728.51 44.5197 715.996 22 706z"/>
</svg>
