<?xml version="1.0" encoding="UTF-8" standalone="no"?>
<svg
   xmlns:dc="http://purl.org/dc/elements/1.1/"
   xmlns:cc="http://creativecommons.org/ns#"
   xmlns:rdf="http://www.w3.org/1999/02/22-rdf-syntax-ns#"
   xmlns:svg="http://www.w3.org/2000/svg"
   xmlns="http://www.w3.org/2000/svg"
   xmlns:sodipodi="http://sodipodi.sourceforge.net/DTD/sodipodi-0.dtd"
   xmlns:inkscape="http://www.inkscape.org/namespaces/inkscape"
   width="203"
   height="1010"
   id="svg2"
   version="1.1"
   inkscape:version="0.48.4 r9939"
   sodipodi:docname="cedilla.svg">
  <metadata
     id="metadata10">
    <rdf:RDF>
      <cc:Work
         rdf:about="">
        <dc:format>image/svg+xml</dc:format>
        <dc:type
           rdf:resource="http://purl.org/dc/dcmitype/StillImage" />
      </cc:Work>
    </rdf:RDF>
  </metadata>
  <defs
     id="defs8" />
  <sodipodi:namedview
     pagecolor="#ffffff"
     bordercolor="#666666"
     borderopacity="1"
     objecttolerance="10"
     gridtolerance="10"
     guidetolerance="10"
     inkscape:pageopacity="0"
     inkscape:pageshadow="2"
     inkscape:window-width="640"
     inkscape:window-height="480"
     id="namedview6"
     showgrid="false"
     inkscape:zoom="0.27382426"
     inkscape:cx="101.5"
     inkscape:cy="505"
     inkscape:window-x="0"
     inkscape:window-y="20"
     inkscape:window-maximized="0"
     inkscape:current-layer="svg2" />
  <path
     style="font-size:medium;font-style:normal;font-variant:normal;font-weight:normal;font-stretch:normal;text-indent:0;text-align:start;text-decoration:none;line-height:normal;letter-spacing:normal;word-spacing:normal;text-transform:none;direction:ltr;block-progression:tb;writing-mode:lr-tb;text-anchor:start;baseline-shift:baseline;color:#000000;fill:#020202;fill-opacity:1;stroke:none;stroke-width:1;marker:none;visibility:visible;display:inline;overflow:visible;enable-background:accumulate;font-family:Sans;-inkscape-font-specification:Sans"
     d="M 132.65625 801.625 C 119.12211 813.44739 105.12155 824.74823 93.53125 838.6875 C 87.691976 845.71087 81.467145 853.12016 82.78125 863.0625 C 83.358283 867.42821 85.460516 870.07258 88.21875 871.9375 C 90.976984 873.80242 94.368179 874.94403 97.78125 876.5 C 109.65938 881.91444 122.16322 886.9682 131.15625 896.625 C 140.89597 907.08155 144.32709 921.61792 142.65625 935.75 C 140.98541 949.88208 134.22322 963.57912 123.6875 972.28125 C 112.87372 981.21356 99.66621 984.17225 85.96875 985.3125 C 67.235803 986.87274 48.159341 981.09184 28.96875 982.5 L 29.03125 983.5 C 47.972259 982.11016 67.039997 987.89426 86.03125 986.3125 C 99.81879 985.16475 113.27428 982.18019 124.3125 973.0625 C 135.08278 964.16663 141.95734 950.24442 143.65625 935.875 C 145.35516 921.50558 141.88153 906.64695 131.90625 895.9375 C 122.71728 886.0703 110.06862 880.99531 98.21875 875.59375 C 94.746321 874.01072 91.344666 872.87933 88.75 871.125 C 86.155334 869.37067 84.325317 867.05379 83.78125 862.9375 C 82.529355 853.46584 88.472174 846.33713 94.3125 839.3125 C 105.8192 825.47377 119.78989 814.21461 133.34375 802.375 L 132.65625 801.625 z "
     id="path4" />
</svg>
