<?xml version="1.0" encoding="UTF-8"?>
<glyph name="e" format="1">
  <advance width="542"/>
  <unicode hex="0065"/>
  <outline>
    <contour>
      <point x="33" y="249" type="curve" smooth="yes"/>
      <point x="33" y="396"/>
      <point x="146" y="510"/>
      <point x="293" y="510" type="curve" smooth="yes"/>
      <point x="425" y="510"/>
      <point x="510" y="384"/>
      <point x="510" y="288" type="curve"/>
      <point x="376" y="288" type="line"/>
      <point x="174" y="288" type="line"/>
      <point x="186" y="188"/>
      <point x="248" y="89"/>
      <point x="359" y="89" type="curve" smooth="yes"/>
      <point x="396" y="89"/>
      <point x="455" y="93"/>
      <point x="499" y="163" type="curve"/>
      <point x="509" y="162" type="line"/>
      <point x="509" y="159"/>
      <point x="465" y="-11"/>
      <point x="292" y="-11" type="curve" smooth="yes"/>
      <point x="144" y="-11"/>
      <point x="33" y="100"/>
    </contour>
    <contour>
      <point x="173" y="306" type="curve"/>
      <point x="376" y="306" type="line"/>
      <point x="375" y="397"/>
      <point x="368" y="493"/>
      <point x="293" y="493" type="curve" smooth="yes"/>
      <point x="212" y="493"/>
      <point x="172" y="413"/>
      <point x="172" y="324" type="curve" smooth="yes"/>
      <point x="172" y="318"/>
      <point x="172" y="312"/>
    </contour>
  </outline>
  <lib>
    <dict>
      <key>com.fontlab.hintData</key>
      <dict>
	<key>hhints</key>
	<array>
	  <dict>
	    <key>position</key>	    <integer>-11</integer>
	    <key>width</key>	    <integer>100</integer>
	  </dict>
	  <dict>
	    <key>position</key>	    <integer>288</integer>
	    <key>width</key>	    <integer>18</integer>
	  </dict>
	  <dict>
	    <key>position</key>	    <integer>493</integer>
	    <key>width</key>	    <integer>17</integer>
	  </dict>
	</array>
	<key>vhints</key>
	<array>
	  <dict>
	    <key>position</key>
	    <integer>33</integer>
	    <key>width</key>
	    <integer>139</integer>
	  </dict>
	  <dict>
	    <key>position</key>
	    <integer>376</integer>
	    <key>width</key>
	    <integer>134</integer>
	  </dict>
	</array>
      </dict>
    </dict>
  </lib>
</glyph>
