<?xml version="1.0" encoding="UTF-8"?>
<glyph name="w" format="1">
  <advance width="986"/>
  <unicode hex="0077"/>
  <outline>
    <contour>
      <point x="270" y="-10" type="line"/>
      <point x="262" y="-10" type="line"/>
      <point x="70" y="446" type="line" smooth="yes"/>
      <point x="61" y="467"/>
      <point x="42" y="483"/>
      <point x="25" y="487" type="curve"/>
      <point x="10" y="492" type="line"/>
      <point x="10" y="500" type="line"/>
      <point x="54" y="494"/>
      <point x="97" y="492"/>
      <point x="139" y="492" type="curve" smooth="yes"/>
      <point x="182" y="492"/>
      <point x="223" y="494"/>
      <point x="264" y="500" type="curve"/>
      <point x="264" y="492" type="line"/>
      <point x="249" y="487" type="line"/>
      <point x="236" y="484"/>
      <point x="231" y="478"/>
      <point x="231" y="467" type="curve" smooth="yes"/>
      <point x="231" y="461"/>
      <point x="233" y="452"/>
      <point x="237" y="442" type="curve" smooth="yes"/>
      <point x="340" y="172" type="line"/>
      <point x="413" y="327" type="line" smooth="yes"/>
      <point x="429" y="361"/>
      <point x="435" y="389"/>
      <point x="435" y="410" type="curve" smooth="yes"/>
      <point x="435" y="484"/>
      <point x="363" y="492"/>
      <point x="363" y="492" type="curve"/>
      <point x="363" y="500" type="line"/>
      <point x="407" y="494"/>
      <point x="450" y="492"/>
      <point x="493" y="492" type="curve" smooth="yes"/>
      <point x="535" y="492"/>
      <point x="576" y="494"/>
      <point x="617" y="500" type="curve"/>
      <point x="617" y="497"/>
      <point x="618" y="492"/>
      <point x="618" y="492" type="curve"/>
      <point x="603" y="487" type="line"/>
      <point x="590" y="484"/>
      <point x="585" y="478"/>
      <point x="585" y="467" type="curve" smooth="yes"/>
      <point x="585" y="461"/>
      <point x="587" y="452"/>
      <point x="591" y="442" type="curve" smooth="yes"/>
      <point x="700" y="172" type="line"/>
      <point x="772" y="327" type="line" smooth="yes"/>
      <point x="788" y="362"/>
      <point x="795" y="389"/>
      <point x="795" y="411" type="curve" smooth="yes"/>
      <point x="795" y="484"/>
      <point x="722" y="492"/>
      <point x="722" y="492" type="curve"/>
      <point x="722" y="500" type="line"/>
      <point x="766" y="494"/>
      <point x="810" y="492"/>
      <point x="852" y="492" type="curve" smooth="yes"/>
      <point x="894" y="492"/>
      <point x="936" y="494"/>
      <point x="976" y="500" type="curve"/>
      <point x="976" y="497"/>
      <point x="978" y="492"/>
      <point x="978" y="492" type="curve"/>
      <point x="878" y="491"/>
      <point x="792" y="319"/>
      <point x="792" y="319" type="curve"/>
      <point x="629" y="-10" type="line"/>
      <point x="621" y="-10" type="line"/>
      <point x="568" y="116"/>
      <point x="515" y="241"/>
      <point x="461" y="368" type="curve"/>
      <point x="444" y="340"/>
      <point x="433" y="319"/>
      <point x="433" y="319" type="curve"/>
    </contour>
  </outline>
  <lib>
    <dict>
      <key>com.fontlab.hintData</key>
      <dict>
	<key>hhints</key>
	<array>
	  <dict>
	    <key>position</key>	    <integer>492</integer>
	    <key>width</key>	    <integer>8</integer>
	  </dict>
	</array>
	<key>vhints</key>
	<array>
	  <dict>
	    <key>position</key>
	    <integer>435</integer>
	    <key>width</key>
	    <integer>150</integer>
	  </dict>
	</array>
      </dict>
    </dict>
  </lib>
</glyph>
