<?xml version="1.0" standalone="no"?>
<!DOCTYPE svg PUBLIC "-//W3C//DTD SVG 1.1//EN" "http://www.w3.org/Graphics/SVG/1.1/DTD/svg11.dtd" >
<svg viewBox="0 -205 1024 1024">
  <g transform="matrix(1 0 0 -1 0 819)">
   <path fill="currentColor"
d="M48 102l32 10l20 -8l16 -18l4 -44l-18 -52l-44 -42l10 24v24l-34 52l-2 26zM38 278l26 20l32 -4l18 -18l6 -16l-6 -32l-28 -22l-34 6l-20 30z" />
  </g>

</svg>
