<?xml version="1.0" standalone="yes"?>
<svg width="445" height="1001">
<path style="fill:#020202; stroke:none;" d="M75 399C125.172 397.339 176.742 396.852 219.903 426.436C309.4 487.78 322.904 625.956 235.714 695.523C210.078 715.978 178.746 726.333 146 722.34C117.124 718.82 71.2713 700.529 53.0018 734.432C45.1871 748.934 50.5126 765.158 61.0098 776.703C77.4725 794.809 102.652 802.295 126 806.423C166.772 813.631 209.988 811.742 249 797.237C378.252 749.177 429.114 581.238 377.668 460C342.238 376.504 261.242 335.397 177 317L207 174C239.655 174 272.351 174.471 305 173.83C331.094 173.318 358.086 170.203 376.214 149.208C389.173 134.2 393.456 114.964 397 96C346.351 96 295.641 96.7123 245 95.7055C216.871 95.1462 184.811 91.1918 159.775 106.887C129.262 126.017 123.278 163.524 116.596 196C102.675 263.654 87.1019 330.984 75 399z"/>
</svg>
