<?xml version="1.0" encoding="UTF-8" standalone="no"?>
<svg
   xmlns:dc="http://purl.org/dc/elements/1.1/"
   xmlns:cc="http://creativecommons.org/ns#"
   xmlns:rdf="http://www.w3.org/1999/02/22-rdf-syntax-ns#"
   xmlns:svg="http://www.w3.org/2000/svg"
   xmlns="http://www.w3.org/2000/svg"
   xmlns:sodipodi="http://sodipodi.sourceforge.net/DTD/sodipodi-0.dtd"
   xmlns:inkscape="http://www.inkscape.org/namespaces/inkscape"
   width="408"
   height="1001"
   id="svg2"
   version="1.1"
   inkscape:version="0.48.4 r9939"
   sodipodi:docname="guillemotleft.svg">
  <metadata
     id="metadata10">
    <rdf:RDF>
      <cc:Work
         rdf:about="">
        <dc:format>image/svg+xml</dc:format>
        <dc:type
           rdf:resource="http://purl.org/dc/dcmitype/StillImage" />
      </cc:Work>
    </rdf:RDF>
  </metadata>
  <defs
     id="defs8" />
  <sodipodi:namedview
     pagecolor="#ffffff"
     bordercolor="#666666"
     borderopacity="1"
     objecttolerance="10"
     gridtolerance="10"
     guidetolerance="10"
     inkscape:pageopacity="0"
     inkscape:pageshadow="2"
     inkscape:window-width="484"
     inkscape:window-height="441"
     id="namedview6"
     showgrid="false"
     inkscape:zoom="0.23576424"
     inkscape:cx="204"
     inkscape:cy="500.5"
     inkscape:window-x="0"
     inkscape:window-y="20"
     inkscape:window-maximized="0"
     inkscape:current-layer="svg2" />
  <path
     style="font-size:medium;font-style:normal;font-variant:normal;font-weight:normal;font-stretch:normal;text-indent:0;text-align:start;text-decoration:none;line-height:normal;letter-spacing:normal;word-spacing:normal;text-transform:none;direction:ltr;block-progression:tb;writing-mode:lr-tb;text-anchor:start;baseline-shift:baseline;color:#000000;fill:#020202;fill-opacity:1;stroke:none;stroke-width:1;marker:none;visibility:visible;display:inline;overflow:visible;enable-background:accumulate;font-family:Sans;-inkscape-font-specification:Sans"
     d="M 367.75 401.5625 C 314.50966 431.97955 248.91735 484.36786 244.875 551.96875 C 243.67631 572.01594 254.98728 596.17552 265.5 612.28125 C 290.9815 651.32036 325.52392 684.32565 367.78125 704.4375 L 368.21875 703.5625 C 326.15408 683.54235 291.74025 650.62764 266.34375 611.71875 C 255.90247 595.72248 244.70169 571.65406 245.875 552.03125 C 249.88065 485.04414 315.13234 432.78445 368.25 402.4375 L 367.75 401.5625 z M 218.71875 401.59375 C 205.0514 411.01882 190.07187 417.59863 176.6875 428.03125 C 141.02521 455.83097 96.878476 504.62679 95.625 553 C 95.168044 570.63426 104.66148 592.6923 113.6875 607.25 C 125.90306 626.94921 141.14567 645.1346 157.65625 661.34375 C 176.07115 679.42294 196.45095 693.51088 219.78125 704.4375 L 220.21875 703.5625 C 196.98505 692.68112 176.68085 678.62781 158.34375 660.625 C 141.88033 644.46215 126.69569 626.36679 114.53125 606.75 C 105.57927 592.3117 96.177956 570.25174 96.625 553 C 97.863124 505.21921 141.78279 456.50883 177.3125 428.8125 C 190.57213 418.47712 205.5126 411.90118 219.28125 402.40625 L 218.71875 401.59375 z "
     id="path4" />
</svg>
