<?xml version="1.0" standalone="yes"?>
<svg width="371" height="1001">
<path style="fill:#020202; stroke:none;" d="M102 115C137.274 158.486 175.379 211.484 225.997 237.971C242.35 246.529 259.994 250.625 278 254C249.311 208.234 216.694 148.264 164.99 125.519C145.071 116.756 123.438 115.609 102 115M342 646C315.749 646.465 290.521 648.297 268.62 664.406C246.301 680.822 229.911 709.474 201.96 717.159C179.4 723.362 158.314 708.932 144.549 692.202C115.319 656.678 115.117 607.652 114 564L341 564C340.925 493.233 340.376 413.746 290.707 357.561C231.302 290.363 130.336 297.652 76.0944 367.249C43.2851 409.347 33.5265 464.082 29.6329 516C23.6713 595.491 25.1607 687.689 79.7311 751.61C134.074 815.265 230.597 825.152 290.226 762.879C320.974 730.768 333.171 688.405 342 646z"/>
<path style="fill:#ffffff; stroke:none;" d="M116 495L256 495C252.468 469.401 248.872 442.291 232.826 421.065C205.664 385.135 160.273 392.156 137.295 428.461C124.678 448.396 120.428 472.209 116 495z"/>
</svg>
