<?xml version="1.0" standalone="yes"?>
<svg width="390" height="1006">
<path style="stroke:#010101; fill:none;" d="M91 138L91 334L91 381C91 387.314 89.5131 395.261 95.0586 399.744C101.361 404.838 119.388 391.255 126 388.427C155.732 375.712 186.727 362.428 219 357.439C240.633 354.095 261.88 371.214 274.112 387C302.108 423.13 309.864 470.509 312.91 515C315.491 552.686 314.073 590.489 309.285 628C304.85 662.755 297.349 698.633 275.335 727C270.217 733.594 264.743 739.868 258 744.844C232.149 763.918 201.174 757.134 173 746.336C166.361 743.792 160.667 738.885 154 736.683C139.612 731.931 125.565 727.139 112 720.244C107.59 718.002 100.568 715.378 98.0239 710.895C94.4498 704.596 95.5577 694.05 94.7145 687C92.1382 665.459 92 643.695 92 622C92 572.158 89.8592 521.788 92.0394 472C93.03 449.377 96.5335 426.602 97 404M98 712C84.1497 726.016 91 761.054 91 780L91 965"/>
</svg>
