<?xml version="1.0" encoding="UTF-8"?>
<glyph name="p" format="1">
  <advance width="598"/>
  <unicode hex="0070"/>
  <outline>
    <contour>
      <point x="386" y="510" type="curve" smooth="yes"/>
      <point x="514" y="510"/>
      <point x="570" y="397"/>
      <point x="570" y="267" type="curve" smooth="yes"/>
      <point x="570" y="120"/>
      <point x="467" y="-11"/>
      <point x="321" y="-11" type="curve" smooth="yes"/>
      <point x="280" y="-11"/>
      <point x="251" y="1"/>
      <point x="231" y="24" type="curve"/>
      <point x="231" y="-104" type="line" smooth="yes"/>
      <point x="231" y="-129"/>
      <point x="255" y="-143"/>
      <point x="276" y="-149" type="curve" smooth="yes"/>
      <point x="291" y="-153" type="line"/>
      <point x="291" y="-161" type="line"/>
      <point x="250" y="-156"/>
      <point x="208" y="-153"/>
      <point x="166" y="-153" type="curve" smooth="yes"/>
      <point x="123" y="-153"/>
      <point x="80" y="-156"/>
      <point x="36" y="-161" type="curve"/>
      <point x="36" y="-159"/>
      <point x="36" y="-156"/>
      <point x="35" y="-153" type="curve"/>
      <point x="50" y="-149" type="line" smooth="yes"/>
      <point x="68" y="-145"/>
      <point x="96" y="-129"/>
      <point x="96" y="-108" type="curve" smooth="yes"/>
      <point x="96" y="320" type="line" smooth="yes"/>
      <point x="96" y="383"/>
      <point x="60" y="420"/>
      <point x="9" y="433" type="curve"/>
      <point x="9" y="439" type="line"/>
      <point x="106" y="454"/>
      <point x="159" y="461"/>
      <point x="224" y="500" type="curve"/>
      <point x="231" y="499" type="line"/>
      <point x="231" y="410" type="line"/>
      <point x="261" y="475"/>
      <point x="313" y="510"/>
    </contour>
    <contour>
      <point x="231" y="119" type="line"/>
      <point x="235" y="56"/>
      <point x="253" y="8"/>
      <point x="319" y="8" type="curve" smooth="yes"/>
      <point x="396" y="8"/>
      <point x="418" y="159"/>
      <point x="418" y="224" type="curve" smooth="yes"/>
      <point x="418" y="426"/>
      <point x="332" y="447"/>
      <point x="292" y="447" type="curve" smooth="yes"/>
      <point x="248" y="447"/>
      <point x="234" y="393"/>
      <point x="231" y="340" type="curve"/>
      <point x="231" y="243" type="line"/>
    </contour>
  </outline>
  <lib>
    <dict>
      <key>com.fontlab.hintData</key>
      <dict>
	<key>hhints</key>
	<array>
	  <dict>
	    <key>position</key>	    <integer>-161</integer>
	    <key>width</key>	    <integer>8</integer>
	  </dict>
	  <dict>
	    <key>position</key>	    <integer>-11</integer>
	    <key>width</key>	    <integer>19</integer>
	  </dict>
	  <dict>
	    <key>position</key>	    <integer>433</integer>
	    <key>width</key>	    <integer>6</integer>
	  </dict>
	  <dict>
	    <key>position</key>	    <integer>447</integer>
	    <key>width</key>	    <integer>63</integer>
	  </dict>
	  <dict>
	    <key>position</key>	    <integer>480</integer>
	    <key>width</key>	    <integer>20</integer>
	  </dict>
	</array>
	<key>vhints</key>
	<array>
	  <dict>
	    <key>position</key>
	    <integer>96</integer>
	    <key>width</key>
	    <integer>135</integer>
	  </dict>
	  <dict>
	    <key>position</key>
	    <integer>418</integer>
	    <key>width</key>
	    <integer>152</integer>
	  </dict>
	</array>
      </dict>
    </dict>
  </lib>
</glyph>
