<?xml version="1.0" standalone="yes"?>
<svg width="557" height="1001">
<path style="stroke:#020202; fill:none;" d="M85 351L85 388C85 394.552 84.8141 400.521 91.0046 404.574C95.2568 407.358 99.3875 403.383 103 401.204C112.81 395.285 123.279 390.42 134 386.424C155.618 378.368 175.113 369.547 198 364.116C205.717 362.284 215.017 358.831 223 359.529C236.903 360.743 248.949 369.6 260 377.279C265.727 381.259 277.59 384.908 280.937 391.185C284.124 397.163 281 410.233 281 417C281 439.983 278.931 463.032 279.455 486C281.54 577.324 280 669.576 280 761M282 390C302.762 377.293 323.871 370.563 348 368.911C372.095 367.26 403.647 352.258 426 364.771C461.074 384.405 469.113 436.318 470.015 473C472.361 568.53 471 664.374 471 760M93 407C87.957 524.451 83.9463 642.297 89 760"/>
</svg>
