<?xml version="1.0" standalone="yes"?>
<svg width="371" height="1001">
<path style="fill:#020202; stroke:none;" d="M109 254C126.994 250.804 144.632 246.877 161.002 238.444C212.021 212.164 250.519 158.61 286 115C264.584 115.607 242.932 116.734 223.005 125.411C171.049 148.032 137.812 208.094 109 254M44 313C44 392.965 45.2738 473.05 43.7397 553C42.733 605.462 35.2868 660.49 48.5331 712C62.3563 765.753 112.518 817.23 172 801.472C201.994 793.526 225.576 771.23 248 751L248 801L322 801L322 313L239 313C239.08 417.082 249.225 522.229 237.57 626C233.963 658.114 222.741 719.269 179.055 717.423C136.129 715.609 129.9 656.953 127.977 625C121.735 521.298 127 416.814 127 313L44 313z"/>
</svg>
