<?xml version="1.0" standalone="yes"?>
<svg width="371" height="1001">
<path style="fill:#020202; stroke:none;" d="M94 140L94 243L166 243L166 140L94 140M227 140L227 243L299 243L299 140L227 140M66 390C118.913 377.694 182.403 363.799 219.398 415.628C225.361 423.982 229.901 433.273 233.106 443.014C239.254 461.696 240.537 481.52 242 501C216.239 488.161 189.384 476.126 160 476.472C112.218 477.035 71.0185 510.189 49.1826 551.011C20.9611 603.772 20.253 673.275 46.3674 726.996C71.5707 778.843 129.842 819.848 188 796.064C212.358 786.104 232.386 768.044 252 751L252 801L325 801C325 712.374 323.563 623.61 325.289 535C326.312 482.49 333.382 423.935 306.786 376.065C277.453 323.27 217.478 302.678 160 303.417C130.877 303.791 100.368 310.398 82.0857 335.155C70.2068 351.24 67.6108 370.634 66 390z"/>
<path style="fill:#ffffff; stroke:none;" d="M174.027 559.179C115.712 561.604 108.231 645.847 132.394 684.382C142.773 700.934 160.572 714.919 180.978 714.056C202.105 713.162 219.224 697.035 227.903 678.748C247.322 637.833 231.785 556.778 174.027 559.179z"/>
</svg>
