<?xml version="1.0" standalone="yes"?>
<svg width="279" height="1001">
<path style="fill:#020202; stroke:none;" d="M125 92.128C109.743 94.1499 95.14 99.6799 82.215 108.01C48.2234 129.917 27.5882 168.518 29.3792 209C32.1141 270.815 89.3297 324.017 152 315.572C167.268 313.515 181.917 307.922 194.827 299.541C261.18 256.463 264.859 159.965 201.606 112.421C190.944 104.406 178.889 98.2539 165.999 94.7554C152.703 91.147 138.648 90.3192 125 92.128z"/>
<path style="fill:#ffffff; stroke:none;" d="M132.088 152.092C106.684 156.309 87.5845 181.597 88.8286 206.984C90.1922 234.81 116.068 261.004 144.896 256.406C170.894 252.258 190.293 225.888 188.459 200.022C186.504 172.46 160.499 147.377 132.088 152.092z"/>
</svg>
