<?xml version="1.0" standalone="yes"?>
<svg width="371" height="1001">
<path style="stroke:#010101; fill:none;" d="M85 351L85 389C85.0004 395.446 85.3552 401.904 92.0008 405.263C95.8361 407.201 99.8538 403.474 103 401.604C111.536 396.53 120.766 391.862 130 388.204C165.875 373.992 215.611 341.395 250.91 373.439C255.649 377.74 260.462 383.53 263.788 389C288.919 430.337 286 481.683 286 528L286 760M93 407L89.0147 476L89 760"/>
</svg>
