<?xml version="1.0" standalone="yes"?>
<svg width="260" height="1001">
<path style="fill:#020202; stroke:none;" d="M64.8084 111.554C44.4933 117.057 48.1639 142.898 52.8052 158.015C66.1953 201.627 90.0391 241.475 104.067 285C156.37 447.277 148.507 630.561 80.5954 787C69.7952 811.879 53.0107 838.926 52.5076 866.763C52.2402 881.557 60.4713 897.542 77.4955 895.316C94.5762 893.083 107.84 876.915 117.086 863.755C139.889 831.299 153.41 792.334 165.881 755C217.176 601.446 222.01 433.832 173.102 279C158.317 232.193 141.461 182.782 113.122 142.232C103.091 127.88 85.02 106.08 64.8084 111.554z"/>
</svg>
