<?xml version="1.0" encoding="UTF-8" standalone="no"?>
<svg
   xmlns:dc="http://purl.org/dc/elements/1.1/"
   xmlns:cc="http://creativecommons.org/ns#"
   xmlns:rdf="http://www.w3.org/1999/02/22-rdf-syntax-ns#"
   xmlns:svg="http://www.w3.org/2000/svg"
   xmlns="http://www.w3.org/2000/svg"
   xmlns:sodipodi="http://sodipodi.sourceforge.net/DTD/sodipodi-0.dtd"
   xmlns:inkscape="http://www.inkscape.org/namespaces/inkscape"
   width="371"
   height="1001"
   id="svg2"
   version="1.1"
   inkscape:version="0.48.4 r9939"
   sodipodi:docname="adieresis.svg">
  <metadata
     id="metadata10">
    <rdf:RDF>
      <cc:Work
         rdf:about="">
        <dc:format>image/svg+xml</dc:format>
        <dc:type
           rdf:resource="http://purl.org/dc/dcmitype/StillImage" />
      </cc:Work>
    </rdf:RDF>
  </metadata>
  <defs
     id="defs8" />
  <sodipodi:namedview
     pagecolor="#ffffff"
     bordercolor="#666666"
     borderopacity="1"
     objecttolerance="10"
     gridtolerance="10"
     guidetolerance="10"
     inkscape:pageopacity="0"
     inkscape:pageshadow="2"
     inkscape:window-width="484"
     inkscape:window-height="441"
     id="namedview6"
     showgrid="false"
     inkscape:zoom="0.23576424"
     inkscape:cx="185.5"
     inkscape:cy="500.5"
     inkscape:window-x="0"
     inkscape:window-y="20"
     inkscape:window-maximized="0"
     inkscape:current-layer="svg2" />
  <path
     style="font-size:medium;font-style:normal;font-variant:normal;font-weight:normal;font-stretch:normal;text-indent:0;text-align:start;text-decoration:none;line-height:normal;letter-spacing:normal;word-spacing:normal;text-transform:none;direction:ltr;block-progression:tb;writing-mode:lr-tb;text-anchor:start;baseline-shift:baseline;color:#000000;fill:#020202;fill-opacity:1;stroke:none;stroke-width:1;marker:none;visibility:visible;display:inline;overflow:visible;enable-background:accumulate;font-family:Sans;-inkscape-font-specification:Sans"
     d="M 129.5 177 L 129.5 207 L 130.5 207 L 130.5 177 L 129.5 177 z M 262.5 177 L 262.5 207 L 263.5 207 L 263.5 177 L 262.5 177 z M 163.59375 344.03125 C 162.43832 344.04061 161.28326 344.05342 160.125 344.09375 C 127.69367 345.22307 95.172205 358.14029 71.65625 381.65625 L 72.34375 382.34375 C 98.994372 355.69313 137.36636 342.74805 173.90625 345.3125 C 210.44614 347.87695 245.14031 365.94211 264.53125 401.25 C 281.40651 431.9779 282.502 467.92664 282.5 502 C 282.499 514.28321 284.20678 527.95519 282.34375 539.9375 C 282.00013 542.1483 280.71097 543.89443 279.375 545.71875 C 278.03903 547.54307 276.67531 549.42755 276.40625 551.9375 C 275.43075 561.05162 278.49264 572.1209 279.34375 581.0625 C 280.61805 594.44764 279.5 608.4666 279.5 622 L 279.5 679 C 279.5 686.83448 281.24765 697.60845 277.96875 704.59375 C 276.04871 708.6846 269.84346 711.60666 265.75 713.78125 C 254.48311 719.76688 242.89694 723.86996 230.84375 728 C 222.89018 730.7265 216.39545 736.80139 208.8125 739.96875 C 192.78189 746.66356 175.99117 751.80285 159.6875 752.34375 C 143.38383 752.88465 127.56612 748.84431 113.3125 737.15625 C 93.222309 720.68174 83.286922 697.27336 79.5 672.15625 C 75.713078 647.03914 78.090913 620.22094 82.6875 597.09375 C 87.99451 570.39234 102.37194 542.44326 128.21875 530.625 C 155.92674 517.95557 182.40269 525.06548 210.90625 531.125 C 224.48663 534.01173 237.69017 535.2453 250.84375 539.8125 C 259.33352 542.76038 267.14668 547.76973 275.84375 550.46875 L 276.15625 549.53125 C 267.63332 546.88627 259.79648 541.87512 251.15625 538.875 C 237.85983 534.2582 224.60137 533.02752 211.09375 530.15625 C 182.62331 524.10377 155.83726 516.89018 127.78125 529.71875 C 101.52006 541.72649 87.06694 569.99766 81.71875 596.90625 C 77.106337 620.11306 74.688197 646.99911 78.5 672.28125 C 82.311803 697.56339 92.363191 721.27101 112.6875 737.9375 C 127.13488 749.78444 143.22817 753.89085 159.71875 753.34375 C 176.20933 752.79665 193.09611 747.59519 209.1875 740.875 C 216.99855 737.61236 223.47982 731.569 231.15625 728.9375 C 243.21506 724.80554 254.89889 720.68662 266.25 714.65625 C 270.28854 712.51084 276.69104 709.6844 278.875 705.03125 C 282.3761 697.57255 280.5 686.67752 280.5 679 L 280.5 622 C 280.5 608.5214 281.5982 594.44236 280.3125 580.9375 C 279.44761 571.8511 276.46375 560.86838 277.40625 552.0625 C 277.64219 549.86145 278.85547 548.13143 280.1875 546.3125 C 281.51953 544.49357 282.95437 542.5677 283.34375 540.0625 C 285.23872 527.87481 283.499 514.18879 283.5 502 C 283.502 467.90536 282.43099 431.7501 265.40625 400.75 C 245.84219 365.12689 210.79161 346.92805 173.96875 344.34375 C 170.5166 344.10147 167.06003 344.00316 163.59375 344.03125 z M 279.34375 706.65625 L 278.65625 707.34375 C 285.68842 714.38132 287.91625 723.94258 288.375 734.1875 C 288.83375 744.43242 287.5 755.32804 287.5 765 L 288.5 765 C 288.5 755.41996 289.839 744.48708 289.375 734.125 C 288.911 723.76292 286.62058 713.93868 279.34375 706.65625 z "
     id="path4" />
</svg>
