<?xml version="1.0" standalone="yes"?>
<svg width="216" height="1001">
<path style="stroke:#010101; fill:none;" d="M12 120C29.2321 131.789 47.8147 139.395 64 153.286C102.286 186.143 133.58 226.329 177 253M122 355L122 760"/>
</svg>
