<?xml version="1.0" standalone="yes"?>
<svg width="601" height="1001">
<path style="fill:#020202; stroke:none;" d="M16 313C20.0153 327.345 24.6634 341.272 33.239 353.625C60.8747 393.434 112.183 406.107 155 422.567C266.909 465.587 376.978 513.279 489 556L489 558C376.376 598.724 266.585 646.874 155 690.29C112.363 706.879 61.0657 719.717 33.5626 759.44C24.8137 772.076 20.0825 786.333 16 801C157.041 751.258 293.581 689.808 433 635.867C465.988 623.104 502.123 613.09 531.62 593.023C544.178 584.479 558.385 571.603 558.146 555.077C557.909 538.667 543.453 526.579 530.687 518.602C500.583 499.791 464.893 489.651 432 476.854C293.141 422.83 157.017 361.381 16 313z"/>
</svg>
