<?xml version="1.0" standalone="yes"?>
<svg width="445" height="1001">
<path style="fill:#020202; stroke:none;" d="M113 224C139.461 207.138 168.274 184.626 200.999 183.645C240.798 182.453 273.375 218.591 279.037 256.001C282.595 279.504 277.241 303.566 270.453 326C254.422 378.99 227.729 428.198 202.091 477C145.709 584.326 78.1972 688.314 33 801C91.3304 801 149.671 800.687 208 801.055C261.941 801.395 327.916 814.694 364.652 764.413C373.835 751.844 379.598 737.482 385 723L168 723C209.473 657.488 247.279 589.659 285.104 522C321.638 456.65 359.372 389.333 373.722 315C389.003 235.847 366.849 144.149 289.991 104.894C241.996 80.3813 178.918 81.8378 132.095 108.622C109.78 121.387 87.4835 143.224 89.4866 171.003C90.9001 190.605 102.747 207.926 113 224z"/>
</svg>
