<?xml version="1.0" standalone="yes"?>
<svg width="371" height="1001">
<path style="fill:#020202; stroke:none;" d="M45 242C76.1888 229.932 107.866 209.526 142 208.204C187.137 206.454 231.698 241.233 275.78 218.047C282.888 214.308 289.372 209.435 295.131 203.85C302.371 196.828 308.457 188.672 313.396 179.89C320.447 167.351 324.845 153.704 329 140C298.12 152.06 266.897 172.747 233 173.921C189.004 175.445 146.499 141.804 103.117 162.807C95.4973 166.496 88.5463 171.479 82.3369 177.213C74.4828 184.467 67.7949 192.938 62.29 202.091C54.7671 214.6 49.7742 228.27 45 242M177 306.847C121.066 310.576 76.7722 355.344 54.4631 404C27.4202 462.979 25.2065 531.287 29.6308 595C32.2526 632.755 37.808 671.079 53.0822 706C77.124 760.966 130.327 811.334 194 807.093C249.886 803.371 293.976 758.536 316.247 710C343.61 650.369 345.904 581.41 341.16 517C338.431 479.962 332.945 442.334 318.137 408C294.305 352.745 240.704 302.601 177 306.847z"/>
<path style="fill:#ffffff; stroke:none;" d="M182.028 394.438C152.082 397.48 134.294 429.078 126.817 455.003C118.988 482.144 117.849 510.937 116.93 539C115.68 577.191 115.653 616.777 125.406 653.999C132.907 682.63 153.498 722.967 188.95 719.515C218.872 716.602 236.519 684.82 243.943 658.997C252.376 629.66 253.329 598.326 253.949 568C254.684 532.054 254.76 495.025 245.595 460.002C238.08 431.283 217.661 390.818 182.028 394.438z"/>
</svg>
