<?xml version="1.0" standalone="yes"?>
<svg width="482" height="1001">
<path style="stroke:#020202; fill:none;" d="M461 331C422.106 369.919 415.757 427.372 406.386 479C397.214 529.53 384.045 579.377 375.25 630C372.81 644.042 369.671 657.928 367.41 672C366.294 678.952 365.994 688.789 362.062 694.816C359.437 698.84 354.003 701.199 350 703.6C344.658 706.806 335.462 714.294 329 711.623C322.677 709.011 312.599 703.528 308.589 697.907C301.532 688.016 301.486 665.934 299.728 654C292.945 607.95 284.915 561.919 277.247 516C275.083 503.039 275.391 482.453 269.012 471.015C266.135 465.857 259.684 462.346 255 459C251.767 456.691 247.175 451.731 243 451.582C238.296 451.414 232.533 457.724 229 460.373C224.183 463.986 217.032 467.697 213.988 473.039C208.236 483.138 208.766 503.365 207.13 515C201.201 557.186 194.458 599.121 186.611 641C184.325 653.204 184.056 671.13 177.86 681.96C173.682 689.265 158.827 697.334 151 700.096C144.365 702.437 136.318 695.677 131 692.319C111.791 680.187 111.833 642.124 107.6 621C96.3462 564.83 84.5245 508.546 75.4383 452C69.2836 413.698 61.9118 368.184 34 339M243 376L243 450M148 702L148 726M332 714L332 735"/>
</svg>
