<?xml version="1.0" encoding="UTF-8"?>
<glyph name="dollar" format="1">
  <advance width="611"/>
  <unicode hex="0024"/>
  <outline>
    <contour>
      <point x="281" y="798" type="line"/>
      <point x="186" y="793"/>
      <point x="180" y="714"/>
      <point x="180" y="676" type="curve" smooth="yes"/>
      <point x="180" y="607"/>
      <point x="223" y="567"/>
      <point x="281" y="534" type="curve"/>
    </contour>
    <contour>
      <point x="331" y="508" type="line"/>
      <point x="444" y="454"/>
      <point x="578" y="404"/>
      <point x="578" y="238" type="curve" smooth="yes"/>
      <point x="578" y="105"/>
      <point x="482" y="-8"/>
      <point x="331" y="-15" type="curve"/>
      <point x="331" y="-82" type="line"/>
      <point x="282" y="-82" type="line"/>
      <point x="282" y="-12" type="line"/>
      <point x="210" y="-1"/>
      <point x="128" y="38"/>
      <point x="102" y="38" type="curve" smooth="yes"/>
      <point x="89" y="38"/>
      <point x="72" y="25"/>
      <point x="72" y="-1" type="curve"/>
      <point x="57" y="-1" type="line"/>
      <point x="59" y="101"/>
      <point x="60" y="203"/>
      <point x="62" y="305" type="curve"/>
      <point x="75" y="305" type="line"/>
      <point x="104" y="180"/>
      <point x="196" y="41"/>
      <point x="282" y="10" type="curve"/>
      <point x="282" y="322" type="line"/>
      <point x="174" y="377"/>
      <point x="50" y="426"/>
      <point x="50" y="560" type="curve" smooth="yes"/>
      <point x="50" y="697"/>
      <point x="148" y="807"/>
      <point x="281" y="815" type="curve"/>
      <point x="281" y="897" type="line"/>
      <point x="332" y="897" type="line"/>
      <point x="332" y="813" type="line"/>
      <point x="410" y="802"/>
      <point x="436" y="757"/>
      <point x="471" y="757" type="curve" smooth="yes"/>
      <point x="503" y="757"/>
      <point x="504" y="805"/>
      <point x="504" y="805" type="curve"/>
      <point x="513" y="805" type="line"/>
      <point x="531" y="541" type="line"/>
      <point x="518" y="541" type="line"/>
      <point x="518" y="581"/>
      <point x="421" y="745"/>
      <point x="331" y="788" type="curve"/>
    </contour>
    <contour>
      <point x="57" y="-1" type="line"/>
    </contour>
    <contour>
      <point x="331" y="4" type="line"/>
      <point x="416" y="10"/>
      <point x="441" y="72"/>
      <point x="441" y="136" type="curve" smooth="yes"/>
      <point x="441" y="212"/>
      <point x="393" y="257"/>
      <point x="331" y="295" type="curve"/>
    </contour>
  </outline>
  <lib>
    <dict>
      <key>com.fontlab.hintData</key>
      <dict>
	<key>hhints</key>
	<array>
	  <dict>
	    <key>position</key>	    <integer>-15</integer>
	    <key>width</key>	    <integer>19</integer>
	  </dict>
	  <dict>
	    <key>position</key>	    <integer>-1</integer>
	    <key>width</key>	    <integer>21</integer>
	  </dict>
	  <dict>
	    <key>position</key>	    <integer>785</integer>
	    <key>width</key>	    <integer>20</integer>
	  </dict>
	  <dict>
	    <key>position</key>	    <integer>798</integer>
	    <key>width</key>	    <integer>17</integer>
	  </dict>
	</array>
	<key>vhints</key>
	<array>
	  <dict>
	    <key>position</key>
	    <integer>50</integer>
	    <key>width</key>
	    <integer>130</integer>
	  </dict>
	  <dict>
	    <key>position</key>
	    <integer>57</integer>
	    <key>width</key>
	    <integer>15</integer>
	  </dict>
	  <dict>
	    <key>position</key>
	    <integer>282</integer>
	    <key>width</key>
	    <integer>49</integer>
	  </dict>
	  <dict>
	    <key>position</key>
	    <integer>441</integer>
	    <key>width</key>
	    <integer>137</integer>
	  </dict>
	  <dict>
	    <key>position</key>
	    <integer>504</integer>
	    <key>width</key>
	    <integer>9</integer>
	  </dict>
	  <dict>
	    <key>position</key>
	    <integer>518</integer>
	    <key>width</key>
	    <integer>13</integer>
	  </dict>
	</array>
      </dict>
    </dict>
  </lib>
</glyph>
