<?xml version="1.0" encoding="UTF-8"?>
<glyph name="two" format="1">
  <advance width="633"/>
  <unicode hex="0032"/>
  <outline>
    <contour>
      <point x="576" y="244" type="line"/>
      <point x="539" y="0" type="line"/>
      <point x="73" y="0" type="line"/>
      <point x="55" y="0" type="line"/>
      <point x="54" y="0" type="line"/>
      <point x="54" y="287"/>
      <point x="404" y="343"/>
      <point x="404" y="548" type="curve" smooth="yes"/>
      <point x="404" y="608"/>
      <point x="372" y="688"/>
      <point x="272" y="688" type="curve" smooth="yes"/>
      <point x="200" y="688"/>
      <point x="120" y="630"/>
      <point x="64" y="548" type="curve"/>
      <point x="50" y="548" type="line"/>
      <point x="102" y="735"/>
      <point x="247" y="815"/>
      <point x="344" y="815" type="curve" smooth="yes"/>
      <point x="486" y="815"/>
      <point x="584" y="714"/>
      <point x="584" y="580" type="curve" smooth="yes"/>
      <point x="584" y="333"/>
      <point x="246" y="326"/>
      <point x="120" y="152" type="curve"/>
      <point x="491" y="152" type="line" smooth="yes"/>
      <point x="555" y="152"/>
      <point x="568" y="244"/>
      <point x="568" y="244" type="curve"/>
    </contour>
  </outline>
  <lib>
    <dict>
      <key>com.fontlab.hintData</key>
      <dict>
	<key>hhints</key>
	<array>
	  <dict>
	    <key>position</key>	    <integer>0</integer>
	    <key>width</key>	    <integer>152</integer>
	  </dict>
	  <dict>
	    <key>position</key>	    <integer>688</integer>
	    <key>width</key>	    <integer>127</integer>
	  </dict>
	</array>
	<key>vhints</key>
	<array>
	  <dict>
	    <key>position</key>
	    <integer>404</integer>
	    <key>width</key>
	    <integer>180</integer>
	  </dict>
	  <dict>
	    <key>position</key>
	    <integer>568</integer>
	    <key>width</key>
	    <integer>8</integer>
	  </dict>
	</array>
      </dict>
    </dict>
  </lib>
</glyph>
