<?xml version="1.0" standalone="yes"?>
<svg width="371" height="1001">
<path style="stroke:#010101; fill:none;" d="M328 144C306.348 165.666 286.426 189.643 255 196.576C215.007 205.399 175.035 181.348 135 184.089C96.6237 186.717 70.5493 214.959 47 242M85 351L85 389C85.0004 395.446 85.3552 401.904 92.0008 405.263C95.8361 407.201 99.8538 403.474 103 401.604C111.536 396.53 120.766 391.862 130 388.204C166.627 373.693 213.312 341.455 249.985 372.464C255.215 376.885 260.2 383.22 263.868 389C288.822 428.319 286 479.587 286 524L286 760M93 407L89.0147 476L89 760"/>
</svg>
