<?xml version="1.0" standalone="yes"?>
<svg width="408" height="1001">
<path style="fill:#020202; stroke:none;" d="M225 706C202.474 675.761 178.35 646.667 156.411 616C143.204 597.54 129.305 576.567 129.272 553C129.239 529.469 143.039 508.48 156.163 490C178.178 459 202.446 429.614 225 399C206.974 400.362 188.985 402.245 171.999 408.841C136.348 422.687 110.092 453.471 87.3772 483.005C71.8815 503.153 54.6112 526.396 54.6437 553C54.6756 579.25 71.5414 602.137 86.8967 621.996C109.744 651.543 136.273 682.311 171.998 696.163C188.988 702.751 206.973 704.638 225 706M373 706C350.902 676.084 327.321 647.237 305.669 617C292.238 598.243 278 576.967 277.968 553C277.935 529.08 292.02 507.778 305.357 489C327.082 458.413 350.801 429.248 373 399C355.321 400.337 337.678 402.164 320.997 408.57C285.709 422.123 258.88 452.548 236.664 482.003C221.169 502.548 205.173 526.241 205.245 553C205.317 579.774 221.407 603.479 236.984 623.992C259.216 653.269 285.812 683.01 320.998 696.411C337.69 702.768 355.328 704.617 373 706z"/>
</svg>
