<?xml version="1.0" standalone="no"?>
<!DOCTYPE svg PUBLIC "-//W3C//DTD SVG 1.1//EN" "http://www.w3.org/Graphics/SVG/1.1/DTD/svg11.dtd" >
<svg viewBox="0 -205 1024 1024">
  <g transform="matrix(1 0 0 -1 0 819)">
   <path fill="currentColor"
d="M40 6l-4 14l12 48l22 38l6 -2v-14l10 -4h206l20 6l14 14l4 -4l-14 -90l-6 -6h-270zM214 480l62 -18l40 -36l20 -40l4 -64l-14 -38l-16 -22l-42 -36l-118 -62l-70 -50l6 14l134 128l20 40l4 42l-18 48l-20 18l-20 8l-40 2l-32 -10l-32 -20l-38 -38l-2 8l14 28l46 56l52 32
z" />
  </g>

</svg>
