<?xml version="1.0" standalone="yes"?>
<svg width="445" height="1001">
<path style="fill:#010101; stroke:none;" d="M208 272.368C184.108 274.302 160.816 281.339 140.008 293.278C68.1695 334.497 32.347 425.869 62.0137 504C73.0085 532.956 92.3479 558.358 116.218 577.953C132.175 591.052 150.348 601.392 170 607.801C191.163 614.703 213.825 617.209 236 615.421C257.97 613.649 279.505 607.549 298.995 597.224C373.884 557.552 412.089 464.02 382.245 384C371.935 356.354 353.856 331.905 331.566 312.707C316.041 299.335 298.286 288.568 279 281.576C256.373 273.373 231.961 270.428 208 272.368z"/>
</svg>
