















'########::'########:'##::::'##::'#######::'##::::'##:'########:
 ##.... ##: ##.....:: ###::'###:'##.... ##: ##:::: ##: ##.....::
 ##:::: ##: ##::::::: ####'####: ##:::: ##: ##:::: ##: ##:::::::
 ########:: ######::: ## ### ##: ##:::: ##: ##:::: ##: ######:::
 ##.. ##::: ##...:::: ##. #: ##: ##:::: ##:. ##:: ##:: ##...::::
 ##::. ##:: ##::::::: ##:.:: ##: ##:::: ##::. ## ##::: ##:::::::
 ##:::. ##: ########: ##:::: ##:. #######::::. ###:::: ########:
..:::::..::........::..:::::..:::.......::::::...:::::........::
:::::::::::::::'###::::
::::::::::::::'## ##:::
:::::::::::::'##:. ##::
::::::::::::'##:::. ##:
:::::::::::: #########:
:::::::::::: ##.... ##:
:::::::::::: ##:::: ##:
::::::::::::..:::::..::
:::'########:::::'###::::'########:::::'###:::::'######::'####:'########:'########::::::::::
::: ##.... ##:::'## ##::: ##.... ##:::'## ##:::'##... ##:. ##::... ##..:: ##.....:::::::::::
::: ##:::: ##::'##:. ##:: ##:::: ##::'##:. ##:: ##:::..::: ##::::: ##:::: ##::::::::::::::::
::: ########::'##:::. ##: ########::'##:::. ##:. ######::: ##::::: ##:::: ######::::::::::::
::: ##.....::: #########: ##.. ##::: #########::..... ##:: ##::::: ##:::: ##...:::::::::::::
::: ##:::::::: ##.... ##: ##::. ##:: ##.... ##:'##::: ##:: ##::::: ##:::: ##::::::::::::::::
::: ##:::::::: ##:::: ##: ##:::. ##: ##:::: ##:. ######::'####:::: ##:::: ########::::::::::
:::..:::::::::..:::::..::..:::::..::..:::::..:::......:::....:::::..:::::........:::::::::::
:::::::::::::::::::::'##:::::::'####:'##::: ##:'########::::
::::::::::::::::::::: ##:::::::. ##:: ###:: ##: ##.....:::::
::::::::::::::::::::: ##:::::::: ##:: ####: ##: ##::::::::::
::::::::::::::::::::: ##:::::::: ##:: ## ## ##: ######::::::
::::::::::::::::::::: ##:::::::: ##:: ##. ####: ##...:::::::
::::::::::::::::::::: ##:::::::: ##:: ##:. ###: ##::::::::::
::::::::::::::::::::: ########:'####: ##::. ##: ########::::
:::::::::::::::::::::........::....::..::::..::........:::::
:'#######::'##::: ##::::::::::'######::'##::::'##::'######:::
'##.... ##: ###:: ##:::::::::'##... ##: ##:::: ##:'##... ##::      W I T H   B A S H   F U N C T I O N :   S E D
 ##:::: ##: ####: ##::::::::: ##:::..:: ##:::: ##: ##:::..:::
 ##:::: ##: ## ## ##:::::::::. ######:: ##:::: ##: ##::'####:
 ##:::: ##: ##. ####::::::::::..... ##:. ##:: ##:: ##::: ##::
 ##:::: ##: ##:. ###::::'###:'##::: ##::. ## ##::: ##::: ##::
. #######:: ##::. ##:::: ###:. ######::::. ###::::. ######:::
:.......:::..::::..:::::...:::......::::::...::::::......::::










.
