<?xml version="1.0" encoding="UTF-8"?>
<glyph name="u" format="1">
  <advance width="587"/>
  <unicode hex="0075"/>
  <outline>
    <contour>
      <point x="378" y="0" type="line"/>
      <point x="379" y="440" type="line" smooth="yes"/>
      <point x="379,062" y="467,019"/>
      <point x="355" y="481"/>
      <point x="334" y="487" type="curve" smooth="yes"/>
      <point x="319" y="491" type="line"/>
      <point x="319" y="499" type="line"/>
      <point x="401" y="489"/>
      <point x="485" y="489"/>
      <point x="573" y="499" type="curve"/>
      <point x="573" y="497"/>
      <point x="573" y="494"/>
      <point x="574" y="491" type="curve"/>
      <point x="559" y="487" type="line" smooth="yes"/>
      <point x="541" y="483"/>
      <point x="514" y="467"/>
      <point x="514" y="445" type="curve" smooth="yes"/>
      <point x="514" y="109" type="line" smooth="yes"/>
      <point x="514" y="95"/>
      <point x="521" y="81"/>
      <point x="531" y="70" type="curve" smooth="yes"/>
      <point x="541" y="60"/>
      <point x="551" y="52"/>
      <point x="561" y="48" type="curve" smooth="yes"/>
      <point x="571" y="44"/>
      <point x="576" y="43"/>
      <point x="576" y="45" type="curve"/>
      <point x="577" y="43"/>
      <point x="577" y="42"/>
      <point x="577" y="41" type="curve" smooth="yes"/>
      <point x="577" y="40"/>
      <point x="577" y="39"/>
      <point x="576" y="38" type="curve" smooth="yes"/>
      <point x="576" y="37"/>
      <point x="575" y="36"/>
      <point x="575" y="36" type="curve"/>
      <point x="554" y="38"/>
      <point x="521" y="34"/>
      <point x="476" y="24" type="curve" smooth="yes"/>
      <point x="432" y="14"/>
      <point x="401" y="4"/>
      <point x="385" y="-4" type="curve"/>
    </contour>
    <contour>
      <point x="70" y="136" type="curve" smooth="yes"/>
      <point x="69" y="440" type="line"/>
      <point x="70" y="453"/>
      <point x="65" y="463"/>
      <point x="55" y="472" type="curve"/>
      <point x="45" y="479"/>
      <point x="35" y="484"/>
      <point x="25" y="487" type="curve" smooth="yes"/>
      <point x="10" y="491" type="line"/>
      <point x="10" y="499" type="line"/>
      <point x="91" y="489"/>
      <point x="176" y="489"/>
      <point x="264" y="499" type="curve"/>
      <point x="264" y="491" type="line"/>
      <point x="249" y="487" type="line" smooth="yes"/>
      <point x="239" y="485"/>
      <point x="229" y="479"/>
      <point x="219" y="472" type="curve" smooth="yes"/>
      <point x="209" y="464"/>
      <point x="204" y="455"/>
      <point x="204" y="445" type="curve" smooth="yes"/>
      <point x="204" y="185" type="line" smooth="yes"/>
      <point x="204" y="-73"/>
      <point x="398" y="127"/>
      <point x="398" y="127" type="curve"/>
      <point x="398" y="91" type="line"/>
      <point x="156" y="-95"/>
      <point x="70" y="8"/>
    </contour>
  </outline>
  <lib>
    <dict>
      <key>com.fontlab.hintData</key>
      <dict>
	<key>hhints</key>
	<array>
	  <dict>
	    <key>position</key>	    <integer>36</integer>
	    <key>width</key>	    <integer>12</integer>
	  </dict>
	  <dict>
	    <key>position</key>	    <integer>491</integer>
	    <key>width</key>	    <integer>8</integer>
	  </dict>
	</array>
	<key>vhints</key>
	<array>
	  <dict>
	    <key>position</key>
	    <integer>70</integer>
	    <key>width</key>
	    <integer>134</integer>
	  </dict>
	  <dict>
	    <key>position</key>
	    <integer>378</integer>
	    <key>width</key>
	    <integer>136</integer>
	  </dict>
	  <dict>
	    <key>position</key>
	    <integer>576</integer>
	    <key>width</key>
	    <integer>1</integer>
	  </dict>
	</array>
      </dict>
    </dict>
  </lib>
</glyph>
