<?xml version="1.0" standalone="yes"?>
<svg width="187" height="1001">
<path style="fill:#020202; stroke:none;" d="M30 309C44.6557 304.95 58.9543 300.312 71.7722 291.901C107.085 268.727 123.898 227.614 141.491 191C156.64 159.473 171.89 128.011 186 96C158.322 94.5223 127.451 91.6196 102.592 106.449C77.1071 121.652 67.5695 149.839 60.5093 177C49.1559 220.677 39.1609 264.815 30 309z"/>
</svg>
