<?xml version="1.0" standalone="yes"?>
<svg width="445" height="1001">
<path style="stroke:#020202; fill:none;" d="M240 157C201.24 195.439 187.729 247.204 178.92 300C177.302 309.697 175.697 319.396 173.576 329C172.751 332.735 170.082 338.224 171.353 342C173.114 347.231 181.417 354.503 186 357.397C193.569 362.175 210.225 359 219 359C240.178 359 261.116 358.302 282 354.389C294.612 352.026 307.342 346.105 320 345C319.88 388.452 308.47 430.162 304.171 473C302.872 485.939 303.885 500.367 300.683 513C299.717 516.811 296.409 519.354 295.029 523C291.929 531.187 292.512 537.275 286 544C281.697 539.697 276.833 532.754 271 530.603C265.85 528.705 258.431 530 253 530L215 530C197.32 530 177.454 532.567 160 529.852C154.343 528.972 148.466 517.679 143.058 519.921C137.431 522.255 138.668 530.382 136.968 535C135.613 538.679 132.387 541.211 131.279 545C127.465 558.039 129.176 573.537 127.829 587C122.682 638.445 107.898 691.729 70 728M400 157C390.645 166.348 380.591 174.948 373.093 186C351.325 218.085 340.227 260.906 334.87 299C331.829 320.62 321.474 344.82 347 356.958C351.59 359.14 359.203 356.552 364 355.753C378.299 353.371 391.936 349.254 406 346M328 339L320 345M145 518C145.366 473.803 156.651 429.882 160.83 386C161.782 376.001 158.639 347.397 169 343M127 357L163 345M301 516L315 528.802L330 528.155L370 520M68 539L103 532.155L117 531.603L131 544M286 544C285.824 608.073 271.267 681.764 225 728"/>
</svg>
