<?xml version="1.0" standalone="yes"?>
<svg width="445" height="1001">
<path style="fill:#020202; stroke:none;" d="M224 88.4152C117.408 89.7012 28.8993 197.198 61.0643 302C68.9191 327.593 83.4904 349.843 98.0876 372C108.825 388.298 121.294 406.544 119.937 427C118.467 449.143 102.332 467.834 89.8727 485C73.8997 507.008 59.4449 530.095 50.6871 556C19.3019 648.835 63.1968 763.977 158 799.158C178.397 806.728 200.266 810.269 222 810.088C242.015 809.921 262.081 806.605 281 800.041C380.236 765.61 426.52 650.01 396.73 553C388.827 527.264 375.4 504.119 360.295 482C348.191 464.274 332.591 445.302 331.024 423C329.58 402.466 341.282 383.97 351.278 367C363.643 346.01 375.367 324.66 381.781 301C409.867 197.387 333.919 87.0891 224 88.4152z"/>
<path style="fill:#ffffff; stroke:none;" d="M215.008 173.067C153.311 180.95 138.623 255.663 166.809 301.777C179.605 322.711 202.6 343.442 228.949 339.959C247.312 337.531 262.605 324.16 272.821 309.426C302.316 266.886 296.761 191.851 239.914 175.069C231.859 172.691 223.34 172.002 215.008 173.067M215.014 508.919C196.912 512.321 181.724 524.991 170.066 538.635C144.386 568.69 129.233 611.806 139.706 650.995C150.787 692.466 191.382 728.118 235.991 719.928C308.938 706.535 317.602 612.659 289.049 558.052C275.155 531.478 247.999 502.719 215.014 508.919z"/>
</svg>
