<?xml version="1.0" encoding="UTF-8" standalone="no"?>
<svg
   xmlns:dc="http://purl.org/dc/elements/1.1/"
   xmlns:cc="http://creativecommons.org/ns#"
   xmlns:rdf="http://www.w3.org/1999/02/22-rdf-syntax-ns#"
   xmlns:svg="http://www.w3.org/2000/svg"
   xmlns="http://www.w3.org/2000/svg"
   xmlns:sodipodi="http://sodipodi.sourceforge.net/DTD/sodipodi-0.dtd"
   xmlns:inkscape="http://www.inkscape.org/namespaces/inkscape"
   width="371"
   height="1001"
   id="svg2"
   version="1.1"
   inkscape:version="0.48.4 r9939"
   sodipodi:docname="atilde.svg">
  <metadata
     id="metadata10">
    <rdf:RDF>
      <cc:Work
         rdf:about="">
        <dc:format>image/svg+xml</dc:format>
        <dc:type
           rdf:resource="http://purl.org/dc/dcmitype/StillImage" />
      </cc:Work>
    </rdf:RDF>
  </metadata>
  <defs
     id="defs8" />
  <sodipodi:namedview
     pagecolor="#ffffff"
     bordercolor="#666666"
     borderopacity="1"
     objecttolerance="10"
     gridtolerance="10"
     guidetolerance="10"
     inkscape:pageopacity="0"
     inkscape:pageshadow="2"
     inkscape:window-width="640"
     inkscape:window-height="480"
     id="namedview6"
     showgrid="false"
     inkscape:zoom="0.27099337"
     inkscape:cx="185.5"
     inkscape:cy="489.89619"
     inkscape:window-x="0"
     inkscape:window-y="20"
     inkscape:window-maximized="0"
     inkscape:current-layer="svg2" />
  <path
     style="font-size:medium;font-style:normal;font-variant:normal;font-weight:normal;font-stretch:normal;text-indent:0;text-align:start;text-decoration:none;line-height:normal;letter-spacing:normal;word-spacing:normal;text-transform:none;direction:ltr;block-progression:tb;writing-mode:lr-tb;text-anchor:start;baseline-shift:baseline;color:#000000;fill:#020202;fill-opacity:1;stroke:none;stroke-width:1;marker:none;visibility:visible;display:inline;overflow:visible;enable-background:accumulate;font-family:Sans;-inkscape-font-specification:Sans"
     d="M 332.65625 143.65625 C 308.316 168.01252 285.35061 194.70572 248.9375 198.34375 C 228.54622 200.38173 208.0823 194.95042 187.5625 190.1875 C 167.0427 185.42458 146.45987 181.31683 125.875 186.1875 C 93.430869 193.86401 71.858001 219.26916 49.65625 241.65625 L 50.34375 242.34375 C 72.582999 219.91884 94.065531 194.74174 126.125 187.15625 C 146.44213 182.34892 166.8448 186.39817 187.34375 191.15625 C 207.8427 195.91433 228.43078 201.37452 249.0625 199.3125 C 285.91539 195.63053 309.04 168.66348 333.34375 144.34375 L 332.65625 143.65625 z M 163.0625 344 C 161.90943 344.01439 160.74561 344.04967 159.59375 344.09375 C 127.34176 345.32811 95.074325 358.23861 71.65625 381.65625 L 72.34375 382.34375 C 98.884235 355.80376 136.98381 342.87258 173.34375 345.28125 C 209.70369 347.68992 244.29906 365.42547 264.03125 400.25 C 281.49272 431.06764 282.513 467.65981 282.5 502 C 282.495 514.28544 284.20678 527.95325 282.34375 539.9375 C 282.00013 542.1483 280.71097 543.89443 279.375 545.71875 C 278.03903 547.54307 276.67531 549.42755 276.40625 551.9375 C 275.41293 561.21837 278.78373 571.93792 279.40625 581.03125 C 280.35425 594.86045 279.5 609.07236 279.5 623 L 279.5 679 C 279.5 686.83813 281.34039 697.73975 278.03125 704.6875 C 275.99054 708.97328 270.00452 711.48072 265.75 713.78125 C 254.46593 719.88142 242.95797 723.84492 230.84375 728 C 223.20692 730.62003 217.14046 736.56188 209.8125 739.5625 C 193.96461 746.05142 177.52782 751.29883 161.46875 752.1875 C 145.40968 753.07617 129.74681 749.62223 115.3125 738.6875 C 94.198132 722.69293 83.726934 699.03582 79.6875 673.46875 C 75.648066 647.90168 78.044224 620.45587 82.6875 597.09375 C 87.938561 570.67408 101.91833 543.22257 127.21875 531.0625 C 155.04856 517.68615 182.1282 525.00737 210.90625 531.125 C 224.48663 534.01173 237.69017 535.2453 250.84375 539.8125 C 259.32111 542.75615 267.11831 547.94574 275.875 550.46875 L 276.125 549.53125 C 267.56969 547.06626 259.79689 541.87535 251.15625 538.875 C 237.85983 534.2582 224.60137 533.02752 211.09375 530.15625 C 182.3498 524.04588 154.96744 516.6399 126.78125 530.1875 C 101.08167 542.53943 87.010089 570.28392 81.71875 596.90625 C 77.059226 620.35013 74.621309 647.88857 78.6875 673.625 C 82.753691 699.36143 93.321168 723.31457 114.6875 739.5 C 129.31919 750.58427 145.29307 754.08608 161.53125 753.1875 C 177.76943 752.28892 194.29039 747.00908 210.1875 740.5 C 217.76154 737.39862 223.81108 731.45747 231.15625 728.9375 C 243.27003 724.78258 254.87407 720.80608 266.25 714.65625 C 270.41748 712.40278 276.64421 709.94122 278.9375 705.125 C 282.47841 697.6908 280.5 686.67387 280.5 679 L 280.5 623 C 280.5 609.11364 281.3602 594.88555 280.40625 580.96875 C 279.77077 571.68608 276.44757 561.01963 277.40625 552.0625 C 277.64219 549.86145 278.85547 548.13143 280.1875 546.3125 C 281.51953 544.49357 282.95437 542.5677 283.34375 540.0625 C 285.23872 527.87275 283.49502 514.19056 283.5 502 C 283.513 467.64019 282.52678 430.84836 264.90625 399.75 C 244.99844 364.61553 210.04781 346.70858 173.40625 344.28125 C 169.9711 344.05368 166.5217 343.95682 163.0625 344 z M 279.34375 706.65625 L 278.65625 707.34375 C 285.68842 714.38132 287.91625 723.94258 288.375 734.1875 C 288.83375 744.43242 287.5 755.32804 287.5 765 L 288.5 765 C 288.5 755.41996 289.839 744.48708 289.375 734.125 C 288.911 723.76292 286.62058 713.93868 279.34375 706.65625 z "
     id="path4" />
</svg>
