<?xml version="1.0" standalone="yes"?>
<svg width="254" height="1001">
<path style="fill:#010101; stroke:none;" d="M122 378L122 313L48 313L48 801L131 801L131 600C131 558.806 127.196 514.562 140.918 475.002C149.608 449.953 166.103 428.779 187.269 412.973C205.345 399.474 227.367 390.129 240.514 370.993C254.58 350.52 253.407 324.725 253 301C233.402 304.487 214.015 308.582 195.999 317.364C166.946 331.524 144.212 355.109 122 378z"/>
</svg>
