<?xml version="1.0" standalone="yes"?>
<svg width="445" height="1001">
<path style="stroke:#020202; fill:none;" d="M252 442L184 442C175.194 442 163.554 444.806 156.059 439.057C150.047 434.446 151.459 425.723 150.576 419C148.014 399.502 148.547 379.319 144.905 360C134.223 303.338 121.75 242.326 152.096 189C180.059 139.861 254.197 122.359 303 150.337C316.629 158.151 328.236 171.156 337 184M152 436C144.671 443.091 137.629 442 128 442L87 442M167 444C167 501.176 166.034 559.82 154.55 616C151.008 633.33 143.511 649.233 138.439 666C134.094 680.364 131.516 695.431 127.873 710C126.421 715.809 125.966 723.748 122.86 728.895C117.613 737.591 99.3891 741.716 91 747.619C77.2145 757.318 70.4293 770.757 61 784M123 731C137.732 745.682 166.135 744.763 186 748.801C224.878 756.703 270.082 772.081 309 757.467C324.946 751.479 337.572 741.12 351 731"/>
</svg>
