<?xml version="1.0" standalone="yes"?>
<svg width="371" height="1001">
<path style="fill:#020202; stroke:none;" d="M113 254C131.352 250.68 149.339 246.591 166.003 237.905C216.759 211.447 255.351 158.358 291 115C269.225 115.401 247.3 116.26 227.01 125.054C174.856 147.659 141.864 207.97 113 254M66 390C119.103 377.837 181.784 363.891 219.172 415.482C225.243 423.859 229.864 433.192 233.102 443.007C239.265 461.684 240.537 481.522 242 501C216.573 488.251 190.017 476.375 161 476.5C112.449 476.71 70.5679 510.412 48.672 552.01C20.9906 604.599 20.3894 673.617 46.3376 726.996C71.5329 778.826 129.866 819.874 188 796.047C212.342 786.07 232.376 768.023 252 751L252 801L325 801C325 712.372 323.598 623.612 325.271 535C326.269 482.133 333.434 423.141 306.309 375.069C276.788 322.748 217.137 302.691 160 303.415C130.849 303.785 100.403 310.353 82.1068 335.141C70.225 351.239 67.6125 370.62 66 390z"/>
<path style="fill:#ffffff; stroke:none;" d="M174.027 559.167C115.674 561.512 108.247 645.867 132.394 684.383C142.767 700.928 160.586 714.98 180.985 714.192C202.56 713.36 219.947 696.55 228.493 677.796C247.162 636.826 231.306 556.865 174.027 559.167z"/>
</svg>
