<?xml version="1.0" standalone="yes"?>
<svg width="371" height="1001">
<path style="fill:#020202; stroke:none;" d="M177 306.827C121.419 310.491 77.416 354.8 54.9493 403C27.3958 462.114 25.2094 530.995 29.6265 595C32.2323 632.758 37.7665 671.082 53.0611 706C77.1384 760.969 130.321 811.282 194 807.102C249.86 803.435 294.059 758.533 316.287 710C343.739 650.059 345.955 580.714 341.085 516C338.298 478.957 332.701 441.267 317.698 407C293.728 352.251 240.184 302.663 177 306.827z"/>
<path style="fill:#ffffff; stroke:none;" d="M182.034 394.438C152.108 397.48 134.333 429.104 126.863 455.003C119.03 482.158 117.849 510.922 116.913 539C115.639 577.177 115.658 616.794 125.406 653.999C132.904 682.617 153.48 722.967 188.943 719.397C218.788 716.394 236.465 684.792 243.94 658.996C252.522 629.376 253.367 597.632 253.929 567C254.583 531.366 254.681 494.72 245.595 460.002C238.081 431.289 217.663 390.816 182.034 394.438z"/>
</svg>
