<?xml version="1.0" encoding="UTF-8" standalone="no"?>
<svg
   xmlns:dc="http://purl.org/dc/elements/1.1/"
   xmlns:cc="http://creativecommons.org/ns#"
   xmlns:rdf="http://www.w3.org/1999/02/22-rdf-syntax-ns#"
   xmlns:svg="http://www.w3.org/2000/svg"
   xmlns="http://www.w3.org/2000/svg"
   xmlns:sodipodi="http://sodipodi.sourceforge.net/DTD/sodipodi-0.dtd"
   xmlns:inkscape="http://www.inkscape.org/namespaces/inkscape"
   width="445"
   height="1001"
   id="svg2"
   version="1.1"
   inkscape:version="0.48.4 r9939"
   sodipodi:docname="currency.svg">
  <metadata
     id="metadata10">
    <rdf:RDF>
      <cc:Work
         rdf:about="">
        <dc:format>image/svg+xml</dc:format>
        <dc:type
           rdf:resource="http://purl.org/dc/dcmitype/StillImage" />
      </cc:Work>
    </rdf:RDF>
  </metadata>
  <defs
     id="defs8" />
  <sodipodi:namedview
     pagecolor="#ffffff"
     bordercolor="#666666"
     borderopacity="1"
     objecttolerance="10"
     gridtolerance="10"
     guidetolerance="10"
     inkscape:pageopacity="0"
     inkscape:pageshadow="2"
     inkscape:window-width="484"
     inkscape:window-height="441"
     id="namedview6"
     showgrid="false"
     inkscape:zoom="0.23576424"
     inkscape:cx="222.5"
     inkscape:cy="500.5"
     inkscape:window-x="0"
     inkscape:window-y="20"
     inkscape:window-maximized="0"
     inkscape:current-layer="svg2" />
  <path
     style="font-size:medium;font-style:normal;font-variant:normal;font-weight:normal;font-stretch:normal;text-indent:0;text-align:start;text-decoration:none;line-height:normal;letter-spacing:normal;word-spacing:normal;text-transform:none;direction:ltr;block-progression:tb;writing-mode:lr-tb;text-anchor:start;baseline-shift:baseline;color:#000000;fill:#020202;fill-opacity:1;stroke:none;stroke-width:1;marker:none;visibility:visible;display:inline;overflow:visible;enable-background:accumulate;font-family:Sans;-inkscape-font-specification:Sans"
     d="M 255.34375 350.09375 C 241.51628 350.16116 227.66133 351.5 216 351.5 C 203.5692 351.5 190.37673 350.29933 177.9375 351.9375 C 172.405 352.66619 166.13563 352.50785 160.78125 354.96875 C 151.53574 359.21634 145.25159 366.22958 141.0625 374.84375 C 136.87341 383.45792 134.7824 393.6792 133.8125 404.34375 C 131.87269 425.67285 134.5 448.8863 134.5 465 C 134.5 484.10727 131.8899 506.14584 145 522.3125 C 150.25496 528.79283 156.7576 532.10927 163.8125 533.78125 C 170.8674 535.45323 178.47099 535.5 186 535.5 C 219.28817 535.5 254.99789 540.08581 288.0625 535.1875 C 302.02866 533.11806 313.81681 518.83289 317.96875 506.15625 C 321.806 494.44222 320.5 481.95358 320.5 470 L 320.5 411 C 320.5 398.16483 321.25896 384.18292 313.875 372.71875 C 303.92394 357.26887 287.16853 351.96723 269.09375 350.53125 C 264.57505 350.17225 259.95291 350.07128 255.34375 350.09375 z M 255.34375 351.09375 C 259.93074 351.07045 264.51738 351.17515 269 351.53125 C 286.93047 352.95577 303.30031 358.17313 313.03125 373.28125 C 320.19729 384.40708 319.5 398.12717 319.5 411 L 319.5 470 C 319.5 482.02442 320.75075 494.39378 317 505.84375 C 312.95394 518.19711 301.31734 532.23619 287.9375 534.21875 C 255.06611 539.08844 219.37983 534.5 186 534.5 C 178.47601 534.5 170.93335 534.4483 164.03125 532.8125 C 157.12915 531.17673 150.88729 527.98417 145.78125 521.6875 C 132.99335 505.91816 135.5 484.19673 135.5 465 C 135.5 448.7777 132.88606 425.61965 134.8125 404.4375 C 135.77572 393.84643 137.85768 383.73499 141.96875 375.28125 C 146.07982 366.82751 152.19676 360.01991 161.21875 355.875 C 166.28637 353.5459 172.419 353.64956 178.0625 352.90625 C 190.34727 351.28842 203.5048 352.5 216 352.5 C 227.73792 352.5 241.58278 351.16366 255.34375 351.09375 z "
     id="path4" />
</svg>
