<?xml version="1.0" standalone="yes"?>
<svg width="445" height="1001">
<path style="stroke:#010101; fill:none;" d="M247 158L234.278 208L236.941 219L237 247L237 370L237 756M130 296C139.221 276.31 151.435 252.045 169.015 238.418C174.926 233.836 183.187 231.648 190 228.719C204.219 222.606 218.572 216.597 233 211"/>
</svg>
