<?xml version="1.0" standalone="no"?>
<!DOCTYPE svg PUBLIC "-//W3C//DTD SVG 1.1//EN" "http://www.w3.org/Graphics/SVG/1.1/DTD/svg11.dtd" >
<svg viewBox="0 -205 1024 1024">
  <g transform="matrix(1 0 0 -1 0 819)">
   <path fill="currentColor"
d="M126 294l54 4l-42 -10l-28 -34l-12 -52v-70l12 -50l18 -34l30 -24l46 -4l-40 -18l-64 2l-30 16l-18 18l-22 40l-8 34l6 80l24 48l34 34zM258 450l42 18l4 -406l6 -18l14 -14l-88 -24l-6 18l-16 6l18 52v138l-10 42l-14 20l20 2l4 8v90l-10 32l-24 22z" />
  </g>

</svg>
