<?xml version="1.0" standalone="yes"?>
<svg width="215" height="1001">
<path style="fill:#010101; stroke:none;" d="M37 254C55.3521 250.68 73.3475 246.597 90.0018 237.887C140.61 211.418 179.248 158.142 215 115C193.581 115.475 172.077 116.497 152.002 124.756C97.7338 147.082 65.7492 206.238 37 254M51 313L51 801L134 801L134 313L51 313z"/>
</svg>
