



















        ████████\ ██\   ██\  ██████\  ██\   ██\ ██\   ██\       ██\     ██\  ██████\  ██\   ██\       ██\
        \__██  __|██ |  ██ |██  __██\ ███\  ██ |██ | ██  |      \██\   ██  |██  __██\ ██ |  ██ |      ██ |
           ██ |   ██ |  ██ |██ /  ██ |████\ ██ |██ |██  /        \██\ ██  / ██ /  ██ |██ |  ██ |      ██ |
           ██ |   ████████ |████████ |██ ██\██ |█████  /          \████  /  ██ |  ██ |██ |  ██ |      ██ |
           ██ |   ██  __██ |██  __██ |██ \████ |██  ██<            \██  /   ██ |  ██ |██ |  ██ |      \__|
           ██ |   ██ |  ██ |██ |  ██ |██ |\███ |██ |\██\            ██ |    ██ |  ██ |██ |  ██ |
           ██ |   ██ |  ██ |██ |  ██ |██ | \██ |██ | \██\           ██ |     ██████  |\██████  |      ██\
           \__|   \__|  \__|\__|  \__|\__|  \__|\__|  \__|          \__|     \______/  \______/       \__|





                                       |-------------------------------|
                                       |  A N T O I N E   G E L G O N  |
                                       |             2015              |
                                       |       GNU GPL V3 License      |
                                       |-------------------------------|













															.
