<?xml version="1.0" standalone="yes"?>
<svg width="223" height="1006">
<path style="fill:#020202; stroke:none;" d="M64 301L64 404L160 404L160 301L64 301M90 472L62 1006L162 1006L132 472L90 472z"/>
</svg>
