










                        ▓▓
                        ▓▓
                        ▓▓
                        ▓▓
                        ▓▓
                        ▓▓
                        ▓▓
                        ▓▓
                        ▓▓
                        ▓▓
                        ▓▓
                        ▓▓
                        ▓▓
                        ▓▓   ----->  P
                        ▓▓            A
                        ▓▓             T
                        ▓▓               H
                        ▓▓
                                            S                    -
                                             T                  | |
                                              R                 | |
                                               O                | |
                                                K               | |
                                                 E    ---->     | |
                                                                | |
                                                                | |
                                                                | |
                                                                | |
                                                                | |
                                                                | |
                                                                | |
                                                                | |
                                                                | |
                                                                | |
                                                                | |
                                                                | |
                                                                | |
                                                                 -











                                                                 
                                                                 .
