<?xml version="1.0" encoding="UTF-8" standalone="no"?>
<svg
   xmlns:dc="http://purl.org/dc/elements/1.1/"
   xmlns:cc="http://creativecommons.org/ns#"
   xmlns:rdf="http://www.w3.org/1999/02/22-rdf-syntax-ns#"
   xmlns:svg="http://www.w3.org/2000/svg"
   xmlns="http://www.w3.org/2000/svg"
   xmlns:xlink="http://www.w3.org/1999/xlink"
   id="svg2"
   version="1.1"
   viewBox="0 0 786.80073 540"
   height="540pt"
   width="786.80072pt">
  <metadata
     id="metadata476">
    <rdf:RDF>
      <cc:Work
         rdf:about="">
        <dc:format>image/svg+xml</dc:format>
        <dc:type
           rdf:resource="http://purl.org/dc/dcmitype/StillImage" />
        <dc:title></dc:title>
      </cc:Work>
    </rdf:RDF>
  </metadata>
  <defs
     id="defs4">
    <g
       id="g6">
      <symbol
         style="overflow:visible"
         id="glyph3-0"
         overflow="visible">
        <path
           id="path9"
           d="m 1.03125,0 0,-20.65625 8.234375,0 0,20.65625 z m 1.03125,-1.03125 6.171875,0 0,-18.59375 -6.171875,0 z m 0,0"
           style="stroke:none" />
      </symbol>
      <symbol
         style="overflow:visible"
         id="glyph3-1"
         overflow="visible">
        <path
           id="path12"
           d="m 15.71875,-8 0,1.546875 -15.9375,0 0,-1.546875 z m 0,0"
           style="stroke:none" />
      </symbol>
      <symbol
         style="overflow:visible"
         id="glyph0-0"
         overflow="visible">
        <path
           id="path15"
           d="m 20.65625,-42.457031 c -0.117188,0 -0.230469,0 -0.34375,0.05859 l -6.886719,2.292969 c -0.05859,0 -0.230469,0.05859 -0.285156,0.113281 l -6.886719,4.59375 c -0.113281,0.05469 -0.285156,0.226563 -0.34375,0.34375 l -4.589844,6.882813 c -0.058593,0.05859 -0.117187,0.230469 -0.117187,0.289063 L -1.089844,-21 c -0.058594,0.117188 -0.058594,0.230469 -0.058594,0.34375 l 0,4.589844 c 0,0.632812 0.515626,1.148437 1.148438,1.148437 0.632812,0 1.148438,-0.515625 1.148438,-1.148437 l 0,-4.417969 2.179687,-6.539063 4.359375,-6.597656 6.597656,-4.359375 6.542969,-2.183593 4.417969,0 c 0.628906,0 1.144531,-0.515626 1.144531,-1.144532 0,-0.632812 -0.515625,-1.148437 -1.144531,-1.148437 z m 0,0"
           style="stroke:none" />
      </symbol>
      <symbol
         style="overflow:visible"
         id="glyph0-1"
         overflow="visible">
        <path
           id="path18"
           d="m 24.097656,-16.066406 0,4.417968 -2.179687,6.542969 L 17.558594,1.492188 10.957031,5.851562 4.417969,8.03125 0,8.03125 c -0.632812,0 -1.148438,0.519531 -1.148438,1.148438 0,0.632812 0.515626,1.148437 1.148438,1.148437 l 4.589844,0 c 0.113281,0 0.230468,0 0.34375,-0.05859 l 6.886718,-2.292969 c 0.05469,0 0.226563,-0.058593 0.285157,-0.117187 l 6.886719,-4.589844 c 0.113281,-0.054687 0.285156,-0.230469 0.34375,-0.34375 l 4.589843,-6.882812 c 0.05859,-0.058594 0.113281,-0.230469 0.113281,-0.289063 l 2.296876,-6.882812 c 0.05469,-0.117188 0.05469,-0.230469 0.05469,-0.347656 l 0,-4.589844 c 0,-0.628906 -0.515625,-1.144532 -1.144531,-1.144532 -0.632813,0 -1.148438,0.515626 -1.148438,1.144532 z m 0,0"
           style="stroke:none" />
      </symbol>
      <symbol
         style="overflow:visible"
         id="glyph1-0"
         overflow="visible">
        <path
           id="path21"
           d="m 4.078125,-19.890625 c -0.101563,0 -0.253906,0.05078 -0.328125,0.128906 l -0.027344,0 0,0.02344 -0.023437,0 -0.027344,0.02734 0,0.02344 c -0.050781,0.07813 -0.101563,0.207031 -0.101563,0.308594 l 0,21.417968 c 0,0.28125 0.230469,0.511719 0.507813,0.511719 l 1.023437,0 c 0.101563,0 0.253907,-0.050781 0.328126,-0.128906 l 0.027343,-0.023437 0.027344,0 0.023437,-0.027344 0,-0.023438 C 5.558594,2.269531 5.609375,2.140625 5.609375,2.039062 l 0,-21.417968 c 0,-0.28125 -0.230469,-0.511719 -0.507813,-0.511719 z m 0,0"
           style="stroke:none" />
      </symbol>
      <symbol
         style="overflow:visible"
         id="glyph1-1"
         overflow="visible">
        <path
           id="path24"
           d="m 4.078125,-19.890625 -0.125,0 -0.027344,0.02734 -0.050781,0 c -0.023438,0 -0.050781,0.02344 -0.050781,0.02344 l -0.023438,0.02734 -0.027343,0.02344 -0.023438,0.02734 c -0.101562,0.07422 -0.179688,0.253907 -0.179688,0.382813 l 0,21.417968 c 0,0.101563 0.050782,0.257813 0.128907,0.332032 l 0,0.027344 0.023437,0 0,0.023437 0.027344,0.027344 0.023438,0 C 3.851562,2.5 3.976562,2.550781 4.078125,2.550781 l 1.023437,0 c 0.277344,0 0.507813,-0.230469 0.507813,-0.511719 l 0,-16.777343 12.316406,17.035156 c 0.05078,0.074219 0.152344,0.203125 0.253907,0.226563 0.02734,0 0.07812,0.027343 0.105468,0.027343 l 0.203125,0 0.02344,-0.027343 0.05078,0 c 0.02734,0 0.05078,-0.023438 0.05078,-0.023438 l 0,-0.027344 0.05078,0 0,-0.023437 0.02734,-0.027344 c 0.101563,-0.074219 0.179688,-0.253906 0.179688,-0.382813 l 0,-21.417968 c 0,-0.28125 -0.230469,-0.511719 -0.511719,-0.511719 l -1.019531,0 c -0.101563,0 -0.253906,0.05078 -0.332032,0.128906 l -0.02344,0 0,0.02344 -0.02734,0 -0.02344,0.02734 0,0.02344 c -0.05078,0.07813 -0.105469,0.207031 -0.105469,0.308594 l 0,16.777344 -12.316406,-17.035157 c -0.050781,-0.07422 -0.152344,-0.203125 -0.253907,-0.226562 -0.023437,0 -0.074218,-0.02734 -0.101562,-0.02734 z m 0.511719,2.089844 0,1.402343 C 4.617188,-16.5 4.691406,-16.625 4.769531,-16.703125 l 0.074219,-0.07422 c 0,0 0.027344,-0.02734 0.050781,-0.02734 l 0.050781,0 0.027344,-0.02344 0.203125,0 c 0.027344,0 0.078125,0.02344 0.101563,0.02344 0.027344,0 0.027344,0.02734 0.050781,0.02734 z m 13.261718,16.855469 c -0.02734,0.105468 -0.105468,0.230468 -0.179687,0.308593 l -0.02734,0.023438 0,0.027343 -0.05078,0 0,0.023438 c 0,0 -0.02344,0.027344 -0.05078,0.027344 l -0.05078,0 -0.02344,0.023437 -0.207031,0 c -0.02344,0 -0.07422,-0.023437 -0.101563,-0.023437 -0.02344,0 -0.02344,-0.027344 -0.05078,-0.027344 l 0.742187,1.023438 z m 0,0"
           style="stroke:none" />
      </symbol>
      <symbol
         style="overflow:visible"
         id="glyph1-2"
         overflow="visible">
        <path
           id="path27"
           d="m 2.039062,-19.890625 c -0.101562,0 -0.253906,0.05078 -0.332031,0.128906 l -0.023437,0 0,0.02344 -0.027344,0 -0.023438,0.02734 0,0.02344 c -0.050781,0.07813 -0.101562,0.207031 -0.101562,0.308594 l 0,1.019531 c 0,0.28125 0.226562,0.507813 0.507812,0.507813 l 5.609376,0 0,19.890624 c 0,0.101563 0.050781,0.257813 0.128906,0.332032 l 0,0.027344 0.027344,0 0,0.023437 0.023437,0.027344 0.027344,0 C 7.929688,2.5 8.058594,2.550781 8.160156,2.550781 l 1.019532,0 c 0.28125,0 0.511718,-0.230469 0.511718,-0.511719 l 0,-19.890624 5.609375,0 c 0.101563,0 0.253907,-0.05078 0.332031,-0.125 l 0.02344,-0.02734 0.02734,0 0.02344,-0.02344 0,-0.02734 c 0.05078,-0.07422 0.101563,-0.203124 0.101563,-0.304687 l 0,-1.019531 c 0,-0.28125 -0.226563,-0.511719 -0.507813,-0.511719 z m 0,0"
           style="stroke:none" />
      </symbol>
      <symbol
         style="overflow:visible"
         id="glyph1-3"
         overflow="visible">
        <path
           id="path30"
           d="m 4.078125,-19.890625 c -0.101563,0 -0.253906,0.05078 -0.328125,0.128906 l -0.027344,0 0,0.02344 -0.023437,0 -0.027344,0.02734 0,0.02344 c -0.050781,0.07813 -0.101563,0.207031 -0.101563,0.308594 l 0,21.417968 c 0,0.101563 0.050782,0.257813 0.128907,0.332032 l 0,0.027344 0.023437,0 0,0.023437 L 3.75,2.44922 l 0.023438,0 C 3.851562,2.5 3.976562,2.550781 4.078125,2.550781 l 12.242187,0 c 0.101563,0 0.253907,-0.050781 0.332032,-0.128906 l 0.02344,-0.023437 0.02734,0 0.02344,-0.027344 0,-0.023438 c 0.05078,-0.078125 0.101563,-0.207031 0.101563,-0.308594 l 0,-1.019531 c 0,-0.28125 -0.226563,-0.507812 -0.507813,-0.507812 l -10.710937,0 0,-8.160157 5.609375,0 c 0.101562,0 0.257812,-0.050781 0.332031,-0.128906 l 0.02734,-0.027344 0.02344,0 0.02734,-0.023437 0,-0.027344 c 0.05078,-0.074219 0.101563,-0.203125 0.101563,-0.304687 l 0,-1.019532 c 0,-0.28125 -0.230469,-0.511718 -0.511719,-0.511718 l -5.609375,0 0,-8.160156 10.710937,0 c 0.28125,0 0.507813,-0.226563 0.507813,-0.507813 l 0,-1.019531 c 0,-0.101563 -0.05078,-0.257813 -0.125,-0.332032 l -0.02734,-0.02734 0,-0.02344 -0.02344,-0.02734 -0.02734,0 c -0.07422,-0.05078 -0.203125,-0.101563 -0.304688,-0.101563 z m 0.511719,1.019531 0.433594,0 c -0.078126,0.02734 -0.203126,0.07813 -0.253907,0.128906 l -0.027343,0 0,0.02344 -0.023438,0 -0.027344,0.02734 0,0.02734 c -0.050781,0.05078 -0.101562,0.152343 -0.101562,0.226562 z m 0,19.96875 C 4.617188,1.171875 4.667969,1.300781 4.71875,1.351562 l 0,0.027344 0.023438,0 0,0.023438 0.027343,0.027344 0.023438,0 C 4.84375,1.480469 4.945312,1.53125 5.023438,1.53125 l -0.433594,0 z m 0,0"
           style="stroke:none" />
      </symbol>
      <symbol
         style="overflow:visible"
         id="glyph1-4"
         overflow="visible">
        <path
           id="path33"
           d="m 4.078125,-19.890625 c -0.101563,0 -0.253906,0.05078 -0.328125,0.128906 l -0.027344,0 0,0.02344 -0.023437,0 -0.027344,0.02734 0,0.02344 c -0.050781,0.07813 -0.101563,0.207031 -0.101563,0.308594 l 0,21.417968 c 0,0.101563 0.050782,0.257813 0.128907,0.332032 l 0,0.027344 0.023437,0 0,0.023437 L 3.75,2.44922 l 0.023438,0 C 3.851562,2.5 3.976562,2.550781 4.078125,2.550781 l 1.023437,0 c 0.277344,0 0.507813,-0.230469 0.507813,-0.511719 l 0,-9.6875 4.308594,0 5.96875,9.945313 c 0.07813,0.125 0.28125,0.253906 0.433593,0.253906 l 1.019532,0 c 0.101562,0 0.253906,-0.050781 0.332031,-0.128906 l 0.02344,0 0,-0.023437 0.05078,-0.027344 0.05469,-0.101563 0,-0.027343 c 0,0 0.02344,-0.023438 0.02344,-0.050782 0,-0.023437 0.02734,0 0.02734,-0.023437 l 0,-0.128907 c 0,-0.101562 -0.05078,-0.253906 -0.105468,-0.332031 l -5.632813,-9.355469 0.125,0 c 0.05078,0 0.105469,0 0.15625,-0.027343 l 3.058594,-1.019531 c 0.05078,-0.027344 0.152344,-0.078126 0.203125,-0.128907 l 1.019531,-1.019531 c 0.02734,-0.023438 0.07813,-0.074219 0.101563,-0.125 l 1.023437,-2.042969 c 0.02344,-0.05078 0.05078,-0.152343 0.05078,-0.226562 l 0,-3.0625 c 0,-0.07422 -0.02734,-0.175781 -0.05078,-0.230469 l -1.023437,-2.039062 c -0.02344,-0.05078 -0.07422,-0.101563 -0.101563,-0.125 L 15.65625,-18.71875 c -0.05078,-0.05078 -0.152344,-0.101562 -0.203125,-0.125 l -3.058594,-1.019531 c -0.05078,-0.02734 -0.105469,-0.02734 -0.15625,-0.02734 z m 0.511719,1.019531 0,0.433594 c 0,-0.07422 0.050781,-0.175781 0.101562,-0.226562 l 0,-0.02734 0.027344,-0.02734 0.023438,0 0,-0.02344 0.027343,0 c 0.050781,-0.05078 0.175781,-0.101562 0.253907,-0.128906 z m 1.019531,1.019532 6.554687,0 2.777344,0.917968 0.867188,1.761719 0,2.804687 -0.867188,1.757813 -2.777344,0.917969 -6.554687,0 z m 0,0"
           style="stroke:none" />
      </symbol>
      <symbol
         style="overflow:visible"
         id="glyph1-5"
         overflow="visible">
        <path
           id="path36"
           d="m 10.148438,-19.890625 c -0.02344,0 -0.101563,0 -0.125,0.02734 -0.027344,0 -0.054688,0.02344 -0.078126,0.05078 -0.101562,0.05078 -0.230468,0.175781 -0.253906,0.304688 L 1.582031,1.785156 C 1.554688,1.863281 1.53125,1.964844 1.53125,2.039062 c 0,0.050782 0.023438,0.152344 0.050781,0.203126 l 0,0.054687 0.023438,0 0,0.050781 0.027343,0 0.023438,0.023438 0,0.027344 C 1.683594,2.421875 1.707031,2.421875 1.734375,2.449219 1.808594,2.5 1.9375,2.550781 2.039062,2.550781 l 1.019532,0 c 0.207031,0 0.410156,-0.152343 0.484375,-0.332031 l 1.835937,-4.769531 9.640625,0 1.835938,4.769531 c 0.07813,0.179688 0.28125,0.332031 0.484375,0.332031 l 1.019531,0 c 0.128906,0 0.28125,-0.078125 0.359375,-0.152343 l 0.02344,-0.027344 0.02734,0 0.02344,-0.050782 0.02734,-0.023437 0,-0.027344 0.02344,-0.027343 c 0.02734,-0.050782 0.02734,-0.152344 0.02734,-0.203126 0,-0.074218 -0.02734,-0.175781 -0.05078,-0.253906 l -8.109374,-21.292968 c -0.02734,-0.101563 -0.128907,-0.253907 -0.203126,-0.304688 -0.05469,-0.05078 -0.179687,-0.07813 -0.257812,-0.07813 z m 0.05078,1.9375 4.132812,10.839844 -3.648437,-9.335938 c -0.02344,-0.101562 -0.125,-0.253906 -0.203125,-0.304687 -0.02734,-0.02344 -0.05078,-0.05078 -0.07813,-0.05078 l -0.05078,0 -0.02344,-0.02344 -0.253906,0 c -0.02734,0 -0.078125,0.05078 -0.105469,0.05078 -0.023438,0.02344 -0.074219,0.05078 -0.101562,0.07422 -0.050782,0.05078 -0.125,0.179687 -0.152344,0.253906 l -3.644532,9.335938 z m 0,3.035156 4.003906,10.328125 -8.007813,0 z m 0,0"
           style="stroke:none" />
      </symbol>
      <symbol
         style="overflow:visible"
         id="glyph1-6"
         overflow="visible">
        <path
           id="path39"
           d="m 9.179688,-19.890625 -0.101563,0 c -0.027344,0 -0.027344,0.02734 -0.050781,0.02734 -0.050782,0 -0.101563,0.02344 -0.128906,0.05078 l -1.988282,0.992188 c -0.050781,0.02734 -0.101562,0.07812 -0.128906,0.101562 l -2.039062,2.042969 c -0.023438,0.02344 -0.074219,0.07422 -0.101563,0.125 l -1.019531,2.042969 c 0,0.02344 -0.027344,0.05078 -0.027344,0.07422 l -1.019531,3.0625 c -0.023438,0.05078 -0.023438,0.101563 -0.023438,0.152344 l 0,5.097656 c 0,0.050782 0,0.101563 0.023438,0.152344 l 1.019531,3.0625 c 0,0.023438 0.027344,0.050781 0.027344,0.074219 l 1.019531,2.042969 c 0.027344,0.050781 0.078125,0.101562 0.101563,0.125 L 6.78125,1.378906 C 6.808594,1.402344 6.859375,1.453125 6.910156,1.480469 L 8.949219,2.5 C 9,2.523438 9.101562,2.550781 9.179688,2.550781 l 4.082031,0 c 0.07422,0 0.175781,-0.027343 0.226562,-0.050781 L 15.53125,1.480469 c 0.05078,-0.027344 0.101562,-0.078125 0.125,-0.101563 l 2.039062,-2.042968 c 0.02734,-0.023438 0.07813,-0.074219 0.105469,-0.125 l 1.019531,-2.042969 c 0,-0.023438 0.02344,-0.050781 0.02344,-0.074219 l 1.019531,-3.0625 c 0.02734,-0.050781 0.02734,-0.101562 0.02734,-0.152344 l 0,-5.097656 c 0,-0.05078 0,-0.101562 -0.02734,-0.152344 l -1.019531,-3.0625 c 0,-0.02344 -0.02344,-0.05078 -0.02344,-0.07422 l -1.019531,-2.042969 c -0.02734,-0.05078 -0.07813,-0.101563 -0.105469,-0.125 L 15.65625,-18.71875 c -0.02344,-0.02344 -0.07422,-0.07422 -0.125,-0.101562 l -2.042969,-1.019532 c -0.05078,-0.02344 -0.152343,-0.05078 -0.226562,-0.05078 z m 0.128906,1.019531 0.839844,0 -0.02344,0 c -0.02734,0 -0.101562,0.02734 -0.128906,0.02734 l 0,0.02344 -2.320313,0.765624 z m 2.929687,0 0.894531,0 1.632813,0.816406 -2.371094,-0.789062 c -0.05078,-0.02734 -0.105469,-0.02734 -0.15625,-0.02734 z m -1.960937,1.019532 1.886718,0 2.804688,0.945312 1.914062,2.855469 0.96875,2.90625 0,4.949219 -0.96875,2.90625 -1.914062,2.855468 -2.804688,0.945313 -1.886718,0 -2.804688,-0.945313 -1.914062,-2.855468 -0.96875,-2.90625 0,-4.949219 0.96875,-2.90625 1.914062,-2.855469 z M 5.890625,-16.398438 5.125,-15.25 5.507812,-16.015625 Z m 10.660156,0 0.382813,0.382813 0.382812,0.765625 z M 5.125,-2.089844 5.890625,-0.945312 5.507812,-1.324219 Z m 12.191406,0 -0.382812,0.765625 -0.382813,0.378907 z m -9.640625,2.804688 2.371094,0.789062 c 0.05078,0.027344 0.101563,0.027344 0.152344,0.027344 l -0.890625,0 z m 7.089844,0 -1.632813,0.816406 -0.894531,0 c 0.05078,0 0.105469,0 0.15625,-0.027344 z m 0,0"
           style="stroke:none" />
      </symbol>
      <symbol
         style="overflow:visible"
         id="glyph1-7"
         overflow="visible">
        <path
           id="path42"
           d="m 4.078125,-19.890625 c -0.101563,0 -0.253906,0.05078 -0.328125,0.128906 l -0.027344,0 0,0.02344 -0.023437,0 -0.027344,0.02734 0,0.02344 c -0.050781,0.07813 -0.101563,0.207031 -0.101563,0.308594 l 0,21.417968 c 0,0.101563 0.050782,0.257813 0.128907,0.332032 l 0,0.027344 0.023437,0 0,0.023437 L 3.75,2.44922 l 0.023438,0 C 3.851562,2.5 3.976562,2.550781 4.078125,2.550781 l 12.242187,0 c 0.101563,0 0.253907,-0.050781 0.332032,-0.128906 l 0.02344,-0.023437 0.02734,0 0.02344,-0.027344 0,-0.023438 c 0.05078,-0.078125 0.101563,-0.207031 0.101563,-0.308594 l 0,-1.019531 c 0,-0.28125 -0.226563,-0.507812 -0.507813,-0.507812 l -10.710937,0 0,-19.890625 c 0,-0.28125 -0.230469,-0.511719 -0.507813,-0.511719 z m 0.511719,20.988281 0,0.433594 0.433594,0 c -0.078126,0 -0.179688,-0.050781 -0.230469,-0.101562 l -0.023438,0 -0.027343,-0.027344 0,-0.023438 -0.023438,0 0,-0.027344 C 4.667969,1.300781 4.617188,1.171875 4.589844,1.097656 Z m 0,0"
           style="stroke:none" />
      </symbol>
      <symbol
         style="overflow:visible"
         id="glyph1-8"
         overflow="visible">
        <path
           id="path45"
           d=""
           style="stroke:none" />
      </symbol>
      <symbol
         style="overflow:visible"
         id="glyph1-9"
         overflow="visible">
        <path
           id="path48"
           d="m 4.078125,-19.890625 c -0.101563,0 -0.253906,0.05078 -0.328125,0.128906 l -0.027344,0 0,0.02344 -0.023437,0 -0.027344,0.02734 0,0.02344 c -0.050781,0.07813 -0.101563,0.207031 -0.101563,0.308594 l 0,21.417968 c 0,0.101563 0.050782,0.257813 0.128907,0.332032 l 0,0.027344 0.023437,0 0,0.023437 L 3.75,2.44922 l 0.023438,0 C 3.851562,2.5 3.976562,2.550781 4.078125,2.550781 l 7.140625,0 c 0.05078,0 0.101562,0 0.152344,-0.027343 l 3.0625,-1.019532 c 0.05078,-0.023437 0.152344,-0.074218 0.203125,-0.125 l 2.039062,-2.042968 c 0.02734,-0.023438 0.07813,-0.074219 0.101563,-0.125 l 1.023437,-2.042969 c 0,-0.023438 0.02344,-0.050781 0.02344,-0.074219 l 1.019531,-3.0625 c 0.02734,-0.050781 0.02734,-0.101562 0.02734,-0.152344 l 0,-5.097656 c 0,-0.05078 0,-0.101562 -0.02734,-0.152344 l -1.019531,-3.0625 c 0,-0.02344 -0.02344,-0.05078 -0.02344,-0.07422 l -1.023437,-2.042969 c -0.02344,-0.05078 -0.07422,-0.101563 -0.101563,-0.125 l -2.039062,-2.042969 c -0.05078,-0.05078 -0.152344,-0.101562 -0.203125,-0.125 l -3.0625,-1.019531 c -0.05078,-0.02734 -0.101563,-0.02734 -0.152344,-0.02734 z m 0.511719,1.019531 0,0.433594 c 0,-0.07422 0.050781,-0.175781 0.101562,-0.226562 l 0,-0.02734 0.027344,-0.02734 0.023438,0 0,-0.02344 0.027343,0 c 0.050781,-0.05078 0.175781,-0.101562 0.253907,-0.128906 z m 1.019531,1.019532 5.535156,0 2.855469,0.96875 0.890625,0.867187 0.945313,1.941406 0.992187,2.929688 0,4.949219 -0.992187,2.929687 -0.945313,1.941406 L 14,-0.460938 l -2.855469,0.972657 -5.535156,0 z m -1.019531,18.949218 0,0.433594 0.433594,0 c -0.078126,0 -0.179688,-0.050781 -0.230469,-0.101562 l -0.023438,0 -0.027343,-0.027344 0,-0.023438 -0.023438,0 0,-0.027344 C 4.667969,1.300781 4.617188,1.171875 4.589844,1.097656 Z m 0,0"
           style="stroke:none" />
      </symbol>
      <symbol
         style="overflow:visible"
         id="glyph1-10"
         overflow="visible">
        <path
           id="path51"
           d="m 4.078125,-19.890625 c -0.101563,0 -0.253906,0.05078 -0.328125,0.128906 l -0.027344,0 0,0.02344 -0.023437,0 -0.027344,0.02734 0,0.02344 c -0.050781,0.07813 -0.101563,0.207031 -0.101563,0.308594 l 0,21.417968 c 0,0.101563 0.050782,0.257813 0.128907,0.332032 l 0,0.027344 0.023437,0 0,0.023437 L 3.75,2.44922 l 0.023438,0 C 3.851562,2.5 3.976562,2.550781 4.078125,2.550781 l 1.023437,0 c 0.277344,0 0.507813,-0.230469 0.507813,-0.511719 l 0,-9.6875 7.652344,0 c 0.07422,0 0.175781,-0.027343 0.226562,-0.050781 l 2.042969,-1.023437 c 0.05078,-0.023438 0.101562,-0.074219 0.125,-0.101563 l 1.019531,-1.019531 c 0.02734,-0.023438 0.07813,-0.074219 0.101563,-0.125 l 1.023437,-2.042969 c 0.02344,-0.05078 0.05078,-0.152343 0.05078,-0.226562 l 0,-3.0625 c 0,-0.07422 -0.02734,-0.175781 -0.05078,-0.230469 l -1.023437,-2.039062 c -0.02344,-0.05078 -0.07422,-0.101563 -0.101563,-0.125 L 15.65625,-18.71875 c -0.02344,-0.02344 -0.07422,-0.07422 -0.125,-0.101562 l -2.042969,-1.019532 c -0.05078,-0.02344 -0.152343,-0.05078 -0.226562,-0.05078 z m 0.511719,1.019531 0,0.433594 c 0,-0.07422 0.050781,-0.175781 0.101562,-0.226562 l 0,-0.02734 0.027344,-0.02734 0.023438,0 0,-0.02344 0.027343,0 c 0.050781,-0.05078 0.175781,-0.101562 0.253907,-0.128906 z m 1.019531,1.019532 7.523437,0 1.785157,0.894531 0.890625,1.785156 0,2.804687 -0.890625,1.785157 -1.785157,0.890625 -7.523437,0 z m 0,0"
           style="stroke:none" />
      </symbol>
      <symbol
         style="overflow:visible"
         id="glyph1-11"
         overflow="visible">
        <path
           id="path54"
           d="m 4.078125,-19.890625 c -0.101563,0 -0.253906,0.05078 -0.328125,0.128906 l -0.027344,0 0,0.02344 -0.023437,0 -0.027344,0.02734 0,0.02344 c -0.050781,0.07813 -0.101563,0.207031 -0.101563,0.308594 l 0,21.417968 c 0,0.101563 0.050782,0.257813 0.128907,0.332032 l 0,0.027344 0.023437,0 0,0.023437 L 3.75,2.44922 l 0.023438,0 C 3.851562,2.5 3.976562,2.550781 4.078125,2.550781 l 1.023437,0 c 0.277344,0 0.507813,-0.230469 0.507813,-0.511719 l 0,-9.6875 11.21875,0 0,9.6875 c 0,0.28125 0.230469,0.511719 0.511719,0.511719 l 1.019531,0 c 0.101563,0 0.253906,-0.050781 0.332031,-0.128906 l 0.02734,-0.023437 0.02344,0 0.02734,-0.027344 0,-0.023438 c 0.05078,-0.078125 0.101563,-0.207031 0.101563,-0.308594 l 0,-21.417968 c 0,-0.101563 -0.05078,-0.257813 -0.128906,-0.332032 l -0.02344,-0.02734 0,-0.02344 -0.02734,-0.02734 -0.02734,0 c -0.07422,-0.05078 -0.203124,-0.101563 -0.304687,-0.101563 l -1.019531,0 c -0.28125,0 -0.511719,0.230469 -0.511719,0.511719 l 0,9.6875 -11.21875,0 0,-9.6875 c 0,-0.28125 -0.230469,-0.511719 -0.507813,-0.511719 z m 0,0"
           style="stroke:none" />
      </symbol>
      <symbol
         style="overflow:visible"
         id="glyph1-12"
         overflow="visible">
        <path
           id="path57"
           d="m 9.179688,-19.890625 c -0.078126,0 -0.179688,0.02734 -0.230469,0.05078 l -2.039063,1.019532 c -0.050781,0.02734 -0.101562,0.07812 -0.128906,0.101562 l -2.039062,2.042969 c -0.023438,0.02344 -0.074219,0.07422 -0.101563,0.125 l -1.019531,2.042969 c 0,0.02344 -0.027344,0.05078 -0.027344,0.07422 l -1.019531,3.0625 c -0.023438,0.05078 -0.023438,0.101563 -0.023438,0.152344 l 0,5.097656 c 0,0.050782 0,0.101563 0.023438,0.152344 l 1.019531,3.0625 c 0,0.023438 0.027344,0.050781 0.027344,0.074219 l 1.019531,2.042969 c 0.027344,0.050781 0.078125,0.101562 0.101563,0.125 L 6.78125,1.378906 C 6.808594,1.402344 6.859375,1.453125 6.910156,1.480469 L 8.949219,2.5 C 9,2.523438 9.101562,2.550781 9.179688,2.550781 l 4.082031,0 c 0.07422,0 0.175781,-0.027343 0.226562,-0.050781 L 15.53125,1.480469 c 0.05078,-0.027344 0.101562,-0.078125 0.125,-0.101563 l 2.039062,-2.042968 c 0.02734,-0.023438 0.07813,-0.074219 0.105469,-0.125 l 1.019531,-2.042969 c 0.02344,-0.050781 0.05078,-0.152344 0.05078,-0.226563 l 0,-4.082031 c 0,-0.28125 -0.230469,-0.507813 -0.511719,-0.507813 l -5.097656,0 c -0.105469,0 -0.257813,0.050782 -0.332031,0.125 l -0.02734,0 0,0.027344 -0.02344,0 -0.02734,0.023438 0,0.027344 C 12.800781,-7.371094 12.75,-7.242188 12.75,-7.140625 l 0,1.019531 c 0,0.28125 0.230469,0.511719 0.511719,0.511719 l 3.566406,0 0,2.421875 -0.917969,1.863281 -0.917968,0.917969 -1.859376,0.917969 -3.824218,0 L 7.445312,-0.40625 6.527344,-1.324219 5.585938,-3.265625 4.589844,-6.195312 l 0,-4.949219 0.996094,-2.929688 0.941406,-1.941406 0.917968,-0.917969 1.863282,-0.917968 3.824218,0 1.859376,0.917968 0.917968,0.917969 0.972656,1.964844 c 0.07422,0.152343 0.277344,0.28125 0.457032,0.28125 l 1.019531,0 c 0.128906,0 0.28125,-0.07813 0.359375,-0.152344 l 0.05078,-0.02734 0.02344,-0.05078 0.02734,-0.02344 0,-0.02734 0.02344,-0.02344 0,-0.05469 c 0.02734,-0.05078 0.02734,-0.101563 0.02734,-0.152344 0,-0.101562 -0.05078,-0.226562 -0.101563,-0.304688 l -0.96875,-1.964843 c -0.02734,-0.05078 -0.07813,-0.101563 -0.105469,-0.125 l -2.039058,-2.04297 c -0.02344,-0.02344 -0.07422,-0.07422 -0.125,-0.101562 l -2.042969,-1.019532 c -0.05078,-0.02344 -0.152343,-0.05078 -0.226562,-0.05078 z m 8.160156,13.261719 c 0.28125,0 0.511718,0.226562 0.511718,0.507812 l 0,-0.507812 z m 0,0"
           style="stroke:none" />
      </symbol>
      <symbol
         style="overflow:visible"
         id="glyph1-13"
         overflow="visible">
        <path
           id="path60"
           d="m 4.078125,-7.648438 18.363281,0 c 0.277344,0 0.507813,0.226563 0.507813,0.507813 0,0.28125 -0.230469,0.511719 -0.507813,0.511719 l -18.363281,0 c -0.277344,0 -0.507813,-0.230469 -0.507813,-0.511719 0,-0.28125 0.230469,-0.507813 0.507813,-0.507813 z m 0,0"
           style="stroke:none" />
      </symbol>
      <symbol
         style="overflow:visible"
         id="glyph1-14"
         overflow="visible">
        <path
           id="path63"
           d="m 5.101562,-19.890625 c -0.105468,0 -0.257812,0.05078 -0.332031,0.128906 l -0.027343,0 0,0.02344 -0.023438,0 -0.027344,0.02734 0,0.02344 c -0.050781,0.07813 -0.101562,0.207031 -0.101562,0.308594 l 0,1.019531 c 0,0.28125 0.230468,0.507813 0.511718,0.507813 l 8.363282,0 -5.660156,7.269531 c -0.078126,0.07422 -0.15625,0.253906 -0.15625,0.382812 l 0,0.125 0.027343,0.02734 0,0.02344 0.023438,0.027344 0,0.050782 c 0,0.027343 0.027343,0.050781 0.027343,0.050781 0.027344,0.027343 0.101563,0.078125 0.128907,0.101562 0.074219,0.050781 0.203125,0.101563 0.304687,0.101563 l 2.984375,0 1.886719,0.640625 1.300781,0.839843 0.839844,1.300782 0.636719,1.886718 0,0.867188 -0.636719,1.886719 -0.839844,1.300781 -1.300781,0.839844 -1.886719,0.640625 -2.90625,0 -1.890625,-0.640625 -1.09375,-0.738282 -0.6875,-1.324218 C 4.539062,-2.242188 4.511719,-2.347656 4.460938,-2.398438 l -0.050782,-0.023437 -0.050781,-0.027344 0,-0.023437 L 4.335938,-2.5 4.308594,-2.5 C 4.257812,-2.523438 4.15625,-2.550781 4.078125,-2.550781 l -1.019531,0 c -0.277344,0 -0.507813,0.230469 -0.507813,0.511719 0,0.074218 0.023438,0.175781 0.050781,0.230468 l 1.019532,2.039063 c 0.027344,0.050781 0.078125,0.101562 0.101562,0.125 l 1.019532,1.023437 c 0.050781,0.050782 0.152343,0.101563 0.203124,0.125 l 3.0625,1.019532 c 0.050782,0.027343 0.101563,0.027343 0.152344,0.027343 l 3.058594,0 c 0.05078,0 0.101562,0 0.152344,-0.027343 l 3.0625,-1.019532 c 0.05078,-0.023437 0.152344,-0.074218 0.203125,-0.125 l 2.039062,-2.042968 c 0.05078,-0.050782 0.101563,-0.152344 0.128907,-0.203126 l 1.019531,-3.058593 c 0.02734,-0.050781 0.02734,-0.101563 0.02734,-0.152344 l 0,-1.023437 c 0,-0.050782 0,-0.101563 -0.02734,-0.152344 L 16.804688,-8.3125 c -0.02734,-0.050781 -0.07813,-0.152344 -0.128907,-0.203125 l -2.039062,-2.042969 c -0.05078,-0.05078 -0.152344,-0.101562 -0.203125,-0.125 l -3.0625,-1.019531 c -0.05078,-0.02734 -0.101563,-0.02734 -0.152344,-0.02734 l -0.203125,0 5.710937,-7.34375 c 0.05078,-0.07813 0.101563,-0.203125 0.101563,-0.304687 0,-0.28125 -0.226563,-0.511719 -0.507813,-0.511719 z m 0,0"
           style="stroke:none" />
      </symbol>
      <symbol
         style="overflow:visible"
         id="glyph1-15"
         overflow="visible">
        <path
           id="path66"
           d="m 8.160156,-12.75 c -0.078125,0 -0.179687,0.02734 -0.230468,0.05078 l -2.039063,1.019531 c -0.050781,0.02734 -0.101563,0.07813 -0.128906,0.101563 l -2.039063,2.04297 C 3.671875,-9.484375 3.621094,-9.382812 3.59375,-9.332031 l -1.019531,3.058593 c -0.023438,0.050782 -0.023438,0.101563 -0.023438,0.152344 l 0,2.042969 c 0,0.050781 0,0.101563 0.023438,0.152344 l 1.019531,3.058593 c 0.027344,0.050782 0.078125,0.152344 0.128906,0.203126 L 5.761719,1.378906 C 5.789062,1.402344 5.839844,1.453125 5.890625,1.480469 L 7.929688,2.5 c 0.050781,0.023438 0.152343,0.050781 0.230468,0.050781 l 3.058594,0 c 0.07813,0 0.179688,-0.027343 0.230469,-0.050781 l 2.039062,-1.019531 c 0.05078,-0.027344 0.101563,-0.078125 0.128907,-0.101563 l 1.964843,-1.964844 0.02344,-0.027343 c 0.101562,-0.074219 0.179687,-0.203125 0.203125,-0.304688 l 0,-0.203125 c -0.02344,-0.101562 -0.125,-0.257812 -0.203125,-0.308594 l -0.96875,-0.96875 c -0.07813,-0.074218 -0.230469,-0.152343 -0.355469,-0.152343 -0.179688,0 -0.382812,0.128906 -0.460938,0.28125 l -0.941406,1.886719 -1.785156,0.894531 -2.804688,0 -1.863281,-0.917969 -0.867187,-0.894531 -0.96875,-2.855469 0,-0.433594 10.710937,0 c 0.28125,0 0.507813,-0.230468 0.507813,-0.511718 l 0,-3.058594 c 0,-0.078125 -0.02344,-0.179688 -0.05078,-0.230469 l -1.019531,-2.039063 c -0.02344,-0.05078 -0.07422,-0.101562 -0.101562,-0.128906 l -1.019531,-1.019531 c -0.02734,-0.02344 -0.07813,-0.07422 -0.128907,-0.101563 l -2.039062,-1.019531 C 11.398438,-12.722656 11.296875,-12.75 11.21875,-12.75 Z m 0.128906,2.039062 2.804688,0 1.785156,0.894532 0.890625,1.785156 0,1.402344 -8.976562,0 0.765625,-2.269532 0.867187,-0.894531 z m 6.5,4.589844 0,0.511719 -0.507812,0 c 0.277344,0 0.507812,-0.230469 0.507812,-0.511719 z m -0.382812,4.949219 0.179688,0.152344 -0.484376,0.484375 z m 0,0"
           style="stroke:none" />
      </symbol>
      <symbol
         style="overflow:visible"
         id="glyph1-16"
         overflow="visible">
        <path
           id="path69"
           d="m 4.078125,-19.890625 c -0.101563,0 -0.253906,0.05078 -0.328125,0.128906 l -0.027344,0 0,0.02344 -0.023437,0 -0.027344,0.02734 0,0.02344 c -0.050781,0.07813 -0.101563,0.207031 -0.101563,0.308594 l 0,21.417968 c 0,0.101563 0.050782,0.257813 0.128907,0.332032 l 0,0.027344 0.023437,0 0,0.023437 L 3.75,2.44922 l 0.023438,0 C 3.851562,2.5 3.976562,2.550781 4.078125,2.550781 l 1.023437,0 c 0.277344,0 0.507813,-0.230469 0.507813,-0.511719 l 0,-9.6875 5.609375,0 c 0.101562,0 0.257812,-0.050781 0.332031,-0.128906 l 0.02734,-0.027344 0.02344,0 0.02734,-0.023437 0,-0.027344 c 0.05078,-0.074219 0.101563,-0.203125 0.101563,-0.304687 l 0,-1.019532 c 0,-0.28125 -0.230469,-0.511718 -0.511719,-0.511718 l -5.609375,0 0,-8.160156 10.710937,0 c 0.28125,0 0.507813,-0.226563 0.507813,-0.507813 l 0,-1.019531 c 0,-0.101563 -0.05078,-0.257813 -0.125,-0.332032 l -0.02734,-0.02734 0,-0.02344 -0.02344,-0.02734 -0.02734,0 c -0.07422,-0.05078 -0.203125,-0.101563 -0.304688,-0.101563 z m 0.511719,1.019531 0.433594,0 c -0.078126,0.02734 -0.203126,0.07813 -0.253907,0.128906 l -0.027343,0 0,0.02344 -0.023438,0 -0.027344,0.02734 0,0.02734 c -0.050781,0.05078 -0.101562,0.152343 -0.101562,0.226562 z m 0,0"
           style="stroke:none" />
      </symbol>
      <symbol
         style="overflow:visible"
         id="glyph1-17"
         overflow="visible">
        <path
           id="path72"
           d="m 8.160156,-19.890625 c -0.050781,0 -0.101562,0 -0.152344,0.02734 l -3.0625,1.019531 c -0.050781,0.02344 -0.152343,0.07422 -0.203124,0.125 l -2.039063,2.042969 c -0.078125,0.07422 -0.152344,0.226562 -0.152344,0.355469 l 0,2.039062 c 0,0.07813 0.023438,0.179688 0.050781,0.230469 l 1.019532,2.039062 c 0.027344,0.05078 0.078125,0.101563 0.101562,0.128907 l 1.019532,1.019531 c 0.027343,0.02734 0.078124,0.07813 0.128906,0.101562 l 2.039062,1.019531 0.050782,0.027344 5.074218,2.015625 1.9375,0.96875 0.917969,0.917969 0.917969,1.859375 0,2.730469 -0.789063,0.761718 -2.855469,0.972657 -3.875,0 L 6.425781,-0.40625 5.457031,-1.378906 C 5.378906,-1.453125 5.226562,-1.53125 5.101562,-1.53125 l -2.042968,0 c -0.125,0 -0.277344,0.078125 -0.355469,0.152344 -0.027344,0.027344 -0.101563,0.105468 -0.128906,0.15625 l 0,0.050781 c 0,0.023437 -0.023438,0.023437 -0.023438,0.050781 l 0,0.101563 c 0,0.128906 0.101563,0.332031 0.203125,0.40625 l 1.988282,1.992187 c 0.050781,0.050782 0.152343,0.101563 0.203124,0.125 l 3.0625,1.019532 c 0.050782,0.027343 0.101563,0.027343 0.152344,0.027343 l 4.078125,0 c 0.05078,0 0.105469,0 0.15625,-0.027343 l 3.058594,-1.019532 c 0.05078,-0.023437 0.152344,-0.074218 0.203125,-0.125 l 2.039062,-2.042968 c 0.07813,-0.074219 0.15625,-0.226563 0.15625,-0.355469 l 0,-3.058594 c 0,-0.078125 -0.02734,-0.179687 -0.05078,-0.230469 l -1.023437,-2.039062 c -0.02344,-0.054688 -0.07422,-0.105469 -0.101563,-0.128906 L 14.63672,-8.515625 C 14.61328,-8.542969 14.55859,-8.59375 14.507813,-8.617188 l -2.039062,-1.023437 -0.05078,-0.023437 -5.074219,-2.015626 -1.859375,-0.941406 -0.894531,-1.785156 0,-1.710938 0.789062,-0.765624 2.859375,-0.96875 3.875,0 1.859375,0.917968 0.96875,0.96875 c 0.07813,0.07813 0.230469,0.15625 0.359375,0.15625 l 2.039063,0 c 0.128906,0 0.28125,-0.07813 0.355468,-0.15625 0.02734,-0.02344 0.105469,-0.101562 0.128907,-0.152344 l 0,-0.05078 c 0,-0.02344 0.02734,-0.02344 0.02734,-0.05078 l 0,-0.101562 c 0,-0.128907 -0.105468,-0.332032 -0.207031,-0.40625 l -1.98828,-1.99219 c -0.05078,-0.05078 -0.152344,-0.101562 -0.203125,-0.125 l -3.058594,-1.019531 c -0.05078,-0.02734 -0.105469,-0.02734 -0.15625,-0.02734 z m 4.617188,1.226563 1.730468,0.863281 c 0.05078,0.02734 0.105469,0.07813 0.128907,0.105469 l 0.867187,0.867187 0.613282,0 -1.097657,-1.074219 z M 4.285156,-0.511719 5.378906,0.5625 7.625,1.324219 5.890625,0.460938 C 5.839844,0.433594 5.789062,0.382812 5.761719,0.355469 L 4.894531,-0.511719 Z m 0,0"
           style="stroke:none" />
      </symbol>
      <symbol
         style="overflow:visible"
         id="glyph1-18"
         overflow="visible">
        <path
           id="path75"
           d="m 2.015625,-19.890625 -0.027344,0 c -0.101562,0 -0.230469,0.07813 -0.304687,0.152344 l -0.050782,0.02734 0,0.02344 c -0.027343,0.02734 -0.050781,0.02734 -0.050781,0.05078 l 0,0.02734 -0.027343,0.02344 c -0.023438,0.05469 -0.023438,0.15625 -0.023438,0.207032 0,0.07422 0.023438,0.175781 0.050781,0.253906 L 9.691406,2.167969 c 0.023438,0.101562 0.125,0.253906 0.203125,0.304687 0.050781,0.050782 0.179688,0.078125 0.253907,0.078125 l 0.07812,0 c 0.05078,0 0.101563,0 0.152344,-0.027343 0.02344,0 0.05078,-0.023438 0.07422,-0.050782 0.105469,-0.050781 0.230469,-0.175781 0.257813,-0.304687 L 18.820312,-19.125 c 0.02344,-0.07813 0.05078,-0.179688 0.05078,-0.253906 0,-0.05078 -0.02734,-0.152344 -0.05078,-0.207032 l 0,-0.05078 -0.02734,0 0,-0.05078 -0.02344,0 -0.02734,-0.02344 0,-0.02734 c -0.02344,-0.02344 -0.05078,-0.02344 -0.07813,-0.05078 -0.07422,-0.05078 -0.203124,-0.101563 -0.304687,-0.101563 l -1.019531,0 c -0.203125,0 -0.40625,0.152344 -0.484375,0.332031 L 10.199219,-2.421871 3.542969,-19.55859 C 3.46875,-19.738281 3.265625,-19.890625 3.058594,-19.890625 Z m 4.054687,9.664063 3.644532,9.335937 c 0.027344,0.101563 0.128906,0.253906 0.203125,0.304687 0.027343,0.023438 0.050781,0.050782 0.078125,0.050782 l 0.050781,0 0.02734,0.023437 0.253906,0 c 0.02344,0 0.07422,-0.050781 0.101563,-0.050781 0.02344,-0.023438 0.07812,-0.050781 0.101562,-0.074219 0.05078,-0.050781 0.128906,-0.179687 0.152344,-0.253906 l 3.648437,-9.335937 -4.132812,10.839843 z m 0,0"
           style="stroke:none" />
      </symbol>
      <symbol
         style="overflow:visible"
         id="glyph1-19"
         overflow="visible">
        <path
           id="path78"
           d="m 4.078125,-19.890625 -0.125,0 -0.027344,0.02734 -0.050781,0 c -0.023438,0 -0.074219,0.02344 -0.101562,0.05078 -0.023438,0.02344 -0.074219,0.101562 -0.101563,0.125 l -0.023437,0.02734 c -0.054688,0.07422 -0.078126,0.203125 -0.078126,0.28125 l 0,21.417968 c 0,0.101563 0.050782,0.257813 0.128907,0.332032 l 0,0.027344 0.023437,0 0,0.023437 L 3.75,2.44921 l 0.023438,0 C 3.851562,2.5 3.976562,2.550781 4.078125,2.550781 l 1.023437,0 c 0.277344,0 0.507813,-0.230469 0.507813,-0.511719 l 0,-13.871093 6.144531,14.023437 c 0.05078,0.128906 0.179688,0.28125 0.308594,0.332032 0.02344,0 0.02344,0.027343 0.05078,0.027343 l 0.230469,0 c 0.02344,0 0.02344,-0.027343 0.05078,-0.027343 0.152344,-0.050782 0.277344,-0.175782 0.328125,-0.332032 l 6.148438,-14.023437 0,13.871093 c 0,0.28125 0.226562,0.511719 0.507812,0.511719 l 1.019532,0 c 0.105468,0 0.257812,-0.050781 0.332031,-0.128906 l 0.02734,-0.023437 0.02344,0 0.02734,-0.027344 0,-0.023438 c 0.05078,-0.078125 0.101562,-0.207031 0.101562,-0.308594 l 0,-21.417968 c 0,-0.05078 -0.02734,-0.101563 -0.02734,-0.152344 -0.02344,-0.07813 -0.07422,-0.15625 -0.125,-0.207031 l -0.02734,-0.05078 -0.05078,-0.02344 c -0.02344,-0.02734 -0.05078,-0.05078 -0.07422,-0.05078 l -0.05078,0 c -0.02734,0 -0.02734,-0.02734 -0.05078,-0.02734 l -0.15625,0 c -0.05078,0 -0.125,0.02734 -0.175781,0.05078 -0.02734,0.02734 -0.101563,0.07813 -0.128906,0.101563 -0.05078,0.05078 -0.101563,0.128906 -0.128907,0.179687 L 12.238281,-2.269531 4.566406,-19.53125 c 0,-0.02734 -0.027344,-0.07813 -0.054687,-0.105469 -0.023438,-0.05078 -0.074219,-0.125 -0.125,-0.152343 -0.027344,-0.02344 -0.050781,-0.02344 -0.078125,-0.05078 -0.023438,-0.02344 -0.074219,-0.05078 -0.101563,-0.05078 z m 0.511719,2.90625 7.164062,16.117187 c 0.05078,0.179688 0.230469,0.332032 0.410156,0.355469 l 0.179688,0 c 0.02344,0 0.02344,-0.023437 0.05078,-0.023437 0.152344,-0.050782 0.277344,-0.179688 0.328125,-0.332032 l 7.167969,-16.117187 0,2.652344 c 0,-0.101563 -0.07813,-0.226563 -0.152344,-0.304688 l -0.02734,-0.05078 -0.05078,-0.02734 c 0,0 -0.02344,-0.02344 -0.05078,-0.02344 l -0.02344,-0.02734 c -0.02734,0 -0.07813,-0.02344 -0.105469,-0.02344 l -0.152344,0 c -0.02344,0 -0.07422,0.02344 -0.101563,0.02344 l -0.05078,0 c -0.02344,0 -0.05078,0.02734 -0.05078,0.02734 l -0.101562,0.101562 c -0.02734,0.02344 -0.07813,0.101563 -0.101563,0.152344 l -0.02734,0.02734 -6.65625,15.222656 -6.652343,-15.222656 0,-0.02734 -0.027344,0 c 0,-0.02344 -0.023438,-0.07422 -0.050782,-0.101563 l -0.128906,-0.128906 c -0.023437,-0.02344 -0.074218,-0.05078 -0.101562,-0.05078 l -0.023438,0 -0.027344,-0.02344 -0.203124,0 c -0.027344,0 -0.050782,0.02344 -0.078126,0.02344 l -0.050781,0 0,0.02734 c -0.023437,0 -0.074219,0 -0.101562,0.02344 -0.023438,0.02734 -0.074219,0.101563 -0.101563,0.128906 -0.050781,0.07813 -0.101562,0.179688 -0.101562,0.253907 z m 0,0"
           style="stroke:none" />
      </symbol>
      <symbol
         style="overflow:visible"
         id="glyph1-20"
         overflow="visible">
        <path
           id="path81"
           d="m 9.128906,-28.050781 c -0.152344,0 -0.332031,0.101562 -0.40625,0.203125 l -0.96875,0.96875 c -0.078125,0.07813 -0.15625,0.230468 -0.15625,0.359375 0,0.128906 0.078125,0.304687 0.179688,0.382812 l 6.09375,5.074219 0.02734,0.02344 0,0.02734 0.05078,0.02344 0.02344,0.02734 c 0.02734,0.02734 0.07813,0.02734 0.101563,0.02734 0.02734,0 0.02734,0.02344 0.05469,0.02344 l 0.203125,0 c 0.02344,0 0.02344,-0.02344 0.05078,-0.02344 l 0.05078,0 0.02344,-0.02734 0.02734,0 0,-0.02734 0.02344,0 0.07813,-0.07422 0.02734,0 0.02344,-0.02734 0,-0.02344 0.05078,-0.05078 0,-0.02734 0.02734,-0.02344 0,-0.05078 0.02344,-0.02734 0,-0.203125 c 0,-0.02734 -0.02344,-0.05078 -0.02344,-0.07813 0,-0.02344 -0.02734,-0.07422 -0.05078,-0.101562 l -0.02734,-0.05078 L 14.613281,-21.75 9.5625,-27.820312 c -0.078125,-0.128907 -0.230469,-0.230469 -0.382812,-0.230469 z m -0.027344,1.277343 1.148438,1.375 -1.375,-1.148437 z m 1.046876,6.882813 c -0.02344,0 -0.101563,0 -0.125,0.02734 -0.027344,0 -0.054688,0.02344 -0.078126,0.05078 -0.101562,0.05078 -0.230468,0.175781 -0.253906,0.304688 L 1.582031,1.785156 C 1.554688,1.863281 1.53125,1.964844 1.53125,2.039062 c 0,0.050782 0.023438,0.152344 0.050781,0.203126 l 0,0.054687 0.023438,0 0,0.050781 0.027343,0 0.023438,0.023438 0,0.027344 C 1.683594,2.421875 1.707031,2.421875 1.734375,2.449219 1.808594,2.5 1.9375,2.550781 2.039062,2.550781 l 1.019532,0 c 0.207031,0 0.410156,-0.152343 0.484375,-0.332031 l 1.835937,-4.769531 9.640625,0 1.835938,4.769531 c 0.07813,0.179688 0.28125,0.332031 0.484375,0.332031 l 1.019531,0 c 0.128906,0 0.28125,-0.078125 0.359375,-0.152343 l 0.02344,-0.027344 0.02734,0 0.02344,-0.050782 0.02734,-0.023437 0,-0.027344 0.02344,-0.027343 c 0.02734,-0.050782 0.02734,-0.152344 0.02734,-0.203126 0,-0.074218 -0.02734,-0.175781 -0.05078,-0.253906 l -8.109374,-21.292968 c -0.02734,-0.101563 -0.128907,-0.253907 -0.203126,-0.304688 -0.05469,-0.05078 -0.179687,-0.07813 -0.257812,-0.07813 z m 0.05078,1.9375 4.132812,10.839844 -3.648437,-9.335938 c -0.02344,-0.101562 -0.125,-0.253906 -0.203125,-0.304687 -0.02734,-0.02344 -0.05078,-0.05078 -0.07813,-0.05078 l -0.05078,0 -0.02344,-0.02344 -0.253906,0 c -0.02734,0 -0.078125,0.05078 -0.105469,0.05078 -0.023438,0.02344 -0.074219,0.05078 -0.101562,0.07422 -0.050782,0.05078 -0.125,0.179687 -0.152344,0.253906 l -3.644532,9.335938 z m 0,3.035156 4.003906,10.328125 -8.007813,0 z m 0,0"
           style="stroke:none" />
      </symbol>
      <symbol
         style="overflow:visible"
         id="glyph1-21"
         overflow="visible">
        <path
           id="path84"
           d="m 2.015625,-19.890625 c -0.101563,0 -0.230469,0.07813 -0.308594,0.128906 l -0.023437,0.02344 -0.050782,0.02734 -0.027343,0.05078 -0.023438,0.05078 -0.027343,0.02344 0,0.02734 c -0.023438,0.05078 -0.023438,0.128906 -0.023438,0.179688 0,0.101562 0.050781,0.28125 0.125,0.355468 l 7.015625,9.996094 0,11.066406 c 0,0.28125 0.226563,0.511719 0.507813,0.511719 l 1.019531,0 c 0.101562,0 0.253906,-0.050781 0.332031,-0.128906 l 0.02734,-0.023437 0.02344,0 0.02734,-0.027344 0,-0.023438 C 10.66015,2.269526 10.710933,2.14062 10.710933,2.039057 l 0,-11.066406 7.011718,-9.996094 c 0.07813,-0.07422 0.128906,-0.253906 0.128906,-0.355468 0,-0.05078 0,-0.152344 -0.02734,-0.207032 l -0.02344,-0.02344 0,-0.02734 -0.02734,-0.02344 0,-0.02734 -0.02734,0 -0.101563,-0.101562 c -0.07422,-0.05078 -0.203125,-0.101563 -0.304687,-0.101563 l -1.019532,0 c -0.152343,0 -0.332031,0.101563 -0.410156,0.230469 L 9.691406,-10.8125 3.46875,-19.660156 c -0.078125,-0.128906 -0.253906,-0.230469 -0.410156,-0.230469 z m 0,0"
           style="stroke:none" />
      </symbol>
      <symbol
         style="overflow:visible"
         id="glyph1-22"
         overflow="visible">
        <path
           id="path87"
           d="m 8.183594,-28.074219 c -0.152344,0 -0.328125,0.101563 -0.40625,0.203125 l -0.96875,0.96875 c -0.078125,0.07813 -0.152344,0.230469 -0.152344,0.355469 0,0.128906 0.074219,0.308594 0.179688,0.382813 l 6.09375,5.074218 0.02344,0.02734 0,0.02344 0.05078,0.02734 0.02734,0.02344 c 0.02344,0.02734 0.07422,0.02734 0.101562,0.02734 0.02344,0 0.02344,0.02734 0.05078,0.02734 l 0.203125,0 c 0.02734,0 0.02734,-0.02734 0.05078,-0.02734 l 0.05078,0 0.02734,-0.02734 0.02344,0 0,-0.02344 0.02734,0 0.07422,-0.07813 0.02734,0 0.02734,-0.02344 0,-0.02734 0.05078,-0.05078 0,-0.02344 0.02344,-0.02734 0,-0.05078 0.02734,-0.02344 0,-0.207032 c 0,-0.02344 -0.02734,-0.05078 -0.02734,-0.07422 0,-0.02734 -0.02344,-0.07813 -0.05078,-0.101563 l -0.02344,-0.05078 -0.02734,-0.02734 -5.050781,-6.070312 c -0.074219,-0.125 -0.226563,-0.226563 -0.378907,-0.226563 z m -0.023438,1.273438 1.148438,1.378906 -1.378906,-1.148437 z m -4.082031,6.910156 c -0.101563,0 -0.253906,0.05078 -0.328125,0.128906 l -0.027344,0 0,0.02344 -0.023437,0 -0.027344,0.02734 0,0.02344 c -0.050781,0.07813 -0.101563,0.207031 -0.101563,0.308594 l 0,21.417968 c 0,0.101563 0.050782,0.257813 0.128907,0.332032 l 0,0.027344 0.023437,0 0,0.023437 L 3.75,2.44922 l 0.023438,0 C 3.851562,2.5 3.976562,2.550781 4.078125,2.550781 l 12.242187,0 c 0.101563,0 0.253907,-0.050781 0.332032,-0.128906 l 0.02344,-0.023437 0.02734,0 0.02344,-0.027344 0,-0.023438 c 0.05078,-0.078125 0.101563,-0.207031 0.101563,-0.308594 l 0,-1.019531 c 0,-0.28125 -0.226563,-0.507812 -0.507813,-0.507812 l -10.710937,0 0,-8.160157 5.609375,0 c 0.101562,0 0.257812,-0.050781 0.332031,-0.128906 l 0.02734,-0.027344 0.02344,0 0.02734,-0.023437 0,-0.027344 c 0.05078,-0.074219 0.101563,-0.203125 0.101563,-0.304687 l 0,-1.019532 c 0,-0.28125 -0.230469,-0.511718 -0.511719,-0.511718 l -5.609375,0 0,-8.160156 10.710937,0 c 0.28125,0 0.507813,-0.226563 0.507813,-0.507813 l 0,-1.019531 c 0,-0.101563 -0.05078,-0.257813 -0.125,-0.332032 l -0.02734,-0.02734 0,-0.02344 -0.02344,-0.02734 -0.02734,0 c -0.07422,-0.05078 -0.203125,-0.101563 -0.304688,-0.101563 z m 0.511719,1.019531 0.433594,0 c -0.078126,0.02734 -0.203126,0.07813 -0.253907,0.128906 l -0.027343,0 0,0.02344 -0.023438,0 -0.027344,0.02734 0,0.02734 c -0.050781,0.05078 -0.101562,0.152343 -0.101562,0.226562 z m 0,19.96875 C 4.617188,1.171875 4.667969,1.300781 4.71875,1.351562 l 0,0.027344 0.023438,0 0,0.023438 0.027343,0.027344 0.023438,0 C 4.84375,1.480469 4.945312,1.53125 5.023438,1.53125 l -0.433594,0 z m 0,0"
           style="stroke:none" />
      </symbol>
      <symbol
         style="overflow:visible"
         id="glyph2-0"
         overflow="visible">
        <path
           id="path90"
           d="m 8.160156,-19.890625 c -0.078125,0 -0.179687,0.02734 -0.230468,0.05078 l -2.039063,1.019532 c -0.050781,0.02734 -0.101563,0.07812 -0.128906,0.101562 l -1.019531,1.023438 c -0.023438,0.02344 -0.074219,0.07422 -0.101563,0.125 l -1.019531,2.039062 c -0.027344,0.05469 -0.050782,0.15625 -0.050782,0.230469 l 0,1.019531 c 0,0.28125 0.230469,0.511719 0.507813,0.511719 0.28125,0 0.511719,-0.230469 0.511719,-0.511719 l 0,-0.890625 0.917968,-1.863281 0.917969,-0.917969 1.863281,-0.917969 3.824219,0 1.859375,0.917969 0.917969,0.917969 0.917969,1.863281 0,1.785156 -0.941406,1.910157 -2.015626,2.984374 L 2.703125,1.683594 C 2.625,1.757812 2.550781,1.914062 2.550781,2.039062 c 0,0.28125 0.230469,0.511719 0.507813,0.511719 l 14.28125,0 c 0.28125,0 0.511718,-0.230469 0.511718,-0.511719 0,-0.28125 -0.230468,-0.507812 -0.511718,-0.507812 l -13.054688,0 9.332032,-9.335938 0.07812,-0.074218 2.039063,-3.0625 c 0,-0.02344 0.02344,-0.02344 0.02344,-0.05078 l 1.019532,-2.039062 c 0.02734,-0.05078 0.05078,-0.152344 0.05078,-0.230469 l 0,-2.039062 c 0,-0.07422 -0.02344,-0.175781 -0.05078,-0.230469 l -1.019532,-2.039062 c -0.02344,-0.05078 -0.07422,-0.101563 -0.101562,-0.125 l -1.019531,-1.023438 c -0.02344,-0.02344 -0.07813,-0.07422 -0.128907,-0.101562 l -2.039062,-1.019532 c -0.05078,-0.02344 -0.152344,-0.05078 -0.230469,-0.05078 z m 0,0"
           style="stroke:none" />
      </symbol>
      <symbol
         style="overflow:visible"
         id="glyph2-1"
         overflow="visible">
        <path
           id="path93"
           d="m 10.199219,-19.890625 c -0.05078,0 -0.101563,0 -0.152344,0.02734 l -3.058594,1.019531 c -0.101562,0.02344 -0.230469,0.125 -0.28125,0.203125 l -2.039062,3.058594 c -0.027344,0.05078 -0.078125,0.128906 -0.078125,0.179687 l -1.019532,5.101563 0,5.199219 c 0,0.050781 0,0.128906 0.023438,0.179687 l 0,0.027344 1.023438,4.003906 c 0.023437,0.074219 0.074218,0.175781 0.125,0.226563 L 6.78125,1.378906 c 0.054688,0.050782 0.15625,0.101563 0.207031,0.125 l 3.058594,1.019532 c 0.05078,0.027343 0.101563,0.027343 0.152344,0.027343 l 1.019531,0 c 0.05078,0 0.101562,0 0.152344,-0.027343 l 3.0625,-1.019532 c 0.05078,-0.023437 0.152344,-0.074218 0.203125,-0.125 l 2.039062,-2.042968 c 0.05078,-0.050782 0.101563,-0.152344 0.128907,-0.203126 l 1.019531,-3.058593 c 0.02734,-0.050781 0.02734,-0.101563 0.02734,-0.152344 l 0,-1.023437 c 0,-0.050782 0,-0.101563 -0.02734,-0.152344 L 16.804688,-8.3125 c -0.02734,-0.050781 -0.07813,-0.152344 -0.128907,-0.203125 l -2.039062,-2.042969 c -0.05078,-0.05078 -0.152344,-0.101562 -0.203125,-0.125 l -3.0625,-1.019531 c -0.05078,-0.02734 -0.101563,-0.02734 -0.152344,-0.02734 l -1.019531,0 c -0.05078,0 -0.101563,0 -0.152344,0.02734 l -3.058594,1.019531 c -0.050781,0.02344 -0.152343,0.07422 -0.207031,0.125 l -2.039062,2.042969 c -0.050782,0.050781 -0.101563,0.152344 -0.125,0.203125 l -0.027344,0.074219 0,-1.910157 0.996094,-4.949218 1.886718,-2.828125 2.804688,-0.945313 1.886718,0 2.777344,0.917969 0.917969,1.863281 c 0.07813,0.179688 0.28125,0.304688 0.460937,0.304688 0.28125,0 0.507813,-0.230469 0.507813,-0.507813 0,-0.07813 -0.02344,-0.207031 -0.05078,-0.257812 l -1.019532,-2.039063 c -0.05078,-0.101562 -0.203124,-0.230468 -0.304687,-0.253906 l -3.058594,-1.019531 c -0.05078,-0.02734 -0.105469,-0.02734 -0.15625,-0.02734 z m 0.07813,9.179687 0.867187,0 2.855469,0.96875 1.859375,1.863282 0.96875,2.855468 0,0.867188 -0.96875,2.855469 L 14,0.5625 l -2.855469,0.96875 -0.867187,0 L 7.421875,0.5625 5.558594,-1.273438 4.617188,-5.074219 5.558594,-7.878906 7.421875,-9.742188 Z m 0,0"
           style="stroke:none" />
      </symbol>
      <symbol
         style="overflow:visible"
         id="glyph2-2"
         overflow="visible">
        <path
           id="path96"
           d="m 5.101562,-19.890625 c -0.28125,0 -0.511718,0.230469 -0.511718,0.511719 0,0.28125 0.230468,0.507812 0.511718,0.507812 l 10.199219,0 -5.507812,7.34375 c -0.050781,0.07813 -0.101563,0.207032 -0.101563,0.308594 0,0.277344 0.226563,0.507812 0.507813,0.507812 l 2.933593,0 1.859376,0.917969 0.867187,0.894531 0.96875,2.855469 0,1.886719 -0.96875,2.855469 L 14,0.5625 l -2.855469,0.96875 -2.90625,0 L 5.378906,0.5625 4.488281,-0.304688 3.519531,-2.269531 c -0.078125,-0.179688 -0.28125,-0.304688 -0.460937,-0.304688 -0.277344,0 -0.507813,0.226563 -0.507813,0.507813 0,0.078125 0.023438,0.203125 0.050781,0.257812 l 1.019532,2.039063 c 0.027344,0.050781 0.078125,0.101562 0.101562,0.125 l 1.019532,1.023437 c 0.050781,0.050782 0.152343,0.101563 0.203124,0.125 l 3.0625,1.019532 c 0.050782,0.027343 0.101563,0.027343 0.152344,0.027343 l 3.058594,0 c 0.05078,0 0.101562,0 0.152344,-0.027343 l 3.0625,-1.019532 c 0.05078,-0.023437 0.152344,-0.074218 0.203125,-0.125 l 2.039062,-2.042968 c 0.05078,-0.050782 0.101563,-0.152344 0.128907,-0.203126 l 1.019531,-3.058593 c 0.02734,-0.050781 0.02734,-0.101563 0.02734,-0.152344 l 0,-2.042969 c 0,-0.050781 0,-0.101562 -0.02734,-0.152344 l -1.019531,-3.058593 c -0.02734,-0.050781 -0.07813,-0.152344 -0.128907,-0.203125 l -1.019531,-1.023438 c -0.02344,-0.02344 -0.07422,-0.07422 -0.125,-0.101562 l -2.042969,-1.019532 c -0.05078,-0.02344 -0.152343,-0.05078 -0.226562,-0.05078 l -2.042969,0 5.507812,-7.34375 c 0.05078,-0.07813 0.101563,-0.203125 0.101563,-0.304687 0,-0.28125 -0.226563,-0.511719 -0.507813,-0.511719 z m 0,0"
           style="stroke:none" />
      </symbol>
      <symbol
         style="overflow:visible"
         id="glyph2-3"
         overflow="visible">
        <path
           id="path99"
           d="m 9.15625,-19.890625 -0.054688,0 c -0.023437,0 -0.101562,0.02734 -0.125,0.02734 l 0,0.02344 -3.007812,0.996094 c -0.105469,0.02344 -0.230469,0.125 -0.28125,0.203125 l -2.039062,3.058594 c -0.027344,0.05078 -0.078126,0.128906 -0.078126,0.179687 l -1.019531,5.101563 0,3.261719 1.019531,5.101562 c 0,0.050781 0.050782,0.128906 0.078126,0.179688 L 5.6875,1.300781 c 0.050781,0.078125 0.175781,0.179688 0.28125,0.203125 l 3.058594,1.019532 c 0.050781,0.027343 0.101562,0.027343 0.152344,0.027343 l 2.039062,0 c 0.05078,0 0.101562,0 0.152344,-0.027343 l 3.0625,-1.019532 c 0.101562,-0.023437 0.230468,-0.125 0.28125,-0.203125 l 2.039062,-3.058593 c 0.02344,-0.050782 0.07422,-0.128907 0.07422,-0.179688 l 1.023437,-5.101562 0,-3.261719 -1.023437,-5.101563 c 0,-0.05078 -0.05078,-0.128906 -0.07422,-0.179687 l -2.039062,-3.058594 c -0.05078,-0.07813 -0.179688,-0.179687 -0.28125,-0.203125 l -3.0625,-1.019531 c -0.05078,-0.02734 -0.101563,-0.02734 -0.152344,-0.02734 z m 0.101562,1.019531 1.886719,0 2.804688,0.945313 1.886719,2.828125 0.992187,4.949218 0,2.957032 -0.992187,4.949218 -1.886719,2.828126 -2.804688,0.945312 -1.886719,0 -2.804687,-0.945312 -1.886719,-2.828126 -0.996094,-4.949218 0,-2.957032 0.996094,-4.949218 1.886719,-2.828125 z m 0,0"
           style="stroke:none" />
      </symbol>
      <symbol
         style="overflow:visible"
         id="glyph2-4"
         overflow="visible">
        <path
           id="path102"
           d="m 9.128906,-19.890625 c -0.027344,0 -0.101562,0 -0.128906,0.02734 -0.023438,0 -0.050781,0.02344 -0.074219,0.05078 -0.101562,0.05078 -0.230469,0.175781 -0.253906,0.304688 L 0.535156,1.863281 C 0.511719,1.914062 0.511719,2.015625 0.511719,2.066406 c 0,0.28125 0.226562,0.507813 0.507812,0.507813 0.203125,0 0.433594,-0.152344 0.484375,-0.355469 l 2.574219,-6.808594 10.203125,0 2.574219,6.808594 c 0.05078,0.203125 0.28125,0.355469 0.484375,0.355469 0.28125,0 0.511718,-0.226563 0.511718,-0.507813 0,-0.050781 0,-0.152344 -0.02734,-0.203125 L 9.691406,-19.507812 C 9.664062,-19.609375 9.5625,-19.761719 9.484375,-19.8125 9.433594,-19.86328 9.308594,-19.89063 9.230469,-19.89063 Z m 0.050782,1.9375 4.691406,12.34375 -9.382813,0 z m 0,0"
           style="stroke:none" />
      </symbol>
      <symbol
         style="overflow:visible"
         id="glyph2-5"
         overflow="visible">
        <path
           id="path105"
           d="m 17.339844,-19.914062 c -0.203125,0 -0.433594,0.175781 -0.484375,0.355468 L 9.179688,0.613281 1.503906,-19.558594 c -0.074218,-0.179687 -0.28125,-0.332031 -0.484375,-0.332031 l -0.050781,0 c -0.253906,0.02734 -0.457031,0.253906 -0.457031,0.511719 0,0.05078 0,0.125 0.023437,0.175781 L 8.671875,2.167969 c 0.023437,0.101562 0.125,0.253906 0.203125,0.304687 0.050781,0.050782 0.175781,0.078125 0.253906,0.078125 l 0.078125,0 c 0.050781,0 0.101563,0 0.152344,-0.027343 C 9.382812,2.523438 9.410156,2.5 9.433594,2.472656 9.535156,2.421875 9.664062,2.296875 9.691406,2.167969 l 8.132813,-21.371094 c 0.02734,-0.05078 0.02734,-0.152344 0.02734,-0.203125 0,-0.28125 -0.230468,-0.507812 -0.511718,-0.507812 z m 0,0"
           style="stroke:none" />
      </symbol>
      <symbol
         style="overflow:visible"
         id="glyph2-6"
         overflow="visible">
        <path
           id="path108"
           d="m 4.078125,-19.890625 c -0.101563,0 -0.253906,0.05078 -0.328125,0.128906 l -0.027344,0 0,0.02344 -0.023437,0 -0.027344,0.02734 0,0.02344 c -0.050781,0.07813 -0.101563,0.207031 -0.101563,0.308594 l 0,21.417968 c 0,0.28125 0.230469,0.511719 0.507813,0.511719 0.28125,0 0.511719,-0.230469 0.511719,-0.511719 l 0,-10.710937 6.351562,0 6.984375,10.992187 c 0.07813,0.152344 0.28125,0.253907 0.433594,0.253907 0.28125,0 0.511719,-0.226563 0.511719,-0.507813 0,-0.078125 -0.02734,-0.230468 -0.07813,-0.308594 l -6.65625,-10.429687 1.125,0 c 0.05078,0 0.101562,0 0.152343,-0.023437 l 3.058594,-1.019532 c 0.05078,-0.027344 0.152344,-0.078125 0.203125,-0.128906 l 1.019531,-1.019531 c 0.02734,-0.02344 0.07813,-0.07813 0.105469,-0.128907 l 1.019531,-2.039062 c 0.02344,-0.05078 0.05078,-0.152344 0.05078,-0.230469 l 0,-2.039062 c 0,-0.07422 -0.02734,-0.175781 -0.05078,-0.230469 l -1.019531,-2.039062 c -0.02734,-0.05078 -0.07813,-0.101563 -0.105469,-0.125 l -1.019531,-1.023438 c -0.05078,-0.05078 -0.152343,-0.101562 -0.203125,-0.125 l -3.058594,-1.019531 c -0.05078,-0.02734 -0.101562,-0.02734 -0.152343,-0.02734 z m 0.511719,1.019531 8.59375,0 2.855468,0.96875 0.894532,0.867188 0.917968,1.863281 0,1.785156 -0.917968,1.859375 -0.894532,0.867188 -2.855468,0.96875 -8.59375,0 z m 0,0"
           style="stroke:none" />
      </symbol>
      <symbol
         style="overflow:visible"
         id="glyph2-7"
         overflow="visible">
        <path
           id="path111"
           d="m 4.078125,-19.890625 c -0.277344,0 -0.507813,0.230469 -0.507813,0.511719 l 0,21.417968 c 0,0.28125 0.230469,0.511719 0.507813,0.511719 0.28125,0 0.511719,-0.230469 0.511719,-0.511719 l 0,-21.417968 c 0,-0.28125 -0.230469,-0.511719 -0.511719,-0.511719 z m 0,0"
           style="stroke:none" />
      </symbol>
      <symbol
         style="overflow:visible"
         id="glyph2-8"
         overflow="visible">
        <path
           id="path114"
           d="m 3.570312,-19.378906 0,21.417968 c 0,0.101563 0.050782,0.257813 0.128907,0.332032 l 0,0.027344 0.023437,0 0,0.023437 0.027344,0.027344 0.023438,0 C 3.851562,2.5 3.976562,2.550781 4.078125,2.550781 l 12.242187,0 c 0.28125,0 0.507813,-0.230469 0.507813,-0.511719 0,-0.28125 -0.226563,-0.507812 -0.507813,-0.507812 l -11.730468,0 0,-20.910156 c 0,-0.28125 -0.230469,-0.511719 -0.511719,-0.511719 -0.277344,0 -0.507813,0.230469 -0.507813,0.511719 z m 0,0"
           style="stroke:none" />
      </symbol>
      <symbol
         style="overflow:visible"
         id="glyph2-9"
         overflow="visible">
        <path
           id="path117"
           d="m 11.195312,-19.890625 c -0.101562,0 -0.253906,0.07813 -0.332031,0.152344 l -3.007812,3.011719 -1.964844,0.96875 c -0.179687,0.07422 -0.304687,0.28125 -0.304687,0.457031 0,0.28125 0.226562,0.511719 0.507812,0.511719 0.078125,0 0.203125,-0.02734 0.253906,-0.05078 l 2.042969,-1.019531 c 0.050781,-0.02734 0.101563,-0.07813 0.125,-0.105469 l 2.195313,-2.191406 0,20.195312 c 0,0.28125 0.230468,0.511719 0.507812,0.511719 0.28125,0 0.511719,-0.230469 0.511719,-0.511719 l 0,-21.417968 c 0,-0.28125 -0.253907,-0.511719 -0.535157,-0.511719 z m 0,0"
           style="stroke:none" />
      </symbol>
      <symbol
         style="overflow:visible"
         id="glyph2-10"
         overflow="visible">
        <path
           id="path120"
           d="m 8.132812,-19.890625 -0.050781,0 c -0.023437,0 -0.101562,0.02734 -0.125,0.02734 l 0,0.02344 -3.011719,0.996094 c -0.101562,0.02344 -0.253906,0.152344 -0.304687,0.253906 l -1.019531,2.039063 C 3.59375,-16.5 3.570312,-16.398438 3.570312,-16.320312 l 0,2.039062 c 0,0.07813 0.023438,0.179688 0.050782,0.230469 l 1.019531,2.039062 c 0.050781,0.07813 0.152344,0.179688 0.230469,0.230469 l 2.039062,1.019531 c 0.027344,0.02734 0.078125,0.02734 0.101563,0.02734 l 1.226562,0.304687 -2.269531,0.765626 c -0.054688,0.023441 -0.15625,0.074222 -0.207031,0.12891 l -2.039063,2.039062 c -0.023437,0.023438 -0.074218,0.074219 -0.101562,0.125 l -1.019532,2.042969 c -0.027343,0.050781 -0.050781,0.152344 -0.050781,0.226563 l 0,3.0625 c 0,0.074218 0.023438,0.175781 0.050781,0.230468 l 1.019532,2.039063 c 0.027344,0.050781 0.078125,0.101562 0.101562,0.125 l 1.019532,1.023437 c 0.050781,0.050782 0.152343,0.101563 0.203124,0.125 l 3.0625,1.019532 c 0.050782,0.027343 0.101563,0.027343 0.152344,0.027343 l 4.078125,0 c 0.05078,0 0.105469,0 0.15625,-0.027343 l 3.058594,-1.019532 c 0.05078,-0.023437 0.152344,-0.074218 0.203125,-0.125 l 1.019531,-1.023437 c 0.02734,-0.023438 0.07813,-0.074219 0.101563,-0.125 l 1.023437,-2.039063 c 0.02344,-0.054687 0.05078,-0.15625 0.05078,-0.230468 l 0,-3.0625 c 0,-0.074219 -0.02734,-0.175782 -0.05078,-0.226563 l -1.023437,-2.042969 c -0.02344,-0.050781 -0.07422,-0.101562 -0.101563,-0.125 l -2.039062,-2.039062 c -0.05078,-0.054688 -0.152344,-0.105469 -0.203125,-0.128906 l -2.269532,-0.765626 1.222657,-0.304687 c 0.02734,0 0.07813,0 0.101562,-0.02734 l 2.042969,-1.019531 c 0.07422,-0.05078 0.175781,-0.152344 0.226562,-0.230469 l 1.019532,-2.039062 c 0.02734,-0.05078 0.05078,-0.152344 0.05078,-0.230469 l 0,-2.039062 c 0,-0.07813 -0.02344,-0.179688 -0.05078,-0.230469 l -1.019532,-2.039063 c -0.05078,-0.101562 -0.203124,-0.230468 -0.304687,-0.253906 l -3.058594,-1.019531 c -0.05078,-0.02734 -0.105469,-0.02734 -0.15625,-0.02734 z m 0.105469,1.019531 3.925781,0 2.777344,0.917969 0.867188,1.761719 0,1.785156 -0.890625,1.785156 -1.835938,0.917969 -2.882812,0.710937 -2.878907,-0.710937 -1.835937,-0.917969 -0.894531,-1.785156 0,-1.785156 0.867187,-1.761719 z m 2.828125,9.15625 L 14,-8.722656 l 1.910156,1.886718 0.917969,1.863282 0,2.804687 -0.917969,1.863281 -0.890625,0.867188 -2.855469,0.96875 -3.925781,0 L 5.378906,0.5625 4.488281,-0.304688 3.570312,-2.167969 l 0,-2.804687 0.917969,-1.863282 1.914063,-1.886718 2.929687,-0.992188 c 0,0 0.867188,-0.203125 0.867188,-0.203125 0,0 0.867187,0.203125 0.867187,0.203125 z m 0,0"
           style="stroke:none" />
      </symbol>
      <symbol
         style="overflow:visible"
         id="glyph2-11"
         overflow="visible">
        <path
           id="path123"
           d=""
           style="stroke:none" />
      </symbol>
      <symbol
         style="overflow:visible"
         id="glyph2-12"
         overflow="visible">
        <path
           id="path126"
           d="m 21.421875,-10.710938 c 0.277344,0 0.507813,0.230469 0.507813,0.511719 l 0,2.039063 c 0,0.050781 0,0.101562 -0.02344,0.152344 l 0,0.027343 -1.023438,3.035157 c -0.02344,0.101562 -0.152343,0.253906 -0.253906,0.304687 l -2.039062,1.019531 c -0.05078,0.027344 -0.152344,0.050782 -0.230469,0.050782 l -2.039063,0 c -0.07812,0 -0.179687,-0.023438 -0.230468,-0.050782 l -2.039063,-1.019531 c -0.02734,0 -0.05078,-0.027344 -0.07813,-0.050781 l -4.05468,-3.035156 -1.886719,-0.945313 -1.785156,0 -1.785156,0.894531 -0.890626,1.785156 0,1.914063 c 0,0.277344 -0.230468,0.507813 -0.511718,0.507813 -0.277344,0 -0.507813,-0.230469 -0.507813,-0.507813 l 0,-2.042969 c 0,-0.050781 0,-0.101562 0.023438,-0.152344 l 0,-0.023437 1.019531,-3.035156 C 3.621094,-9.433594 3.75,-9.589844 3.851562,-9.640625 l 2.039063,-1.019531 c 0.050781,-0.02344 0.152344,-0.05078 0.230469,-0.05078 l 2.039062,0 c 0.078125,0 0.179688,0.02734 0.230469,0.05078 l 2.039063,1.019531 c 0.02344,0 0.05078,0.027344 0.07812,0.050781 l 4.050782,3.035156 1.890625,0.945313 1.785156,0 1.78125,-0.894531 0.894531,-1.785156 0,-1.910157 c 0,-0.28125 0.230469,-0.511719 0.511719,-0.511719 z m 0,0"
           style="stroke:none" />
      </symbol>
      <symbol
         style="overflow:visible"
         id="glyph4-0"
         overflow="visible">
        <path
           id="path129"
           d="m 0,-10.710938 c 0.078125,0 0.203125,0.02734 0.28125,0.07813 l 3.035156,2.039062 4.003906,1.988281 4.96875,0.996094 3.980469,0 4.972657,-0.996094 4.003906,-1.988281 3.035156,-2.039062 c 0.07422,-0.05078 0.203125,-0.07813 0.277344,-0.07813 0.28125,0 0.511718,0.230469 0.511718,0.511719 0,0.152344 -0.101562,0.355469 -0.230468,0.433594 l -3.058594,2.039063 c -0.02734,0 -0.02734,0.027343 -0.05078,0.027343 l -4.082031,2.039063 c -0.02344,0.023437 -0.101563,0.050781 -0.125,0.050781 l -5.101563,1.019531 -4.285156,0 -5.097657,-1.019531 c -0.027343,0 -0.101562,-0.027344 -0.128906,-0.050781 L 2.832031,-7.699219 c -0.027343,0 -0.027343,-0.027343 -0.050781,-0.027343 l -3.0625,-2.039063 c -0.125,-0.078125 -0.230469,-0.28125 -0.230469,-0.433594 0,-0.28125 0.230469,-0.511719 0.511719,-0.511719 z m 0,0"
           style="stroke:none" />
      </symbol>
      <symbol
         style="overflow:visible"
         id="glyph4-1"
         overflow="visible">
        <path
           id="path132"
           d="m 12.238281,-9.691406 4.183594,0 5.101563,1.019531 c 0.02344,0 0.101562,0.027344 0.125,0.054687 l 4.082031,2.039063 c 0.02344,0 0.02344,0.023437 0.05078,0.023437 l 3.058594,2.042969 c 0.128906,0.074219 0.230468,0.277344 0.230468,0.433594 0,0.277344 -0.230468,0.507813 -0.511718,0.507813 -0.07422,0 -0.203125,-0.023438 -0.277344,-0.078126 L 25.246093,-5.6875 21.242187,-7.675781 16.26953,-8.671875 l -3.980469,0 -4.96875,0.996094 L 3.316406,-5.6875 0.28125,-3.648438 C 0.203125,-3.59375 0.078125,-3.570312 0,-3.570312 c -0.28125,0 -0.511719,-0.230469 -0.511719,-0.507813 0,-0.15625 0.105469,-0.359375 0.230469,-0.433594 l 3.0625,-2.042969 c 0.023438,0 0.023438,-0.023437 0.050781,-0.023437 L 6.910156,-8.617188 C 6.9375,-8.644531 7.011719,-8.671875 7.039062,-8.671875 l 5.097657,-1.019531 z m 0,0"
           style="stroke:none" />
      </symbol>
    </g>
    <clipPath
       id="clip1">
      <path
         id="path135"
         d="m 29,29 784.80078,0 0,538 L 29,567 Z m 0,0" />
    </clipPath>
  </defs>
  <g
     transform="translate(-28.000012,-28)"
     id="surface990">
    <g
       style="clip-rule:nonzero"
       id="g138"
       clip-path="url(#clip1)">
      <path
         id="path140"
         d="m 29,29 784.80078,0 0,691.19922 -784.80078,0 z m 0,0"
         style="fill:#ffffff;fill-opacity:1;fill-rule:nonzero;stroke:none" />
    </g>
    <g
       transform="translate(0,48)"
       id="g142"
       style="fill:#000000;fill-opacity:1">
      <use
         height="100%"
         width="100%"
         id="use144"
         y="89.300003"
         x="260.51096"
         xlink:href="#glyph0-0" />
    </g>
    <g
       id="g146"
       style="fill:#000000;fill-opacity:1">
      <use
         height="100%"
         width="100%"
         id="use148"
         y="174.8"
         x="279.36877"
         xlink:href="#glyph1-0" />
    </g>
    <g
       id="g150"
       style="fill:#000000;fill-opacity:1">
      <use
         height="100%"
         width="100%"
         id="use152"
         y="174.8"
         x="289.56879"
         xlink:href="#glyph1-1" />
    </g>
    <g
       id="g154"
       style="fill:#000000;fill-opacity:1">
      <use
         height="100%"
         width="100%"
         id="use156"
         y="174.8"
         x="312.00888"
         xlink:href="#glyph1-2" />
    </g>
    <g
       id="g158"
       style="fill:#000000;fill-opacity:1">
      <use
         height="100%"
         width="100%"
         id="use160"
         y="174.8"
         x="330.36893"
         xlink:href="#glyph1-3" />
    </g>
    <g
       id="g162"
       style="fill:#000000;fill-opacity:1">
      <use
         height="100%"
         width="100%"
         id="use164"
         y="174.8"
         x="350.76901"
         xlink:href="#glyph1-4" />
    </g>
    <g
       id="g166"
       style="fill:#000000;fill-opacity:1">
      <use
         height="100%"
         width="100%"
         id="use168"
         y="174.8"
         x="371.16907"
         xlink:href="#glyph1-1" />
    </g>
    <g
       id="g170"
       style="fill:#000000;fill-opacity:1">
      <use
         height="100%"
         width="100%"
         id="use172"
         y="174.8"
         x="393.60916"
         xlink:href="#glyph1-5" />
    </g>
    <g
       id="g174"
       style="fill:#000000;fill-opacity:1">
      <use
         height="100%"
         width="100%"
         id="use176"
         y="174.8"
         x="414.00922"
         xlink:href="#glyph1-2" />
    </g>
    <g
       id="g178"
       style="fill:#000000;fill-opacity:1">
      <use
         height="100%"
         width="100%"
         id="use180"
         y="174.8"
         x="432.36929"
         xlink:href="#glyph1-0" />
    </g>
    <g
       id="g182"
       style="fill:#000000;fill-opacity:1">
      <use
         height="100%"
         width="100%"
         id="use184"
         y="174.8"
         x="442.56934"
         xlink:href="#glyph1-6" />
    </g>
    <g
       id="g186"
       style="fill:#000000;fill-opacity:1">
      <use
         height="100%"
         width="100%"
         id="use188"
         y="174.8"
         x="465.0094"
         xlink:href="#glyph1-1" />
    </g>
    <g
       id="g190"
       style="fill:#000000;fill-opacity:1">
      <use
         height="100%"
         width="100%"
         id="use192"
         y="174.8"
         x="487.44946"
         xlink:href="#glyph1-5" />
    </g>
    <g
       id="g194"
       style="fill:#000000;fill-opacity:1">
      <use
         height="100%"
         width="100%"
         id="use196"
         y="174.8"
         x="507.84955"
         xlink:href="#glyph1-7" />
    </g>
    <g
       id="g198"
       style="fill:#000000;fill-opacity:1">
      <use
         height="100%"
         width="100%"
         id="use200"
         y="174.8"
         x="524.16876"
         xlink:href="#glyph1-8" />
    </g>
    <g
       id="g202"
       style="fill:#000000;fill-opacity:1">
      <use
         height="100%"
         width="100%"
         id="use204"
         y="212.60001"
         x="419.12189"
         xlink:href="#glyph1-8" />
    </g>
    <g
       id="g206"
       style="fill:#000000;fill-opacity:1">
      <use
         height="100%"
         width="100%"
         id="use208"
         y="212.60001"
         x="435.44196"
         xlink:href="#glyph1-3" />
    </g>
    <g
       id="g210"
       style="fill:#000000;fill-opacity:1">
      <use
         height="100%"
         width="100%"
         id="use212"
         y="212.60001"
         x="455.84201"
         xlink:href="#glyph1-2" />
    </g>
    <g
       id="g214"
       style="fill:#000000;fill-opacity:1">
      <use
         height="100%"
         width="100%"
         id="use216"
         y="212.60001"
         x="474.20209"
         xlink:href="#glyph1-8" />
    </g>
    <g
       id="g218"
       style="fill:#000000;fill-opacity:1">
      <use
         height="100%"
         width="100%"
         id="use220"
         y="212.60001"
         x="490.52213"
         xlink:href="#glyph1-9" />
    </g>
    <g
       id="g222"
       style="fill:#000000;fill-opacity:1">
      <use
         height="100%"
         width="100%"
         id="use224"
         y="212.60001"
         x="512.96222"
         xlink:href="#glyph1-3" />
    </g>
    <g
       id="g226"
       style="fill:#000000;fill-opacity:1">
      <use
         height="100%"
         width="100%"
         id="use228"
         y="250.40001"
         x="272.23907"
         xlink:href="#glyph1-10" />
    </g>
    <g
       id="g230"
       style="fill:#000000;fill-opacity:1">
      <use
         height="100%"
         width="100%"
         id="use232"
         y="250.40001"
         x="292.63916"
         xlink:href="#glyph1-11" />
    </g>
    <g
       id="g234"
       style="fill:#000000;fill-opacity:1">
      <use
         height="100%"
         width="100%"
         id="use236"
         y="250.40001"
         x="315.07922"
         xlink:href="#glyph1-6" />
    </g>
    <g
       id="g238"
       style="fill:#000000;fill-opacity:1">
      <use
         height="100%"
         width="100%"
         id="use240"
         y="250.40001"
         x="337.51929"
         xlink:href="#glyph1-2" />
    </g>
    <g
       id="g242"
       style="fill:#000000;fill-opacity:1">
      <use
         height="100%"
         width="100%"
         id="use244"
         y="250.40001"
         x="355.87936"
         xlink:href="#glyph1-6" />
    </g>
    <g
       id="g246"
       style="fill:#000000;fill-opacity:1">
      <use
         height="100%"
         width="100%"
         id="use248"
         y="250.40001"
         x="378.31943"
         xlink:href="#glyph1-12" />
    </g>
    <g
       id="g250"
       style="fill:#000000;fill-opacity:1">
      <use
         height="100%"
         width="100%"
         id="use252"
         y="250.40001"
         x="400.75949"
         xlink:href="#glyph1-4" />
    </g>
    <g
       id="g254"
       style="fill:#000000;fill-opacity:1">
      <use
         height="100%"
         width="100%"
         id="use256"
         y="250.40001"
         x="421.15958"
         xlink:href="#glyph1-5" />
    </g>
    <g
       id="g258"
       style="fill:#000000;fill-opacity:1">
      <use
         height="100%"
         width="100%"
         id="use260"
         y="250.40001"
         x="441.55966"
         xlink:href="#glyph1-10" />
    </g>
    <g
       id="g262"
       style="fill:#000000;fill-opacity:1">
      <use
         height="100%"
         width="100%"
         id="use264"
         y="250.40001"
         x="461.95972"
         xlink:href="#glyph1-11" />
    </g>
    <g
       id="g266"
       style="fill:#000000;fill-opacity:1">
      <use
         height="100%"
         width="100%"
         id="use268"
         y="250.40001"
         x="484.39978"
         xlink:href="#glyph1-0" />
    </g>
    <g
       id="g270"
       style="fill:#000000;fill-opacity:1">
      <use
         height="100%"
         width="100%"
         id="use272"
         y="250.40001"
         x="494.59982"
         xlink:href="#glyph1-3" />
    </g>
    <g
       id="g274"
       style="fill:#000000;fill-opacity:1">
      <use
         height="100%"
         width="100%"
         id="use276"
         y="250.40001"
         x="514.98596"
         xlink:href="#glyph1-8" />
    </g>
    <g
       id="g278"
       style="fill:#000000;fill-opacity:1">
      <use
         height="100%"
         width="100%"
         id="use280"
         y="288.20001"
         x="477.27032"
         xlink:href="#glyph1-13" />
    </g>
    <g
       id="g282"
       style="fill:#000000;fill-opacity:1">
      <use
         height="100%"
         width="100%"
         id="use284"
         y="326"
         x="289.05783"
         xlink:href="#glyph2-0" />
    </g>
    <g
       id="g286"
       style="fill:#000000;fill-opacity:1">
      <use
         height="100%"
         width="100%"
         id="use288"
         y="326"
         x="309.45792"
         xlink:href="#glyph2-1" />
    </g>
    <g
       id="g290"
       style="fill:#000000;fill-opacity:1">
      <use
         height="100%"
         width="100%"
         id="use292"
         y="326"
         x="346.17804"
         xlink:href="#glyph3-1" />
    </g>
    <g
       id="g294"
       style="fill:#000000;fill-opacity:1">
      <use
         height="100%"
         width="100%"
         id="use296"
         y="326"
         x="377.7981"
         xlink:href="#glyph2-2" />
    </g>
    <g
       id="g298"
       style="fill:#000000;fill-opacity:1">
      <use
         height="100%"
         width="100%"
         id="use300"
         y="326"
         x="398.19815"
         xlink:href="#glyph2-3" />
    </g>
    <g
       id="g302"
       style="fill:#000000;fill-opacity:1">
      <use
         height="100%"
         width="100%"
         id="use304"
         y="326"
         x="434.91827"
         xlink:href="#glyph2-4" />
    </g>
    <g
       id="g306"
       style="fill:#000000;fill-opacity:1">
      <use
         height="100%"
         width="100%"
         id="use308"
         y="326"
         x="453.27835"
         xlink:href="#glyph2-5" />
    </g>
    <g
       id="g310"
       style="fill:#000000;fill-opacity:1">
      <use
         height="100%"
         width="100%"
         id="use312"
         y="326"
         x="471.63843"
         xlink:href="#glyph2-6" />
    </g>
    <g
       id="g314"
       style="fill:#000000;fill-opacity:1">
      <use
         height="100%"
         width="100%"
         id="use316"
         y="326"
         x="492.03848"
         xlink:href="#glyph2-7" />
    </g>
    <g
       id="g318"
       style="fill:#000000;fill-opacity:1">
      <use
         height="100%"
         width="100%"
         id="use320"
         y="326"
         x="500.19852"
         xlink:href="#glyph2-8" />
    </g>
    <g
       id="g322"
       style="fill:#000000;fill-opacity:1">
      <use
         height="100%"
         width="100%"
         id="use324"
         y="363.80002"
         x="360.97345"
         xlink:href="#glyph2-0" />
    </g>
    <g
       id="g326"
       style="fill:#000000;fill-opacity:1">
      <use
         height="100%"
         width="100%"
         id="use328"
         y="363.80002"
         x="381.37354"
         xlink:href="#glyph2-3" />
    </g>
    <g
       id="g330"
       style="fill:#000000;fill-opacity:1">
      <use
         height="100%"
         width="100%"
         id="use332"
         y="363.80002"
         x="401.77359"
         xlink:href="#glyph2-9" />
    </g>
    <g
       id="g334"
       style="fill:#000000;fill-opacity:1">
      <use
         height="100%"
         width="100%"
         id="use336"
         y="363.80002"
         x="422.17368"
         xlink:href="#glyph2-10" />
    </g>
    <g
       id="g338"
       style="fill:#000000;fill-opacity:1">
      <use
         height="100%"
         width="100%"
         id="use340"
         y="363.80002"
         x="442.56409"
         xlink:href="#glyph2-11" />
    </g>
    <g
       transform="translate(-12.8,-73.6)"
       id="g346"
       style="fill:#000000;fill-opacity:1">
      <use
         height="100%"
         width="100%"
         id="use348"
         y="460.10001"
         x="514.77502"
         xlink:href="#glyph0-1" />
    </g>
    <g
       id="g354"
       style="fill:#613f07;fill-opacity:1">
      <use
         height="100%"
         width="100%"
         id="use356"
         y="506.90002"
         x="393.61252"
         xlink:href="#glyph1-8" />
    </g>
    <g
       id="g362"
       style="fill:#000000;fill-opacity:1">
      <use
         height="100%"
         width="100%"
         id="use364"
         y="143.3"
         x="291.57501"
         xlink:href="#glyph1-14" />
    </g>
    <g
       id="g366"
       style="fill:#000000;fill-opacity:1">
      <use
         height="100%"
         width="100%"
         id="use368"
         y="141.5"
         x="311.97971"
         xlink:href="#glyph1-14" />
    </g>
    <g
       id="g370"
       style="fill:#000000;fill-opacity:1">
      <use
         height="100%"
         width="100%"
         id="use372"
         y="138.8"
         x="332.3844"
         xlink:href="#glyph1-15" />
    </g>
    <g
       id="g374"
       style="fill:#000000;fill-opacity:1">
      <use
         height="100%"
         width="100%"
         id="use376"
         y="137.90001"
         x="350.75"
         xlink:href="#glyph1-8" />
    </g>
    <g
       id="g378"
       style="fill:#000000;fill-opacity:1">
      <use
         height="100%"
         width="100%"
         id="use380"
         y="137"
         x="367.07657"
         xlink:href="#glyph1-16" />
    </g>
    <g
       id="g382"
       style="fill:#000000;fill-opacity:1">
      <use
         height="100%"
         width="100%"
         id="use384"
         y="126.2"
         x="385.4422"
         xlink:href="#glyph1-3" />
    </g>
    <g
       id="g386"
       style="fill:#000000;fill-opacity:1">
      <use
         height="100%"
         width="100%"
         id="use388"
         y="137"
         x="405.84689"
         xlink:href="#glyph1-17" />
    </g>
    <g
       id="g390"
       style="fill:#000000;fill-opacity:1">
      <use
         height="100%"
         width="100%"
         id="use392"
         y="137"
         x="426.25159"
         xlink:href="#glyph1-2" />
    </g>
    <g
       id="g394"
       style="fill:#000000;fill-opacity:1">
      <use
         height="100%"
         width="100%"
         id="use396"
         y="137.90001"
         x="444.61722"
         xlink:href="#glyph1-0" />
    </g>
    <g
       id="g398"
       style="fill:#000000;fill-opacity:1">
      <use
         height="100%"
         width="100%"
         id="use400"
         y="139.7"
         x="454.82657"
         xlink:href="#glyph1-18" />
    </g>
    <g
       id="g402"
       style="fill:#000000;fill-opacity:1">
      <use
         height="100%"
         width="100%"
         id="use404"
         y="141.5"
         x="475.23126"
         xlink:href="#glyph1-5" />
    </g>
    <g
       id="g406"
       style="fill:#000000;fill-opacity:1">
      <use
         height="100%"
         width="100%"
         id="use408"
         y="144.2"
         x="495.63596"
         xlink:href="#glyph1-7" />
    </g>
    <g
       id="g410"
       style="fill:#000000;fill-opacity:1">
      <use
         height="100%"
         width="100%"
         id="use412"
         y="210.8"
         x="270.17188"
         xlink:href="#glyph1-9" />
    </g>
    <g
       id="g414"
       style="fill:#000000;fill-opacity:1">
      <use
         height="100%"
         width="100%"
         id="use416"
         y="211.70001"
         x="292.61563"
         xlink:href="#glyph1-3" />
    </g>
    <g
       id="g418"
       style="fill:#000000;fill-opacity:1">
      <use
         height="100%"
         width="100%"
         id="use420"
         y="212.60001"
         x="313.02032"
         xlink:href="#glyph1-8" />
    </g>
    <g
       id="g422"
       style="fill:#000000;fill-opacity:1">
      <use
         height="100%"
         width="100%"
         id="use424"
         y="212.60001"
         x="329.34689"
         xlink:href="#glyph1-19" />
    </g>
    <g
       id="g426"
       style="fill:#000000;fill-opacity:1">
      <use
         height="100%"
         width="100%"
         id="use428"
         y="212.60001"
         x="353.82971"
         xlink:href="#glyph1-6" />
    </g>
    <g
       id="g430"
       style="fill:#000000;fill-opacity:1">
      <use
         height="100%"
         width="100%"
         id="use432"
         y="211.70001"
         x="376.27347"
         xlink:href="#glyph1-9" />
    </g>
    <g
       id="g434"
       style="fill:#000000;fill-opacity:1">
      <use
         height="100%"
         width="100%"
         id="use436"
         y="210.8"
         x="398.71719"
         xlink:href="#glyph1-3" />
    </g>
    <g
       id="g438"
       style="fill:#000000;fill-opacity:1">
      <use
         height="100%"
         width="100%"
         id="use440"
         y="292.70001"
         x="299.74533"
         xlink:href="#glyph1-8" />
    </g>
    <g
       id="g442"
       style="fill:#000000;fill-opacity:1">
      <use
         height="100%"
         width="100%"
         id="use444"
         y="290.90002"
         x="316.0719"
         xlink:href="#glyph1-20" />
    </g>
    <g
       id="g446"
       style="fill:#000000;fill-opacity:1">
      <use
         height="100%"
         width="100%"
         id="use448"
         y="289.10001"
         x="336.47659"
         xlink:href="#glyph1-8" />
    </g>
    <g
       id="g450"
       style="fill:#000000;fill-opacity:1">
      <use
         height="100%"
         width="100%"
         id="use452"
         y="288.20001"
         x="352.80313"
         xlink:href="#glyph1-11" />
    </g>
    <g
       id="g454"
       style="fill:#000000;fill-opacity:1">
      <use
         height="100%"
         width="100%"
         id="use456"
         y="288.20001"
         x="375.24689"
         xlink:href="#glyph1-21" />
    </g>
    <g
       id="g458"
       style="fill:#000000;fill-opacity:1">
      <use
         height="100%"
         width="100%"
         id="use460"
         y="288.20001"
         x="395.65158"
         xlink:href="#glyph1-22" />
    </g>
    <g
       id="g462"
       style="fill:#000000;fill-opacity:1">
      <use
         height="100%"
         width="100%"
         id="use464"
         y="289.10001"
         x="416.05627"
         xlink:href="#glyph1-4" />
    </g>
    <g
       id="g466"
       style="fill:#000000;fill-opacity:1">
      <use
         height="100%"
         width="100%"
         id="use468"
         y="290"
         x="436.46094"
         xlink:href="#glyph1-3" />
    </g>
    <g
       id="g470"
       style="fill:#000000;fill-opacity:1">
      <use
         height="100%"
         width="100%"
         id="use472"
         y="291.79999"
         x="456.86566"
         xlink:href="#glyph1-17" />
    </g>
  </g>
</svg>
