<?xml version="1.0" encoding="UTF-8" standalone="no"?>
<svg
   xmlns:dc="http://purl.org/dc/elements/1.1/"
   xmlns:cc="http://creativecommons.org/ns#"
   xmlns:rdf="http://www.w3.org/1999/02/22-rdf-syntax-ns#"
   xmlns:svg="http://www.w3.org/2000/svg"
   xmlns="http://www.w3.org/2000/svg"
   xmlns:xlink="http://www.w3.org/1999/xlink"
   xmlns:sodipodi="http://sodipodi.sourceforge.net/DTD/sodipodi-0.dtd"
   xmlns:inkscape="http://www.inkscape.org/namespaces/inkscape"
   id="svg2"
   version="1.1"
   viewBox="0 0 1412.493 76.197487"
   height="76.197487pt"
   width="1412.493pt"
   inkscape:version="0.91 r13725"
   sodipodi:docname="LOGOEN_BASELINE_BLACK.svg">
  <sodipodi:namedview
     pagecolor="#ffffff"
     bordercolor="#666666"
     borderopacity="1"
     objecttolerance="10"
     gridtolerance="10"
     guidetolerance="10"
     inkscape:pageopacity="0"
     inkscape:pageshadow="2"
     inkscape:window-width="1407"
     inkscape:window-height="876"
     id="namedview285"
     showgrid="false"
     inkscape:zoom="0.21408955"
     inkscape:cx="882.80815"
     inkscape:cy="47.623429"
     inkscape:window-x="33"
     inkscape:window-y="24"
     inkscape:window-maximized="1"
     inkscape:current-layer="svg2" />
  <metadata
     id="metadata596">
    <rdf:RDF>
      <cc:Work
         rdf:about="">
        <dc:format>image/svg+xml</dc:format>
        <dc:type
           rdf:resource="http://purl.org/dc/dcmitype/StillImage" />
        <dc:title></dc:title>
      </cc:Work>
    </rdf:RDF>
  </metadata>
  <defs
     id="defs4">
    <g
       id="g6">
      <symbol
         style="overflow:visible"
         id="glyph4-0"
         overflow="visible">
        <path
           id="path9"
           d="m 0.859375,0 0,-17.328125 6.90625,0 0,17.328125 z m 0.875,-0.859375 5.171875,0 0,-15.609375 -5.171875,0 z m 0,0"
           style="stroke:none" />
      </symbol>
      <symbol
         style="overflow:visible"
         id="glyph4-1"
         overflow="visible">
        <path
           id="path12"
           d="m 13.171875,-6.703125 0,1.296875 -13.34375,0 0,-1.296875 z m 0,0"
           style="stroke:none" />
      </symbol>
      <symbol
         style="overflow:visible"
         id="glyph0-0"
         overflow="visible">
        <path
           id="path15"
           d="m 17.214844,-35.390625 c -0.09375,0 -0.191406,0 -0.285156,0.05078 l -5.738282,1.910156 c -0.04687,0 -0.191406,0.05078 -0.238281,0.09766 l -5.742187,3.824219 c -0.09375,0.05078 -0.238282,0.191406 -0.285157,0.289062 l -3.824219,5.738281 c -0.050781,0.04687 -0.097656,0.191407 -0.097656,0.238281 l -1.914062,5.738282 c -0.046875,0.09766 -0.046875,0.191406 -0.046875,0.289062 l 0,3.824219 c 0,0.527344 0.429687,0.957031 0.957031,0.957031 0.527344,0 0.957031,-0.429687 0.957031,-0.957031 l 0,-3.683594 1.816407,-5.449219 3.636718,-5.5 5.496094,-3.636718 5.453125,-1.816406 3.683594,0 c 0.523437,0 0.957031,-0.429688 0.957031,-0.957032 0,-0.523437 -0.433594,-0.957031 -0.957031,-0.957031 z m 0,0"
           style="stroke:none" />
      </symbol>
      <symbol
         style="overflow:visible"
         id="glyph0-1"
         overflow="visible">
        <path
           id="path18"
           d="m 20.085938,-13.390625 0,3.683594 -1.816407,5.449219 -3.636719,5.5 -5.5,3.636718 -5.449218,1.816406 -3.683594,0 c -0.527344,0 -0.957031,0.429688 -0.957031,0.957032 0,0.523437 0.429687,0.957031 0.957031,0.957031 l 3.824219,0 c 0.097656,0 0.191406,0 0.289062,-0.050781 L 9.851562,6.648438 c 0.046876,0 0.191407,-0.050782 0.238282,-0.097657 L 15.828125,2.726562 C 15.925781,2.679688 16.070312,2.535156 16.117188,2.4375 l 3.824218,-5.738281 c 0.04687,-0.046875 0.09766,-0.191407 0.09766,-0.238281 l 1.910157,-5.738282 C 22,-9.375 22,-9.46875 22,-9.566406 l 0,-3.824219 c 0,-0.527344 -0.433594,-0.957031 -0.957031,-0.957031 -0.527344,0 -0.957031,0.429687 -0.957031,0.957031 z m 0,0"
           style="stroke:none" />
      </symbol>
      <symbol
         style="overflow:visible"
         id="glyph1-0"
         overflow="visible">
        <path
           id="path21"
           d="m 4.25,-16.578125 c -0.085938,0 -0.210938,0.04297 -0.277344,0.105469 l -0.019531,0 0,0.02344 -0.019531,0 -0.023438,0.01953 0,0.01953 c -0.042968,0.06641 -0.085937,0.171875 -0.085937,0.257812 l 0,0.847656 c 0,0.234376 0.191406,0.425782 0.425781,0.425782 l 6.972656,0 -4.71875,6.058594 C 6.441406,-8.757812 6.375,-8.609375 6.375,-8.5 l 0,0.105469 0.023438,0.019531 0,0.023438 0.019531,0.019531 0,0.042969 c 0,0.019531 0.023437,0.042968 0.023437,0.042968 0.019532,0.019532 0.082032,0.0625 0.105469,0.085938 0.0625,0.039062 0.167969,0.082031 0.253906,0.082031 l 2.488281,0 1.570313,0.53125 1.085937,0.703125 0.699219,1.082031 0.535157,1.574219 0,0.722656 -0.535157,1.574219 -0.699219,1.082031 -1.085937,0.703125 -1.570313,0.53125 -2.425781,0 L 5.292969,-0.105469 4.378906,-0.722656 3.804688,-1.828125 C 3.785156,-1.871094 3.761719,-1.957031 3.71875,-1.996094 l -0.042969,-0.023437 -0.042969,-0.019531 0,-0.023438 -0.019531,-0.019531 -0.019531,0 C 3.550781,-2.105469 3.464844,-2.125 3.402344,-2.125 l -0.851563,0 c -0.234375,0 -0.425781,0.191406 -0.425781,0.425781 0,0.0625 0.023438,0.148438 0.042969,0.191407 l 0.851562,1.699218 c 0.019531,0.042969 0.0625,0.085938 0.082031,0.105469 L 3.953125,1.148438 C 3.996094,1.191406 4.082031,1.234375 4.125,1.253906 L 6.675781,2.105469 C 6.714844,2.125 6.757812,2.125 6.800781,2.125 l 2.550781,0 c 0.042969,0 0.085938,0 0.128907,-0.019531 L 12.03125,1.253906 c 0.04297,-0.019531 0.125,-0.0625 0.167969,-0.105468 l 1.703125,-1.699219 c 0.03906,-0.042969 0.08203,-0.128907 0.105468,-0.171875 l 0.847657,-2.550782 c 0.02344,-0.042968 0.02344,-0.085937 0.02344,-0.128906 l 0,-0.847656 c 0,-0.042969 0,-0.085938 -0.02344,-0.128906 l -0.847657,-2.550782 c -0.02344,-0.042968 -0.06641,-0.125 -0.105468,-0.167968 L 12.199219,-8.800781 C 12.15625,-8.84375 12.074219,-8.882812 12.03125,-8.90625 L 9.480469,-9.753906 C 9.4375,-9.777344 9.394531,-9.777344 9.351562,-9.777344 l -0.167968,0 4.757812,-6.121094 c 0.04297,-0.0625 0.08594,-0.171874 0.08594,-0.253906 0,-0.234375 -0.191406,-0.425781 -0.425782,-0.425781 z m 0,0"
           style="stroke:none" />
      </symbol>
      <symbol
         style="overflow:visible"
         id="glyph1-1"
         overflow="visible">
        <path
           id="path24"
           d="m 3.402344,-16.578125 c -0.085938,0 -0.214844,0.04297 -0.277344,0.105469 l -0.023438,0 0,0.02344 -0.019531,0 -0.019531,0.01953 0,0.01953 c -0.042969,0.06641 -0.085938,0.171875 -0.085938,0.257812 l 0,17.851563 c 0,0.234375 0.191407,0.425781 0.425782,0.425781 l 0.847656,0 c 0.085938,0 0.214844,-0.042969 0.277344,-0.105469 l 0.019531,-0.023437 0.023437,0 0.019532,-0.019532 0,-0.019531 C 4.632812,1.890625 4.675781,1.785156 4.675781,1.699219 l 0,-17.851563 c 0,-0.234375 -0.191406,-0.425781 -0.425781,-0.425781 z m 0,0"
           style="stroke:none" />
      </symbol>
      <symbol
         style="overflow:visible"
         id="glyph1-2"
         overflow="visible">
        <path
           id="path27"
           d="m 7.652344,-16.578125 -0.085938,0 c -0.019531,0 -0.019531,0.01953 -0.042968,0.01953 -0.042969,0 -0.085938,0.02344 -0.105469,0.04297 l -1.65625,0.828125 c -0.042969,0.02344 -0.085938,0.06641 -0.109375,0.08594 l -1.699219,1.699218 c -0.019531,0.02344 -0.0625,0.06641 -0.085937,0.109375 l -0.847657,1.699219 c 0,0.01953 -0.023437,0.04297 -0.023437,0.0625 L 2.148438,-9.480469 C 2.125,-9.4375 2.125,-9.394531 2.125,-9.351562 l 0,4.25 c 0,0.042968 0,0.085937 0.023438,0.128906 l 0.847656,2.550781 c 0,0.019531 0.023437,0.042969 0.023437,0.0625 l 0.847657,1.699219 c 0.023437,0.042968 0.066406,0.085937 0.085937,0.109375 l 1.699219,1.699219 c 0.023437,0.019531 0.066406,0.0625 0.109375,0.085937 L 7.460938,2.082031 C 7.503906,2.105469 7.585938,2.125 7.652344,2.125 l 3.398437,0 c 0.06641,0 0.148438,-0.019531 0.191407,-0.042969 l 1.703124,-0.847656 c 0.04297,-0.023437 0.08203,-0.066406 0.105469,-0.085937 L 14.75,-0.550781 c 0.02344,-0.023438 0.0625,-0.066407 0.08594,-0.109375 l 0.85156,-1.699219 c 0,-0.019531 0.01953,-0.042969 0.01953,-0.0625 l 0.851563,-2.550781 c 0.01953,-0.042969 0.01953,-0.085938 0.01953,-0.128906 l 0,-4.25 c 0,-0.042969 0,-0.085938 -0.01953,-0.128907 L 15.70703,-12.03125 c 0,-0.01953 -0.01953,-0.04297 -0.01953,-0.0625 l -0.851562,-1.699219 c -0.02344,-0.04297 -0.0625,-0.08594 -0.08594,-0.109375 l -1.699219,-1.699218 c -0.02344,-0.01953 -0.0625,-0.0625 -0.105469,-0.08594 l -1.703124,-0.847656 c -0.04297,-0.02344 -0.125,-0.04297 -0.191407,-0.04297 z m 0.105468,0.851563 0.703126,0 -0.023438,0 c -0.019531,0 -0.085938,0.01953 -0.105469,0.01953 l 0,0.01953 -1.933593,0.640625 z m 2.445313,0 0.742187,0 1.359376,0.679687 -1.976563,-0.660156 c -0.03906,-0.01953 -0.08203,-0.01953 -0.125,-0.01953 z m -1.636719,0.847656 1.570313,0 2.339843,0.789062 1.59375,2.378906 0.808594,2.421876 0,4.125 -0.808594,2.421874 -1.59375,2.382813 -2.339843,0.785156 -1.570313,0 -2.339844,-0.785156 -1.59375,-2.382813 -0.808593,-2.421874 0,-4.125 0.808593,-2.421876 1.59375,-2.378906 z m -3.65625,1.210937 -0.636718,0.957031 0.316406,-0.636718 z m 8.882813,0 0.320312,0.320313 0.320313,0.636718 z M 4.273438,-1.742188 4.910156,-0.785156 4.589844,-1.105469 Z m 10.160156,0 -0.320313,0.636719 -0.320312,0.320313 z M 6.398438,0.59375 8.375,1.253906 C 8.417969,1.273438 8.460938,1.273438 8.5,1.273438 l -0.742188,0 z m 5.90625,0 -1.359376,0.679688 -0.742187,0 c 0.04297,0 0.08594,0 0.125,-0.019532 z m 0,0"
           style="stroke:none" />
      </symbol>
      <symbol
         style="overflow:visible"
         id="glyph1-3"
         overflow="visible">
        <path
           id="path30"
           d="m 3.402344,-16.578125 -0.109375,0 -0.019531,0.01953 -0.042969,0 c -0.019531,0 -0.042969,0.02344 -0.042969,0.02344 l -0.0625,0.0625 c -0.085938,0.0625 -0.148438,0.214844 -0.148438,0.320312 l 0,17.851563 c 0,0.085937 0.042969,0.214843 0.105469,0.277343 l 0,0.019532 0.019531,0 0,0.023437 0.023438,0.019531 0.019531,0 C 3.210938,2.082031 3.316406,2.125 3.402344,2.125 l 0.847656,0 c 0.234375,0 0.425781,-0.191406 0.425781,-0.425781 l 0,-13.984375 10.265625,14.199218 c 0.04297,0.0625 0.128906,0.167969 0.214844,0.191407 0.01953,0 0.0625,0.019531 0.08203,0.019531 l 0.171875,0 0.01953,-0.019531 0.04297,0 c 0.02344,0 0.04297,-0.023438 0.04297,-0.023438 l 0,-0.019531 0.04297,0 0,-0.023438 0.01953,-0.019531 c 0.08594,-0.0625 0.148437,-0.214843 0.148437,-0.320312 l 0,-17.851563 c 0,-0.234375 -0.191406,-0.425781 -0.421874,-0.425781 l -0.851563,0 c -0.08594,0 -0.210937,0.04297 -0.277344,0.105469 l -0.01953,0 0,0.02344 -0.02344,0 -0.01953,0.01953 0,0.01953 c -0.04297,0.06641 -0.08594,0.171875 -0.08594,0.257812 l 0,13.984375 -10.265625,-14.199219 c -0.042969,-0.0625 -0.128907,-0.167968 -0.210938,-0.191406 -0.023437,0 -0.066406,-0.01953 -0.085937,-0.01953 z m 0.421875,1.742187 0,1.167969 c 0.023437,-0.08203 0.085937,-0.191406 0.148437,-0.253906 l 0.023438,-0.01953 0.019531,-0.02344 0.023437,-0.01953 c 0,0 0.019532,-0.02344 0.042969,-0.02344 l 0.042969,0 0.019531,-0.01953 0.171875,0 c 0.019532,0 0.0625,0.01953 0.082032,0.01953 0.023437,0 0.023437,0.02344 0.042968,0.02344 z m 11.054687,14.050782 c -0.02344,0.082031 -0.08594,0.191406 -0.148437,0.253906 l -0.02344,0.019531 0,0.023438 -0.04297,0 0,0.019531 c 0,0 -0.01953,0.023438 -0.03906,0.023438 l -0.04297,0 -0.02344,0.019531 -0.167969,0 c -0.02344,0 -0.06641,-0.019531 -0.08594,-0.019531 -0.02344,0 -0.02344,-0.023438 -0.04297,-0.023438 l 0.617187,0.851562 z m 0,0"
           style="stroke:none" />
      </symbol>
      <symbol
         style="overflow:visible"
         id="glyph1-4"
         overflow="visible">
        <path
           id="path33"
           d="m 8.460938,-16.578125 c -0.023438,0 -0.085938,0 -0.109376,0.01953 -0.019531,0 -0.042968,0.02344 -0.0625,0.04297 -0.085937,0.04297 -0.191406,0.148437 -0.210937,0.257813 L 1.316406,1.488281 c -0.019531,0.0625 -0.042968,0.148438 -0.042968,0.210938 0,0.042969 0.023437,0.128906 0.042968,0.171875 l 0,0.042968 0.023438,0 0,0.042969 0.019531,0 0.023437,0.019531 0,0.019532 C 1.402344,2.019531 1.425781,2.019531 1.445312,2.039062 1.507812,2.082031 1.617188,2.125 1.699219,2.125 l 0.851562,0 c 0.167969,0 0.339844,-0.128906 0.402344,-0.277344 l 1.53125,-3.972656 8.035156,0 1.53125,3.972656 C 14.113281,1.996094 14.28125,2.125 14.453125,2.125 l 0.851563,0 c 0.105468,0 0.230468,-0.0625 0.296874,-0.128906 l 0.01953,-0.019532 0.02344,0 0.01953,-0.042968 0.02344,-0.019532 0,-0.023437 0.01953,-0.019531 c 0.01953,-0.042969 0.01953,-0.128906 0.01953,-0.171875 0,-0.0625 -0.01953,-0.148438 -0.03906,-0.210938 L 8.925781,-16.257812 c -0.019531,-0.08594 -0.105469,-0.214844 -0.167969,-0.257813 -0.042968,-0.04297 -0.148437,-0.0625 -0.214843,-0.0625 z M 8.5,-14.964844 l 3.445312,9.035156 -3.039062,-7.78125 c -0.023438,-0.08203 -0.105469,-0.210937 -0.171875,-0.253906 -0.019531,-0.01953 -0.042969,-0.04297 -0.0625,-0.04297 l -0.042969,0 -0.019531,-0.01953 -0.214844,0 c -0.019531,0 -0.0625,0.04297 -0.085937,0.04297 -0.019532,0.01953 -0.0625,0.04297 -0.082032,0.0625 -0.042968,0.04297 -0.105468,0.148437 -0.128906,0.210937 l -3.039062,7.78125 z m 0,2.53125 3.339844,8.609375 -6.675782,0 z m 0,0"
           style="stroke:none" />
      </symbol>
      <symbol
         style="overflow:visible"
         id="glyph1-5"
         overflow="visible">
        <path
           id="path36"
           d="m 3.402344,-16.578125 c -0.085938,0 -0.214844,0.04297 -0.277344,0.105469 l -0.023438,0 0,0.02344 -0.019531,0 -0.019531,0.01953 0,0.01953 c -0.042969,0.06641 -0.085938,0.171875 -0.085938,0.257812 l 0,17.851563 c 0,0.085937 0.042969,0.214843 0.105469,0.277343 l 0,0.019532 0.019531,0 0,0.023437 0.023438,0.019531 0.019531,0 C 3.210938,2.082031 3.316406,2.125 3.402344,2.125 l 10.199218,0 c 0.08594,0 0.214844,-0.042969 0.277344,-0.105469 l 0.02344,-0.023437 0.01953,0 0.01953,-0.019532 0,-0.019531 c 0.04297,-0.066406 0.08594,-0.171875 0.08594,-0.257812 l 0,-0.847657 c 0,-0.234374 -0.191406,-0.425781 -0.425782,-0.425781 l -8.925781,0 0,-16.578125 c 0,-0.234375 -0.191406,-0.425781 -0.425781,-0.425781 z m 0.421875,17.492187 0,0.359376 0.363281,0 c -0.0625,0 -0.148438,-0.039063 -0.191406,-0.082032 l -0.023438,0 -0.019531,-0.023437 0,-0.019531 -0.019531,0 0,-0.023438 C 3.890625,1.082031 3.847656,0.976562 3.824219,0.914062 Z m 0,0"
           style="stroke:none" />
      </symbol>
      <symbol
         style="overflow:visible"
         id="glyph1-6"
         overflow="visible">
        <path
           id="path39"
           d=""
           style="stroke:none" />
      </symbol>
      <symbol
         style="overflow:visible"
         id="glyph1-7"
         overflow="visible">
        <path
           id="path42"
           d="m 3.402344,-16.578125 c -0.085938,0 -0.214844,0.04297 -0.277344,0.105469 l -0.023438,0 0,0.02344 -0.019531,0 -0.019531,0.01953 0,0.01953 c -0.042969,0.06641 -0.085938,0.171875 -0.085938,0.257812 l 0,17.851563 c 0,0.085937 0.042969,0.214843 0.105469,0.277343 l 0,0.019532 0.019531,0 0,0.023437 0.023438,0.019531 0.019531,0 C 3.210938,2.082031 3.316406,2.125 3.402344,2.125 l 0.847656,0 c 0.234375,0 0.425781,-0.191406 0.425781,-0.425781 l 0,-8.074219 4.675781,0 c 0.085938,0 0.214844,-0.042969 0.277344,-0.109375 l 0.019532,-0.019531 0.023437,0 0.019531,-0.019532 0,-0.023437 c 0.042969,-0.0625 0.085938,-0.167969 0.085938,-0.253906 l 0,-0.851563 c 0,-0.234375 -0.191406,-0.425781 -0.425782,-0.425781 l -4.675781,0 0,-6.800781 8.925781,0 c 0.234376,0 0.425782,-0.191406 0.425782,-0.425782 l 0,-0.847656 c 0,-0.08594 -0.04297,-0.214844 -0.105469,-0.277344 l -0.01953,-0.01953 0,-0.02344 -0.02344,-0.01953 -0.01953,0 c -0.06641,-0.04297 -0.171875,-0.08594 -0.257813,-0.08594 z m 0.421875,0.851563 0.363281,0 c -0.0625,0.01953 -0.171875,0.0625 -0.214844,0.105468 l -0.019531,0 0,0.01953 -0.019531,0 -0.023438,0.02344 0,0.01953 c -0.042968,0.04297 -0.085937,0.128906 -0.085937,0.191406 z m 0,0"
           style="stroke:none" />
      </symbol>
      <symbol
         style="overflow:visible"
         id="glyph1-8"
         overflow="visible">
        <path
           id="path45"
           d="m 4.25,-1.273438 0.851562,0 c 0.105469,0 0.234376,0.0625 0.296876,0.125 L 6.25,-0.296875 C 6.3125,-0.234375 6.375,-0.105469 6.375,0 l 0,2.550781 c 0,0.085938 -0.042969,0.191407 -0.082031,0.253907 l -0.808594,1.617187 0,0.019531 C 5.441406,4.527344 5.3125,4.613281 5.230469,4.65625 L 3.59375,5.484375 C 3.550781,5.503906 3.441406,5.527344 3.378906,5.527344 3.144531,5.527344 2.953125,5.335938 2.953125,5.101562 2.953125,4.953125 3.0625,4.78125 3.210938,4.71875 L 4.738281,3.953125 5.144531,2.339844 4.929688,2.125 4.25,2.125 C 4.144531,2.125 4.015625,2.0625 3.953125,1.996094 L 3.101562,1.148438 c -0.0625,-0.066407 -0.125,-0.191407 -0.125,-0.296876 L 2.976562,0 c 0,-0.105469 0.0625,-0.234375 0.125,-0.296875 l 0.851563,-0.851563 c 0.0625,-0.0625 0.191406,-0.125 0.296875,-0.125 z m 0,0"
           style="stroke:none" />
      </symbol>
      <symbol
         style="overflow:visible"
         id="glyph1-9"
         overflow="visible">
        <path
           id="path48"
           d="m 3.402344,-16.578125 c -0.085938,0 -0.214844,0.04297 -0.277344,0.105469 l -0.023438,0 0,0.02344 -0.019531,0 -0.019531,0.01953 0,0.01953 c -0.042969,0.06641 -0.085938,0.171875 -0.085938,0.257812 l 0,17.851563 c 0,0.085937 0.042969,0.214843 0.105469,0.277343 l 0,0.019532 0.019531,0 0,0.023437 0.023438,0.019531 0.019531,0 C 3.210938,2.082031 3.316406,2.125 3.402344,2.125 l 5.949218,0 c 0.042969,0 0.085938,0 0.128907,-0.019531 L 12.03125,1.253906 c 0.04297,-0.019531 0.125,-0.0625 0.167969,-0.105468 l 1.703125,-1.699219 c 0.01953,-0.023438 0.0625,-0.066407 0.08203,-0.109375 l 0.851563,-1.699219 c 0,-0.019531 0.01953,-0.042969 0.01953,-0.0625 l 0.851562,-2.550781 c 0.01953,-0.042969 0.01953,-0.085938 0.01953,-0.128906 l 0,-4.25 c 0,-0.042969 0,-0.085938 -0.01953,-0.128907 l -0.851562,-2.550781 c 0,-0.01953 -0.01953,-0.04297 -0.01953,-0.0625 l -0.851563,-1.699219 c -0.01953,-0.04297 -0.0625,-0.08594 -0.08203,-0.109375 l -1.703125,-1.699218 c -0.04297,-0.04297 -0.125,-0.08594 -0.167969,-0.105469 l -2.550781,-0.851563 c -0.042969,-0.01953 -0.085938,-0.01953 -0.128907,-0.01953 z m 0.421875,0.851563 0,0.359374 c 0,-0.0625 0.042969,-0.148437 0.085937,-0.191406 l 0,-0.01953 0.023438,-0.02344 0.019531,0 0,-0.01953 0.019531,0 c 0.042969,-0.04297 0.152344,-0.08594 0.214844,-0.105468 z m 0.851562,0.847656 4.613281,0 2.378907,0.808594 0.746093,0.722656 0.785157,1.613281 0.828125,2.445313 0,4.125 -0.828125,2.445312 -0.785157,1.613281 -0.746093,0.722657 -2.378907,0.808593 -4.613281,0 z m -0.851562,15.792968 0,0.359376 0.363281,0 c -0.0625,0 -0.148438,-0.039063 -0.191406,-0.082032 l -0.023438,0 -0.019531,-0.023437 0,-0.019531 -0.019531,0 0,-0.023438 C 3.890625,1.082031 3.847656,0.976562 3.824219,0.914062 Z m 0,0"
           style="stroke:none" />
      </symbol>
      <symbol
         style="overflow:visible"
         id="glyph1-10"
         overflow="visible">
        <path
           id="path51"
           d="m 1.699219,-16.578125 c -0.082031,0 -0.210938,0.04297 -0.273438,0.105469 l -0.023437,0 0,0.02344 -0.019532,0 -0.023437,0.01953 0,0.01953 c -0.042969,0.06641 -0.085937,0.171875 -0.085937,0.257812 l 0,0.847656 c 0,0.234376 0.191406,0.425782 0.425781,0.425782 l 4.675781,0 0,16.578125 c 0,0.085937 0.042969,0.214843 0.109375,0.277343 l 0,0.019532 0.019531,0 0,0.023437 0.019532,0.019531 0.023437,0 C 6.609375,2.082031 6.714844,2.125 6.800781,2.125 l 0.851563,0 c 0.234375,0 0.425781,-0.191406 0.425781,-0.425781 l 0,-16.578125 4.675781,0 c 0.08203,0 0.210938,-0.04297 0.273438,-0.105469 l 0.02344,-0.01953 0.01953,0 0.02344,-0.02344 0,-0.01953 c 0.04297,-0.06641 0.08594,-0.171875 0.08594,-0.257813 l 0,-0.847656 c 0,-0.234375 -0.191407,-0.425781 -0.425782,-0.425781 z m 0,0"
           style="stroke:none" />
      </symbol>
      <symbol
         style="overflow:visible"
         id="glyph1-11"
         overflow="visible">
        <path
           id="path54"
           d="m 3.402344,-16.578125 c -0.085938,0 -0.214844,0.04297 -0.277344,0.105469 l -0.023438,0 0,0.02344 -0.019531,0 -0.019531,0.01953 0,0.01953 c -0.042969,0.06641 -0.085938,0.171875 -0.085938,0.257812 l 0,17.851563 c 0,0.085937 0.042969,0.214843 0.105469,0.277343 l 0,0.019532 0.019531,0 0,0.023437 0.023438,0.019531 0.019531,0 C 3.210938,2.082031 3.316406,2.125 3.402344,2.125 l 10.199218,0 c 0.08594,0 0.214844,-0.042969 0.277344,-0.105469 l 0.02344,-0.023437 0.01953,0 0.01953,-0.019532 0,-0.019531 c 0.04297,-0.066406 0.08594,-0.171875 0.08594,-0.257812 l 0,-0.847657 c 0,-0.234374 -0.191406,-0.425781 -0.425782,-0.425781 l -8.925781,0 0,-6.800781 4.675781,0 c 0.085938,0 0.214844,-0.042969 0.277344,-0.109375 l 0.019532,-0.019531 0.023437,0 0.019531,-0.019532 0,-0.023437 c 0.042969,-0.0625 0.085938,-0.167969 0.085938,-0.253906 l 0,-0.851563 c 0,-0.234375 -0.191406,-0.425781 -0.425782,-0.425781 l -4.675781,0 0,-6.800781 8.925781,0 c 0.234376,0 0.425782,-0.191406 0.425782,-0.425782 l 0,-0.847656 c 0,-0.08594 -0.04297,-0.214844 -0.105469,-0.277344 l -0.01953,-0.01953 0,-0.02344 -0.02344,-0.01953 -0.01953,0 c -0.06641,-0.04297 -0.171875,-0.08594 -0.257813,-0.08594 z m 0.421875,0.851563 0.363281,0 c -0.0625,0.01953 -0.171875,0.0625 -0.214844,0.105468 l -0.019531,0 0,0.01953 -0.019531,0 -0.023438,0.02344 0,0.01953 c -0.042968,0.04297 -0.085937,0.128906 -0.085937,0.191406 z m 0,16.640624 C 3.847656,0.976562 3.890625,1.082031 3.933594,1.125 l 0,0.023438 0.019531,0 0,0.019531 0.019531,0.023437 0.023438,0 C 4.039062,1.234375 4.125,1.273438 4.1875,1.273438 l -0.363281,0 z m 0,0"
           style="stroke:none" />
      </symbol>
      <symbol
         style="overflow:visible"
         id="glyph1-12"
         overflow="visible">
        <path
           id="path57"
           d="m 3.402344,-16.578125 c -0.085938,0 -0.214844,0.04297 -0.277344,0.105469 l -0.023438,0 0,0.02344 -0.019531,0 -0.019531,0.01953 0,0.01953 c -0.042969,0.06641 -0.085938,0.171875 -0.085938,0.257812 l 0,17.851563 c 0,0.085937 0.042969,0.214843 0.105469,0.277343 l 0,0.019532 0.019531,0 0,0.023437 0.023438,0.019531 0.019531,0 C 3.210938,2.082031 3.316406,2.125 3.402344,2.125 l 0.847656,0 c 0.234375,0 0.425781,-0.191406 0.425781,-0.425781 l 0,-8.074219 3.59375,0 4.972657,8.289062 C 13.304688,2.019531 13.476562,2.125 13.601562,2.125 l 0.851563,0 c 0.08594,0 0.210937,-0.042969 0.277344,-0.105469 l 0.01953,0 0,-0.023437 0.04297,-0.019532 0.01953,-0.042968 0.02344,-0.042969 0,-0.019531 c 0,0 0.01953,-0.023438 0.01953,-0.042969 0,-0.023437 0.02344,0 0.02344,-0.023437 l 0,-0.105469 c 0,-0.082031 -0.04297,-0.210938 -0.08594,-0.273438 L 10.097656,-6.375 l 0.105469,0 c 0.04297,0 0.08594,0 0.125,-0.023438 l 2.550781,-0.847656 c 0.04297,-0.023437 0.128906,-0.066406 0.171875,-0.109375 l 0.851563,-0.847656 c 0.01953,-0.023437 0.0625,-0.066406 0.08203,-0.105469 l 0.851563,-1.703125 c 0.01953,-0.04297 0.04297,-0.125 0.04297,-0.191406 l 0,-2.550781 c 0,-0.0625 -0.02344,-0.148438 -0.04297,-0.191406 l -0.851563,-1.699219 c -0.01953,-0.04297 -0.0625,-0.08594 -0.08203,-0.105469 l -0.851563,-0.851562 c -0.04297,-0.04297 -0.128906,-0.08594 -0.171875,-0.105469 l -2.550781,-0.851563 c -0.03906,-0.01953 -0.08203,-0.01953 -0.125,-0.01953 z m 0.421875,0.851563 0,0.359374 c 0,-0.0625 0.042969,-0.148437 0.085937,-0.191406 l 0,-0.01953 0.023438,-0.02344 0.019531,0 0,-0.01953 0.019531,0 c 0.042969,-0.04297 0.152344,-0.08594 0.214844,-0.105468 z m 0.851562,0.847656 5.460938,0 2.320312,0.765625 0.722657,1.46875 0,2.335937 -0.722657,1.464844 -2.320312,0.765625 -5.460938,0 z m 0,0"
           style="stroke:none" />
      </symbol>
      <symbol
         style="overflow:visible"
         id="glyph1-13"
         overflow="visible">
        <path
           id="path60"
           d="m 6.800781,-16.578125 c -0.042969,0 -0.085937,0 -0.125,0.01953 L 4.125,-15.707031 c -0.042969,0.01953 -0.128906,0.0625 -0.171875,0.105469 l -1.699219,1.699218 C 2.1875,-13.835938 2.125,-13.710938 2.125,-13.601562 l 0,1.699218 c 0,0.0625 0.023438,0.148438 0.042969,0.191406 l 0.851562,1.699219 c 0.019531,0.042969 0.0625,0.085938 0.082031,0.105469 l 0.851563,0.851562 c 0.019531,0.023438 0.0625,0.0625 0.105469,0.085938 l 1.703125,0.847656 0.039062,0.023438 4.230469,1.679687 1.617188,0.808594 0.765624,0.761719 0.765626,1.554687 0,2.273438 -0.660157,0.636719 -2.382812,0.808593 -3.230469,0 -1.550781,-0.765625 -0.808594,-0.808594 c -0.0625,-0.0625 -0.191406,-0.125 -0.296875,-0.125 l -1.699219,0 c -0.105469,0 -0.234375,0.0625 -0.296875,0.125 C 2.230469,-1.125 2.167969,-1.0625 2.148438,-1.019531 l 0,0.042969 c 0,0.019531 -0.023438,0.019531 -0.023438,0.042968 l 0,0.082032 c 0,0.109374 0.085938,0.277343 0.171875,0.339843 l 1.65625,1.660157 C 3.996094,1.191406 4.082031,1.234375 4.125,1.253906 L 6.675781,2.105469 C 6.714844,2.125 6.757812,2.125 6.800781,2.125 l 3.402344,0 c 0.04297,0 0.08594,0 0.125,-0.019531 l 2.550781,-0.851563 c 0.04297,-0.019531 0.128906,-0.0625 0.171875,-0.105468 L 14.75,-0.550781 c 0.0625,-0.066407 0.128906,-0.191407 0.128906,-0.300781 l 0,-2.550782 c 0,-0.0625 -0.02344,-0.148437 -0.04297,-0.191406 l -0.851563,-1.699219 c -0.01953,-0.042969 -0.0625,-0.085937 -0.08203,-0.105469 l -1.703125,-1.699218 c -0.01953,-0.023438 -0.0625,-0.066406 -0.105469,-0.085938 L 10.39453,-8.035156 10.35156,-8.054688 6.121092,-9.734375 4.57031,-10.519531 l -0.746093,-1.488281 0,-1.425782 0.660156,-0.636718 2.378906,-0.808594 3.234375,0 1.550782,0.765625 0.808593,0.808593 c 0.0625,0.0625 0.1875,0.125 0.296875,0.125 l 1.699219,0 c 0.105469,0 0.234375,-0.0625 0.296875,-0.125 0.02344,-0.02344 0.08594,-0.08594 0.105469,-0.128906 l 0,-0.04297 c 0,-0.01953 0.02344,-0.01953 0.02344,-0.04297 l 0,-0.08203 c 0,-0.109376 -0.08594,-0.277344 -0.171875,-0.339844 l -1.65625,-1.660156 c -0.04297,-0.04297 -0.128906,-0.08594 -0.171875,-0.105469 l -2.550781,-0.851563 c -0.03906,-0.01953 -0.08203,-0.01953 -0.125,-0.01953 z m 3.847657,1.019531 1.445312,0.722656 c 0.04297,0.02344 0.08594,0.0625 0.105469,0.08594 l 0.722656,0.722656 0.511719,0 -0.914063,-0.894531 z M 3.570312,-0.425781 4.484375,0.46875 6.355469,1.105469 4.910156,0.382812 C 4.867188,0.359375 4.824219,0.320312 4.804688,0.296875 L 4.082031,-0.425781 Z m 0,0"
           style="stroke:none" />
      </symbol>
      <symbol
         style="overflow:visible"
         id="glyph1-14"
         overflow="visible">
        <path
           id="path63"
           d="m 1.679688,-16.578125 -0.023438,0 c -0.082031,0 -0.191406,0.0625 -0.253906,0.128906 l -0.042969,0.01953 0,0.01953 c -0.019531,0.02344 -0.042969,0.02344 -0.042969,0.04297 l 0,0.02344 -0.019531,0.01953 c -0.023437,0.04297 -0.023437,0.128907 -0.023437,0.171875 0,0.0625 0.023437,0.148438 0.042968,0.210938 L 8.078125,1.804688 C 8.097656,1.890625 8.183594,2.019531 8.246094,2.0625 8.289062,2.105469 8.394531,2.125 8.460938,2.125 l 0.0625,0 c 0.042968,0 0.085937,0 0.128906,-0.019531 0.019531,0 0.039062,-0.023438 0.0625,-0.042969 C 8.800781,2.019531 8.90625,1.914062 8.925781,1.804688 L 15.6875,-15.941406 c 0.01953,-0.0625 0.03906,-0.148438 0.03906,-0.210938 0,-0.04297 -0.01953,-0.128906 -0.03906,-0.171875 l 0,-0.04297 -0.02344,0 0,-0.04297 -0.01953,0 -0.02344,-0.01953 0,-0.01953 c -0.01953,-0.02344 -0.04297,-0.02344 -0.0625,-0.04297 -0.0625,-0.04297 -0.171875,-0.08594 -0.253906,-0.08594 l -0.851563,0 c -0.171875,0 -0.339844,0.128906 -0.402344,0.277344 L 8.5,-2.019531 2.953125,-16.300781 c -0.0625,-0.148438 -0.234375,-0.277344 -0.402344,-0.277344 z m 3.378906,8.054687 3.039062,7.78125 c 0.023438,0.082032 0.105469,0.210938 0.171875,0.253907 0.019531,0.019531 0.039063,0.042969 0.0625,0.042969 l 0.042969,0 0.019531,0.019531 0.214844,0 c 0.019531,0 0.0625,-0.042969 0.082031,-0.042969 0.023438,-0.019531 0.066406,-0.042969 0.085938,-0.0625 0.042968,-0.042969 0.105468,-0.148438 0.128906,-0.210938 L 11.945312,-8.523438 8.5,0.511719 Z m 0,0"
           style="stroke:none" />
      </symbol>
      <symbol
         style="overflow:visible"
         id="glyph1-15"
         overflow="visible">
        <path
           id="path66"
           d="m 3.402344,-16.578125 c -0.085938,0 -0.214844,0.04297 -0.277344,0.105469 l -0.023438,0 0,0.02344 -0.019531,0 -0.019531,0.01953 0,0.01953 c -0.042969,0.06641 -0.085938,0.171875 -0.085938,0.257812 l 0,17.851563 c 0,0.085937 0.042969,0.214843 0.105469,0.277343 l 0,0.019532 0.019531,0 0,0.023437 0.023438,0.019531 0.019531,0 C 3.210938,2.082031 3.316406,2.125 3.402344,2.125 l 0.847656,0 c 0.234375,0 0.425781,-0.191406 0.425781,-0.425781 l 0,-8.074219 9.351563,0 0,8.074219 c 0,0.234375 0.191406,0.425781 0.425781,0.425781 l 0.851563,0 c 0.08203,0 0.210937,-0.042969 0.273437,-0.105469 l 0.02344,-0.023437 0.01953,0 0.02344,-0.019532 0,-0.019531 c 0.04297,-0.066406 0.08203,-0.171875 0.08203,-0.257812 l 0,-17.851563 c 0,-0.08594 -0.03906,-0.214844 -0.105468,-0.277344 l -0.01953,-0.01953 0,-0.02344 -0.02344,-0.01953 -0.01953,0 c -0.0625,-0.04297 -0.171875,-0.08594 -0.253906,-0.08594 l -0.851563,0 c -0.234375,0 -0.425781,0.191406 -0.425781,0.425781 l 0,8.074219 -9.351563,0 0,-8.074219 c 0,-0.234375 -0.191406,-0.425781 -0.425781,-0.425781 z m 0,0"
           style="stroke:none" />
      </symbol>
      <symbol
         style="overflow:visible"
         id="glyph1-16"
         overflow="visible">
        <path
           id="path69"
           d="m 3.402344,-16.578125 c -0.085938,0 -0.214844,0.04297 -0.277344,0.105469 l -0.023438,0 0,0.02344 -0.019531,0 -0.019531,0.01953 0,0.01953 c -0.042969,0.06641 -0.085938,0.171875 -0.085938,0.257812 l 0,17.851563 c 0,0.085937 0.042969,0.214843 0.105469,0.277343 l 0,0.019532 0.019531,0 0,0.023437 0.023438,0.019531 0.019531,0 C 3.210938,2.082031 3.316406,2.125 3.402344,2.125 l 0.847656,0 c 0.234375,0 0.425781,-0.191406 0.425781,-0.425781 l 0,-8.074219 6.375,0 c 0.06641,0 0.148438,-0.023438 0.191407,-0.042969 l 1.703124,-0.851562 c 0.04297,-0.019531 0.08203,-0.0625 0.105469,-0.085938 l 0.851563,-0.847656 c 0.01953,-0.023437 0.0625,-0.066406 0.08203,-0.105469 l 0.851563,-1.703125 c 0.01953,-0.04297 0.04297,-0.125 0.04297,-0.191406 l 0,-2.550781 c 0,-0.0625 -0.02344,-0.148438 -0.04297,-0.191406 l -0.851563,-1.699219 c -0.01953,-0.04297 -0.0625,-0.08594 -0.08203,-0.105469 l -0.851563,-0.851562 c -0.02344,-0.01953 -0.0625,-0.0625 -0.105469,-0.08594 l -1.703124,-0.847656 c -0.04297,-0.02344 -0.125,-0.04297 -0.191407,-0.04297 z m 0.421875,0.851563 0,0.359374 c 0,-0.0625 0.042969,-0.148437 0.085937,-0.191406 l 0,-0.01953 0.023438,-0.02344 0.019531,0 0,-0.01953 0.019531,0 c 0.042969,-0.04297 0.152344,-0.08594 0.214844,-0.105468 z m 0.851562,0.847656 6.269531,0 1.488282,0.746094 0.746094,1.488281 0,2.335937 -0.746094,1.488282 -1.488282,0.742187 -6.269531,0 z m 0,0"
           style="stroke:none" />
      </symbol>
      <symbol
         style="overflow:visible"
         id="glyph1-17"
         overflow="visible">
        <path
           id="path72"
           d="m 7.652344,-16.578125 c -0.066406,0 -0.148438,0.01953 -0.191406,0.04297 L 5.761719,-15.6875 c -0.042969,0.02344 -0.085938,0.06641 -0.109375,0.08594 l -1.699219,1.699218 c -0.019531,0.02344 -0.0625,0.06641 -0.085937,0.109375 l -0.847657,1.699219 c 0,0.01953 -0.023437,0.04297 -0.023437,0.0625 L 2.148438,-9.480469 C 2.125,-9.4375 2.125,-9.394531 2.125,-9.351562 l 0,4.25 c 0,0.042968 0,0.085937 0.023438,0.128906 l 0.847656,2.550781 c 0,0.019531 0.023437,0.042969 0.023437,0.0625 l 0.847657,1.699219 c 0.023437,0.042968 0.066406,0.085937 0.085937,0.109375 l 1.699219,1.699219 c 0.023437,0.019531 0.066406,0.0625 0.109375,0.085937 L 7.460938,2.082031 C 7.503906,2.105469 7.585938,2.125 7.652344,2.125 l 3.398437,0 c 0.06641,0 0.148438,-0.019531 0.191407,-0.042969 l 1.703124,-0.847656 c 0.04297,-0.023437 0.08203,-0.066406 0.105469,-0.085937 L 14.75,-0.550781 c 0.02344,-0.023438 0.0625,-0.066407 0.08594,-0.109375 l 0.85156,-1.699219 c 0.01953,-0.042969 0.03906,-0.128906 0.03906,-0.191406 l 0,-3.402344 c 0,-0.230469 -0.191406,-0.421875 -0.421874,-0.421875 l -4.253907,0 c -0.08203,0 -0.210937,0.042969 -0.273437,0.105469 l -0.02344,0 0,0.019531 -0.01953,0 -0.02344,0.023438 0,0.019531 c -0.04297,0.066406 -0.08203,0.171875 -0.08203,0.253906 l 0,0.851563 c 0,0.234374 0.191406,0.425781 0.421875,0.425781 l 2.976563,0 0,2.019531 -0.765625,1.550781 -0.765625,0.765625 -1.550782,0.765625 -3.1875,0 L 6.207031,-0.339844 5.441406,-1.105469 4.65625,-2.71875 3.824219,-5.164062 l 0,-4.125 0.832031,-2.445313 0.785156,-1.613281 0.765625,-0.765625 1.550781,-0.765625 3.1875,0 1.550782,0.765625 0.765625,0.765625 0.808593,1.636718 c 0.0625,0.128907 0.234376,0.234376 0.382813,0.234376 l 0.851563,0 c 0.105468,0 0.230468,-0.06641 0.296874,-0.128907 l 0.04297,-0.01953 0.01953,-0.04297 0.02344,-0.02344 0,-0.01953 0.01953,-0.02344 0,-0.03906 c 0.01953,-0.04297 0.01953,-0.08594 0.01953,-0.128906 0,-0.08594 -0.03906,-0.191406 -0.08203,-0.253906 l -0.808593,-1.636719 c -0.02344,-0.04297 -0.0625,-0.08594 -0.08594,-0.109375 l -1.699219,-1.699218 c -0.02344,-0.01953 -0.0625,-0.0625 -0.105469,-0.08594 l -1.703124,-0.847656 c -0.04297,-0.02344 -0.125,-0.04297 -0.191407,-0.04297 z m 6.800781,11.050781 c 0.234375,0 0.425781,0.191406 0.425781,0.425782 l 0,-0.425782 z m 0,0"
           style="stroke:none" />
      </symbol>
      <symbol
         style="overflow:visible"
         id="glyph1-18"
         overflow="visible">
        <path
           id="path75"
           d="m 1.679688,-16.578125 c -0.085938,0 -0.191407,0.0625 -0.253907,0.105469 l -0.023437,0.02344 -0.042969,0.01953 -0.019531,0.04297 -0.023438,0.04297 -0.019531,0.01953 0,0.02344 c -0.023437,0.04297 -0.023437,0.105469 -0.023437,0.148437 0,0.08203 0.042968,0.234375 0.109374,0.296875 l 5.84375,8.332031 0,9.222657 c 0,0.234375 0.191407,0.425781 0.425782,0.425781 L 8.5,2.125 c 0.085938,0 0.214844,-0.042969 0.277344,-0.105469 l 0.023437,-0.023437 0.019531,0 0.023438,-0.019532 0,-0.019531 C 8.882812,1.890625 8.925781,1.785156 8.925781,1.699219 l 0,-9.222657 5.847657,-8.332031 c 0.0625,-0.0625 0.105468,-0.214843 0.105468,-0.296875 0,-0.04297 0,-0.128906 -0.02344,-0.171875 l -0.01953,-0.01953 0,-0.02344 -0.02344,-0.01953 0,-0.02344 -0.01953,0 -0.01953,-0.01953 -0.06641,-0.0625 c -0.0625,-0.04297 -0.167969,-0.08594 -0.253906,-0.08594 l -0.851563,0 c -0.125,0 -0.273437,0.08594 -0.339843,0.191406 l -5.183594,7.375 -5.1875,-7.375 c -0.0625,-0.105469 -0.210937,-0.191406 -0.339844,-0.191406 z m 0,0"
           style="stroke:none" />
      </symbol>
      <symbol
         style="overflow:visible"
         id="glyph1-19"
         overflow="visible">
        <path
           id="path78"
           d="m 7.652344,-16.578125 c -0.066406,0 -0.148438,0.01953 -0.191406,0.04297 L 5.761719,-15.6875 c -0.042969,0.02344 -0.085938,0.06641 -0.109375,0.08594 l -1.699219,1.699218 c -0.019531,0.02344 -0.0625,0.06641 -0.085937,0.109375 l -0.847657,1.699219 c 0,0.01953 -0.023437,0.04297 -0.023437,0.0625 L 2.148438,-9.480469 C 2.125,-9.4375 2.125,-9.394531 2.125,-9.351562 l 0,4.25 c 0,0.042968 0,0.085937 0.023438,0.128906 l 0.847656,2.550781 c 0,0.019531 0.023437,0.042969 0.023437,0.0625 l 0.847657,1.699219 c 0.023437,0.042968 0.066406,0.085937 0.085937,0.109375 l 1.699219,1.699219 c 0.023437,0.019531 0.066406,0.0625 0.109375,0.085937 L 7.460938,2.082031 C 7.503906,2.105469 7.585938,2.125 7.652344,2.125 l 3.398437,0 c 0.06641,0 0.148438,-0.019531 0.191407,-0.042969 l 1.703124,-0.847656 c 0.04297,-0.023437 0.08203,-0.066406 0.105469,-0.085937 L 14.75,-0.550781 c 0.02344,-0.023438 0.0625,-0.066407 0.08594,-0.109375 l 0.828124,-1.636719 c 0.04297,-0.0625 0.0625,-0.167969 0.0625,-0.253906 0,-0.042969 -0.01953,-0.128907 -0.03906,-0.167969 l 0,-0.042969 -0.02344,-0.023437 0,-0.019532 c 0,-0.023437 -0.04297,0 -0.04297,-0.023437 l -0.0625,-0.0625 c -0.0625,-0.042969 -0.171875,-0.085937 -0.253906,-0.085937 l -0.851563,0 c -0.148437,0 -0.320313,0.105468 -0.382813,0.234374 l -0.808593,1.636719 -0.765625,0.765625 -1.550782,0.765625 -3.1875,0 L 6.25,-0.339844 4.632812,-2.742188 3.824219,-5.164062 l 0,-4.125 0.808593,-2.421876 1.617188,-2.402343 1.507812,-0.765625 3.1875,0 1.550782,0.765625 0.765625,0.765625 0.808593,1.636718 c 0.0625,0.128907 0.234376,0.234376 0.382813,0.234376 l 0.851563,0 c 0.105468,0 0.230468,-0.06641 0.296874,-0.128907 l 0.04297,-0.01953 0.01953,-0.04297 0.02344,-0.02344 0,-0.01953 0.01953,-0.02344 0,-0.03906 c 0.01953,-0.04297 0.01953,-0.08594 0.01953,-0.128906 0,-0.08594 -0.03906,-0.191406 -0.08203,-0.253906 l -0.808593,-1.636719 c -0.02344,-0.04297 -0.0625,-0.08594 -0.08594,-0.109375 l -1.699219,-1.699218 c -0.02344,-0.01953 -0.0625,-0.0625 -0.105469,-0.08594 l -1.703124,-0.847656 c -0.04297,-0.02344 -0.125,-0.04297 -0.191407,-0.04297 z m -2.742188,2.910156 -0.320312,0.320313 -0.316406,0.636718 z m -0.636718,11.925781 0.316406,0.636719 0.320312,0.320313 z m 0,0"
           style="stroke:none" />
      </symbol>
      <symbol
         style="overflow:visible"
         id="glyph1-20"
         overflow="visible">
        <path
           id="path81"
           d="m 6.824219,-23.402344 c -0.128907,0 -0.277344,0.08594 -0.339844,0.171875 l -0.808594,0.808594 c -0.066406,0.0625 -0.128906,0.191406 -0.128906,0.296875 0,0.105469 0.0625,0.253906 0.148437,0.316406 l 5.082032,4.230469 0.01953,0.02344 0,0.01953 0.04297,0.01953 0.01953,0.02344 c 0.02344,0.01953 0.06641,0.01953 0.08594,0.01953 0.02344,0 0.02344,0.02344 0.04297,0.02344 l 0.171875,0 c 0.01953,0 0.01953,-0.02344 0.03906,-0.02344 l 0.04297,0 0.02344,-0.01953 0.01953,0 0,-0.02344 0.02344,0 0.0625,-0.0625 0.01953,0 0.02344,-0.01953 0,-0.02344 0.04297,-0.04297 0,-0.01953 0.01953,-0.01953 0,-0.04297 0.02344,-0.02344 0,-0.167969 c 0,-0.02344 -0.02344,-0.04297 -0.02344,-0.06641 0,-0.01953 -0.01953,-0.0625 -0.04297,-0.08203 l -0.01953,-0.04297 -0.02344,-0.02344 -4.207031,-5.058594 c -0.0625,-0.105468 -0.191406,-0.191406 -0.320313,-0.191406 z m -0.023438,1.0625 0.957031,1.148438 -1.148437,-0.957032 z m -3.398437,5.761719 c -0.085938,0 -0.214844,0.04297 -0.277344,0.105469 l -0.023438,0 0,0.02344 -0.019531,0 -0.019531,0.01953 0,0.01953 c -0.042969,0.06641 -0.085938,0.171875 -0.085938,0.257812 l 0,17.851563 c 0,0.085937 0.042969,0.214843 0.105469,0.277343 l 0,0.019532 0.019531,0 0,0.023437 0.023438,0.019531 0.019531,0 C 3.210938,2.082031 3.316406,2.125 3.402344,2.125 l 10.199218,0 c 0.08594,0 0.214844,-0.042969 0.277344,-0.105469 l 0.02344,-0.023437 0.01953,0 0.01953,-0.019532 0,-0.019531 c 0.04297,-0.066406 0.08594,-0.171875 0.08594,-0.257812 l 0,-0.847657 c 0,-0.234374 -0.191406,-0.425781 -0.425782,-0.425781 l -8.925781,0 0,-6.800781 4.675781,0 c 0.085938,0 0.214844,-0.042969 0.277344,-0.109375 l 0.019532,-0.019531 0.023437,0 0.019531,-0.019532 0,-0.023437 c 0.042969,-0.0625 0.085938,-0.167969 0.085938,-0.253906 l 0,-0.851563 c 0,-0.234375 -0.191406,-0.425781 -0.425782,-0.425781 l -4.675781,0 0,-6.800781 8.925781,0 c 0.234376,0 0.425782,-0.191406 0.425782,-0.425782 l 0,-0.847656 c 0,-0.08594 -0.04297,-0.214844 -0.105469,-0.277344 l -0.01953,-0.01953 0,-0.02344 -0.02344,-0.01953 -0.01953,0 c -0.06641,-0.04297 -0.171875,-0.08594 -0.257813,-0.08594 z m 0.421875,0.851563 0.363281,0 c -0.0625,0.01953 -0.171875,0.0625 -0.214844,0.105468 l -0.019531,0 0,0.01953 -0.019531,0 -0.023438,0.02344 0,0.01953 c -0.042968,0.04297 -0.085937,0.128906 -0.085937,0.191406 z m 0,16.640624 C 3.847656,0.976562 3.890625,1.082031 3.933594,1.125 l 0,0.023438 0.019531,0 0,0.019531 0.019531,0.023437 0.023438,0 C 4.039062,1.234375 4.125,1.273438 4.1875,1.273438 l -0.363281,0 z m 0,0"
           style="stroke:none" />
      </symbol>
      <symbol
         style="overflow:visible"
         id="glyph2-0"
         overflow="visible">
        <path
           id="path84"
           d="m 2.378906,-7.4375 c -0.058594,0 -0.148437,0.027344 -0.191406,0.074219 l -0.015625,0 0,0.011719 -0.015625,0 -0.015625,0.015624 0,0.015626 c -0.027344,0.042968 -0.058594,0.121093 -0.058594,0.179687 l 0,8.332031 c 0,0.164063 0.136719,0.296875 0.296875,0.296875 l 0.597656,0 c 0.058594,0 0.148438,-0.03125 0.191407,-0.074219 l 0.015625,-0.015624 0.015625,0 0.015625,-0.015626 0,-0.015624 C 3.242188,1.324219 3.273438,1.25 3.273438,1.191406 l 0,-4.6875 0.535156,-1.085937 1.132812,-1.132813 1.085938,-0.535156 1.710937,0 c 0.160157,0 0.296875,-0.132812 0.296875,-0.296875 l 0,-0.59375 c 0,-0.058594 -0.03125,-0.148437 -0.074218,-0.195313 l -0.015626,-0.015624 0,-0.011719 -0.015624,-0.015625 -0.015626,0 C 7.871094,-7.410156 7.796875,-7.4375 7.738281,-7.4375 l -1.785156,0 c -0.046875,0 -0.105469,0.011719 -0.136719,0.027344 l -1.1875,0.597656 c -0.03125,0.011719 -0.0625,0.042969 -0.078125,0.058594 l -1.1875,1.191406 c -0.03125,0.027344 -0.058593,0.085938 -0.074219,0.117188 l -0.015624,0.042968 0,-1.738281 c 0,-0.164063 -0.132813,-0.296875 -0.296876,-0.296875 z m 0,0"
           style="stroke:none" />
      </symbol>
      <symbol
         style="overflow:visible"
         id="glyph2-1"
         overflow="visible">
        <path
           id="path87"
           d="m 8.925781,-11.605469 c -0.058593,0 -0.148437,0.03125 -0.191406,0.07422 l -0.015625,0 0,0.01563 -0.015625,0 L 8.6875,-11.5 l 0,0.01563 c -0.027344,0.04297 -0.058594,0.117187 -0.058594,0.175781 l 0,5.238282 -0.683594,-0.683594 C 7.929688,-6.769531 7.898438,-6.800781 7.871094,-6.8125 L 6.679688,-7.410156 C 6.652344,-7.425781 6.589844,-7.4375 6.546875,-7.4375 l -1.785156,0 c -0.046875,0 -0.105469,0.011719 -0.132813,0.027344 L 3.4375,-6.8125 C 3.40625,-6.800781 3.378906,-6.769531 3.363281,-6.753906 L 2.171875,-5.5625 c -0.03125,0.027344 -0.058594,0.085938 -0.074219,0.117188 l -0.59375,1.785156 c -0.015625,0.03125 -0.015625,0.058594 -0.015625,0.089844 l 0,1.191406 c 0,0.027344 0,0.058594 0.015625,0.085937 l 0.59375,1.789063 c 0.015625,0.027344 0.042969,0.085937 0.074219,0.117187 L 3.363281,0.804688 C 3.378906,0.816406 3.40625,0.847656 3.4375,0.863281 l 1.191406,0.59375 c 0.027344,0.015625 0.085938,0.03125 0.132813,0.03125 l 1.785156,0 c 0.042969,0 0.105469,-0.015625 0.132813,-0.03125 L 7.871094,0.863281 C 7.898438,0.847656 7.929688,0.816406 7.945312,0.804688 l 0.683594,-0.6875 0,1.074218 c 0,0.164063 0.132813,0.296875 0.296875,0.296875 l 0.597657,0 c 0.058593,0 0.148437,-0.03125 0.191406,-0.074219 l 0.015625,-0.015624 0.015625,0 0.015625,-0.015626 0,-0.015624 C 9.789062,1.324219 9.820312,1.25 9.820312,1.191406 l 0,-12.5 c 0,-0.164062 -0.132812,-0.296875 -0.296874,-0.296875 z M 4.835938,-6.25 l 1.636718,0 2.15625,1.074219 0,4.402343 -2.15625,1.070313 -1.636718,0 L 3.75,-0.238281 3.242188,-0.757812 l -0.5625,-1.667969 0,-1.101563 0.5625,-1.664062 L 3.75,-5.714844 Z m 0,0"
           style="stroke:none" />
      </symbol>
      <symbol
         style="overflow:visible"
         id="glyph3-0"
         overflow="visible">
        <path
           id="path90"
           d="m 6.800781,-16.578125 c -0.0625,0 -0.148437,0.01953 -0.191406,0.04297 L 4.910156,-15.6875 c -0.042968,0.02344 -0.085937,0.06641 -0.105468,0.08594 L 3.953125,-14.75 c -0.019531,0.01953 -0.0625,0.0625 -0.085937,0.105469 l -0.847657,1.699219 c -0.023437,0.04297 -0.042969,0.128906 -0.042969,0.191406 l 0,0.851562 c 0,0.234375 0.191407,0.425782 0.425782,0.425782 0.230468,0 0.421875,-0.191407 0.421875,-0.425782 l 0,-0.742187 0.765625,-1.554688 0.765625,-0.765625 1.550781,-0.761718 3.191406,0 1.550782,0.761718 0.765624,0.765625 0.765626,1.554688 0,1.484375 -0.789063,1.59375 -1.679687,2.488281 -8.457032,8.480469 C 2.1875,1.464844 2.125,1.59375 2.125,1.699219 2.125,1.933594 2.316406,2.125 2.550781,2.125 l 11.902344,0 c 0.234375,0 0.425781,-0.191406 0.425781,-0.425781 0,-0.234375 -0.191406,-0.425781 -0.425781,-0.425781 l -10.882813,0 7.78125,-7.777344 0.0625,-0.0625 1.699219,-2.550782 c 0,-0.023437 0.02344,-0.023437 0.02344,-0.042968 l 0.847656,-1.699219 c 0.02344,-0.04297 0.04297,-0.128906 0.04297,-0.191406 l 0,-1.703125 c 0,-0.0625 -0.01953,-0.148438 -0.04297,-0.191406 l -0.847656,-1.699219 c -0.02344,-0.04297 -0.06641,-0.08594 -0.08594,-0.105469 l -0.851562,-0.851562 c -0.01953,-0.01953 -0.0625,-0.0625 -0.105469,-0.08594 l -1.699219,-0.847656 c -0.04297,-0.02344 -0.128906,-0.04297 -0.191406,-0.04297 z m 0,0"
           style="stroke:none" />
      </symbol>
      <symbol
         style="overflow:visible"
         id="glyph3-1"
         overflow="visible">
        <path
           id="path93"
           d="m 8.5,-16.578125 c -0.039062,0 -0.082031,0 -0.125,0.01953 l -2.550781,0.851563 c -0.085938,0.01953 -0.191407,0.105469 -0.234375,0.171875 l -1.699219,2.546875 c -0.023437,0.04297 -0.066406,0.109375 -0.066406,0.152343 l -0.847657,4.25 0,4.335938 c 0,0.042969 0,0.105469 0.019532,0.148438 l 0,0.019531 0.851562,3.339843 c 0.019532,0.0625 0.0625,0.148438 0.105469,0.191407 l 1.699219,1.69922 C 5.695312,1.191406 5.78125,1.234375 5.824219,1.253906 L 8.375,2.105469 C 8.417969,2.125 8.460938,2.125 8.5,2.125 l 0.851562,0 c 0.042969,0 0.085938,0 0.128907,-0.019531 L 12.03125,1.253906 c 0.04297,-0.019531 0.125,-0.0625 0.167969,-0.105468 l 1.703125,-1.699219 c 0.03906,-0.042969 0.08203,-0.128907 0.105468,-0.171875 l 0.847657,-2.550782 c 0.02344,-0.042968 0.02344,-0.085937 0.02344,-0.128906 l 0,-0.847656 c 0,-0.042969 0,-0.085938 -0.02344,-0.128906 l -0.847657,-2.550782 c -0.02344,-0.042968 -0.06641,-0.125 -0.105468,-0.167968 L 12.199219,-8.800781 C 12.15625,-8.84375 12.074219,-8.882812 12.03125,-8.90625 L 9.480469,-9.753906 C 9.4375,-9.777344 9.394531,-9.777344 9.351562,-9.777344 l -0.851562,0 c -0.039062,0 -0.082031,0 -0.125,0.023438 L 5.824219,-8.90625 c -0.042969,0.023438 -0.128907,0.0625 -0.171875,0.105469 l -1.699219,1.703125 c -0.042969,0.042968 -0.085937,0.125 -0.105469,0.167968 l -0.023437,0.066407 0,-1.597657 0.832031,-4.121093 1.570312,-2.359375 2.339844,-0.785156 1.570313,0 2.320312,0.761718 0.761719,1.554688 c 0.06641,0.148437 0.234375,0.253906 0.382812,0.253906 0.234376,0 0.425782,-0.191406 0.425782,-0.425781 0,-0.0625 -0.01953,-0.167969 -0.04297,-0.210938 l -0.847656,-1.703125 c -0.04297,-0.08203 -0.171875,-0.191406 -0.257813,-0.210937 l -2.550781,-0.851563 c -0.03906,-0.01953 -0.08203,-0.01953 -0.125,-0.01953 z m 0.066406,7.652344 0.722656,0 2.378907,0.804687 1.550781,1.554688 0.808594,2.378906 0,0.722656 -0.808594,2.382813 -1.550781,1.550781 -2.378907,0.804688 -0.722656,0 L 6.183594,0.46875 4.632812,-1.0625 3.847656,-4.230469 4.632812,-6.566406 6.183594,-8.121094 Z m 0,0"
           style="stroke:none" />
      </symbol>
      <symbol
         style="overflow:visible"
         id="glyph3-2"
         overflow="visible">
        <path
           id="path96"
           d=""
           style="stroke:none" />
      </symbol>
      <symbol
         style="overflow:visible"
         id="glyph3-3"
         overflow="visible">
        <path
           id="path99"
           d="m 4.25,-16.578125 c -0.234375,0 -0.425781,0.191406 -0.425781,0.425781 0,0.234375 0.191406,0.425782 0.425781,0.425782 l 8.503906,0 -4.59375,6.121093 c -0.039062,0.0625 -0.082031,0.167969 -0.082031,0.253907 0,0.234374 0.191406,0.425781 0.421875,0.425781 l 2.445312,0 1.550782,0.765625 0.722656,0.742187 0.808594,2.378907 0,1.574218 -0.808594,2.382813 -1.550781,1.550781 -2.378907,0.804688 -2.425781,0 L 4.484375,0.46875 3.742188,-0.253906 2.933594,-1.890625 c -0.0625,-0.148437 -0.234375,-0.257813 -0.382813,-0.257813 -0.234375,0 -0.425781,0.191407 -0.425781,0.425782 0,0.066406 0.023438,0.171875 0.042969,0.214844 l 0.851562,1.699218 c 0.019531,0.042969 0.0625,0.085938 0.082031,0.105469 L 3.953125,1.148438 C 3.996094,1.191406 4.082031,1.234375 4.125,1.253906 L 6.675781,2.105469 C 6.714844,2.125 6.757812,2.125 6.800781,2.125 l 2.550781,0 c 0.042969,0 0.085938,0 0.128907,-0.019531 L 12.03125,1.253906 c 0.04297,-0.019531 0.125,-0.0625 0.167969,-0.105468 l 1.703125,-1.699219 c 0.03906,-0.042969 0.08203,-0.128907 0.105468,-0.171875 l 0.847657,-2.550782 c 0.02344,-0.042968 0.02344,-0.085937 0.02344,-0.128906 l 0,-1.699218 c 0,-0.042969 0,-0.085938 -0.02344,-0.128907 l -0.847657,-2.546875 c -0.02344,-0.042968 -0.06641,-0.128906 -0.105468,-0.171875 l -0.851563,-0.851562 c -0.02344,-0.019531 -0.0625,-0.0625 -0.105469,-0.082031 l -1.703124,-0.851563 c -0.04297,-0.019531 -0.125,-0.042969 -0.191407,-0.042969 l -1.699219,0 4.589844,-6.121094 c 0.04297,-0.0625 0.08594,-0.171874 0.08594,-0.253906 0,-0.234375 -0.191406,-0.425781 -0.425782,-0.425781 z m 0,0"
           style="stroke:none" />
      </symbol>
      <symbol
         style="overflow:visible"
         id="glyph3-4"
         overflow="visible">
        <path
           id="path102"
           d="m 7.628906,-16.578125 -0.042968,0 c -0.019532,0 -0.082032,0.01953 -0.105469,0.01953 l 0,0.02344 -2.507813,0.828125 c -0.085937,0.01953 -0.191406,0.105469 -0.234375,0.171875 l -1.699219,2.546875 c -0.019531,0.04297 -0.0625,0.109375 -0.0625,0.152343 l -0.851562,4.25 0,2.71875 0.851562,4.25 c 0,0.042969 0.042969,0.109376 0.0625,0.152344 L 4.738281,1.082031 C 4.78125,1.148438 4.886719,1.234375 4.972656,1.253906 L 7.523438,2.105469 C 7.566406,2.125 7.609375,2.125 7.652344,2.125 l 1.699218,0 c 0.042969,0 0.085938,0 0.128907,-0.019531 L 12.03125,1.253906 c 0.08203,-0.019531 0.191406,-0.105468 0.234375,-0.171875 l 1.699219,-2.546875 c 0.01953,-0.042968 0.0625,-0.109375 0.0625,-0.152344 l 0.851562,-4.25 0,-2.71875 -0.851562,-4.25 c 0,-0.04297 -0.04297,-0.109374 -0.0625,-0.152343 l -1.699219,-2.546875 c -0.04297,-0.06641 -0.152344,-0.152344 -0.234375,-0.171875 l -2.550781,-0.851563 c -0.042969,-0.01953 -0.085938,-0.01953 -0.128907,-0.01953 z m 0.085938,0.851563 1.574218,0 2.335938,0.785156 1.574219,2.359375 0.828125,4.121093 0,2.46875 -0.828125,4.121094 -1.574219,2.359375 -2.335938,0.785157 -1.574218,0 -2.335938,-0.785157 -1.574218,-2.359375 -0.828126,-4.121094 0,-2.46875 0.828126,-4.121093 1.574218,-2.359375 z m 0,0"
           style="stroke:none" />
      </symbol>
      <symbol
         style="overflow:visible"
         id="glyph3-5"
         overflow="visible">
        <path
           id="path105"
           d="m 7.609375,-16.578125 c -0.023437,0 -0.085937,0 -0.105469,0.01953 -0.023437,0 -0.042968,0.02344 -0.066406,0.04297 -0.082031,0.04297 -0.191406,0.148437 -0.210938,0.257813 L 0.445312,1.550781 C 0.425781,1.59375 0.425781,1.679688 0.425781,1.722656 c 0,0.234375 0.191407,0.425782 0.425781,0.425782 0.167969,0 0.359376,-0.128907 0.402344,-0.300782 l 2.148438,-5.671875 8.5,0 2.148437,5.671875 c 0.03906,0.171875 0.230469,0.300782 0.402344,0.300782 0.234375,0 0.425781,-0.191407 0.425781,-0.425782 0,-0.042968 0,-0.128906 -0.02344,-0.171875 L 8.078125,-16.257812 c -0.023437,-0.08594 -0.109375,-0.214844 -0.171875,-0.257813 -0.042969,-0.04297 -0.148438,-0.0625 -0.210938,-0.0625 z m 0.042969,1.613281 3.910156,10.289063 -7.820312,0 z m 0,0"
           style="stroke:none" />
      </symbol>
      <symbol
         style="overflow:visible"
         id="glyph3-6"
         overflow="visible">
        <path
           id="path108"
           d="m 3.402344,-16.578125 c -0.085938,0 -0.214844,0.04297 -0.277344,0.105469 l -0.023438,0 0,0.02344 -0.019531,0 -0.019531,0.01953 0,0.01953 c -0.042969,0.06641 -0.085938,0.171875 -0.085938,0.257812 l 0,17.851563 c 0,0.234375 0.191407,0.425781 0.425782,0.425781 0.230468,0 0.421875,-0.191406 0.421875,-0.425781 l 0,-8.074219 7.226562,0 c 0.04297,0 0.08594,0 0.128907,-0.023438 l 2.550781,-0.847656 c 0.04297,-0.023437 0.128906,-0.066406 0.171875,-0.109375 L 14.75,-8.203125 c 0.02344,-0.023437 0.0625,-0.066406 0.08594,-0.105469 l 0.851562,-1.703125 c 0.01953,-0.04297 0.03906,-0.125 0.03906,-0.191406 l 0,-2.550781 c 0,-0.0625 -0.01953,-0.148438 -0.03906,-0.191406 L 14.83594,-14.644531 C 14.8125,-14.6875 14.773438,-14.730469 14.75,-14.75 l -0.847656,-0.851562 c -0.04297,-0.04297 -0.128906,-0.08594 -0.171875,-0.105469 l -2.550781,-0.851563 c -0.04297,-0.01953 -0.08594,-0.01953 -0.128907,-0.01953 z m 0.421875,0.851563 7.164062,0 2.378907,0.804687 0.746093,0.722656 0.765625,1.554688 0,2.335937 -0.765625,1.550782 -0.746093,0.722656 -2.378907,0.808594 -7.164062,0 z m 0,0"
           style="stroke:none" />
      </symbol>
      <symbol
         style="overflow:visible"
         id="glyph3-7"
         overflow="visible">
        <path
           id="path111"
           d="m 3.402344,-16.578125 c -0.085938,0 -0.214844,0.04297 -0.277344,0.105469 l -0.023438,0 0,0.02344 -0.019531,0 -0.019531,0.01953 0,0.01953 c -0.042969,0.06641 -0.085938,0.171875 -0.085938,0.257812 l 0,17.851563 c 0,0.234375 0.191407,0.425781 0.425782,0.425781 0.230468,0 0.421875,-0.191406 0.421875,-0.425781 l 0,-8.925781 5.292969,0 5.824218,9.160156 c 0.0625,0.128906 0.234375,0.214844 0.363282,0.214844 0.230468,0 0.421874,-0.191407 0.421874,-0.425782 0,-0.066406 -0.01953,-0.191406 -0.0625,-0.257812 l -5.546874,-8.691406 0.933593,0 c 0.04297,0 0.08594,0 0.128907,-0.019532 l 2.550781,-0.851562 c 0.04297,-0.023438 0.128906,-0.0625 0.171875,-0.105469 L 14.75,-9.054688 c 0.02344,-0.019531 0.0625,-0.0625 0.08594,-0.105468 l 0.851562,-1.699219 c 0.01953,-0.04297 0.03906,-0.128906 0.03906,-0.191406 l 0,-1.703125 c 0,-0.0625 -0.01953,-0.148438 -0.03906,-0.191406 L 14.83594,-14.644531 C 14.8125,-14.6875 14.773438,-14.730469 14.75,-14.75 l -0.847656,-0.851562 c -0.04297,-0.04297 -0.128906,-0.08594 -0.171875,-0.105469 l -2.550781,-0.851563 c -0.04297,-0.01953 -0.08594,-0.01953 -0.128907,-0.01953 z m 0.421875,0.851563 7.164062,0 2.378907,0.804687 0.746093,0.722656 0.765625,1.554688 0,1.484375 -0.765625,1.554687 -0.746093,0.722657 -2.378907,0.804687 -7.164062,0 z m 0,0"
           style="stroke:none" />
      </symbol>
      <symbol
         style="overflow:visible"
         id="glyph3-8"
         overflow="visible">
        <path
           id="path114"
           d="m 3.402344,-16.578125 c -0.234375,0 -0.425782,0.191406 -0.425782,0.425781 l 0,17.851563 c 0,0.234375 0.191407,0.425781 0.425782,0.425781 0.230468,0 0.421875,-0.191406 0.421875,-0.425781 l 0,-17.851563 c 0,-0.234375 -0.191407,-0.425781 -0.421875,-0.425781 z m 0,0"
           style="stroke:none" />
      </symbol>
      <symbol
         style="overflow:visible"
         id="glyph3-9"
         overflow="visible">
        <path
           id="path117"
           d="m 2.976562,-16.152344 0,17.851563 c 0,0.085937 0.042969,0.214843 0.105469,0.277343 l 0,0.019532 0.019531,0 0,0.023437 0.023438,0.019531 0.019531,0 C 3.210938,2.082031 3.316406,2.125 3.402344,2.125 l 10.199218,0 c 0.234376,0 0.425782,-0.191406 0.425782,-0.425781 0,-0.234375 -0.191406,-0.425781 -0.425782,-0.425781 l -9.777343,0 0,-17.425782 c 0,-0.234375 -0.191407,-0.425781 -0.421875,-0.425781 -0.234375,0 -0.425782,0.191406 -0.425782,0.425781 z m 0,0"
           style="stroke:none" />
      </symbol>
      <symbol
         style="overflow:visible"
         id="glyph3-10"
         overflow="visible">
        <path
           id="path120"
           d="m 9.332031,-16.578125 c -0.085937,0 -0.214843,0.0625 -0.277343,0.128906 l -2.507813,2.507813 -1.636719,0.804687 c -0.148437,0.06641 -0.253906,0.234375 -0.253906,0.382813 0,0.234375 0.191406,0.425781 0.421875,0.425781 0.066406,0 0.171875,-0.01953 0.214844,-0.04297 l 1.699219,-0.847656 c 0.042968,-0.02344 0.085937,-0.06641 0.105468,-0.08594 l 1.828125,-1.828124 0,16.832031 c 0,0.234375 0.191407,0.425781 0.425781,0.425781 0.234376,0 0.425782,-0.191406 0.425782,-0.425781 l 0,-17.851563 c 0,-0.234375 -0.210938,-0.425781 -0.445313,-0.425781 z m 0,0"
           style="stroke:none" />
      </symbol>
      <symbol
         style="overflow:visible"
         id="glyph3-11"
         overflow="visible">
        <path
           id="path123"
           d="m 6.78125,-16.578125 -0.042969,0 c -0.023437,0 -0.085937,0.01953 -0.105469,0.01953 l 0,0.02344 L 4.125,-15.70703 c -0.085938,0.01953 -0.214844,0.128906 -0.257812,0.210937 l -0.847657,1.703125 c -0.023437,0.04297 -0.042969,0.125 -0.042969,0.191407 l 0,1.699218 c 0,0.0625 0.019532,0.148438 0.042969,0.191406 l 0.847657,1.699219 c 0.042968,0.066407 0.128906,0.148438 0.191406,0.191407 l 1.703125,0.851562 c 0.019531,0.019531 0.0625,0.019531 0.082031,0.019531 l 1.019531,0.257813 -1.890625,0.636718 c -0.042968,0.019532 -0.125,0.0625 -0.167968,0.105469 L 3.101562,-6.25 c -0.019531,0.023438 -0.0625,0.066406 -0.082031,0.109375 L 2.167969,-4.441406 C 2.148438,-4.398438 2.125,-4.316406 2.125,-4.25 l 0,2.550781 c 0,0.0625 0.023438,0.148438 0.042969,0.191407 l 0.851562,1.699218 c 0.019531,0.042969 0.0625,0.085938 0.082031,0.105469 L 3.953125,1.148438 C 3.996094,1.191406 4.082031,1.234375 4.125,1.253906 L 6.675781,2.105469 C 6.714844,2.125 6.757812,2.125 6.800781,2.125 l 3.402344,0 c 0.04297,0 0.08594,0 0.125,-0.019531 l 2.550781,-0.851563 c 0.04297,-0.019531 0.128906,-0.0625 0.171875,-0.105468 l 0.851563,-0.851563 c 0.01953,-0.019531 0.0625,-0.0625 0.08203,-0.105469 l 0.851563,-1.699218 c 0.01953,-0.042969 0.04297,-0.128907 0.04297,-0.191407 l 0,-2.550781 c 0,-0.066406 -0.02344,-0.148438 -0.04297,-0.191406 l -0.851563,-1.699219 c -0.01953,-0.042969 -0.0625,-0.085937 -0.08203,-0.109375 l -1.703125,-1.699219 c -0.04297,-0.042969 -0.125,-0.085937 -0.167969,-0.105469 l -1.894531,-0.636718 1.023437,-0.257813 c 0.01953,0 0.0625,0 0.08203,-0.019531 l 1.703124,-0.851562 c 0.0625,-0.042969 0.148438,-0.125 0.191407,-0.191407 l 0.847656,-1.699219 c 0.02344,-0.04297 0.04297,-0.128906 0.04297,-0.191406 l 0,-1.699218 c 0,-0.06641 -0.01953,-0.148438 -0.04297,-0.191407 l -0.847656,-1.703125 c -0.04297,-0.08203 -0.171875,-0.191406 -0.257813,-0.210937 l -2.550781,-0.851563 c -0.03906,-0.01953 -0.08203,-0.01953 -0.125,-0.01953 z m 0.082031,0.851563 3.273438,0 2.320312,0.761718 0.722657,1.46875 0,1.488282 -0.746094,1.488281 -1.53125,0.765625 -2.402344,0.59375 -2.398438,-0.59375 -1.53125,-0.765625 -0.746093,-1.488281 0,-1.488282 0.722656,-1.46875 z m 2.359375,7.628906 2.445313,0.828125 1.59375,1.574219 0.765625,1.550781 0,2.339843 -0.765625,1.550782 -0.742188,0.722656 -2.382812,0.804688 -3.273438,0 L 4.484375,0.46875 3.742188,-0.253906 2.976562,-1.804688 l 0,-2.339843 0.765626,-1.550781 1.59375,-1.574219 2.441406,-0.828125 c 0,0 0.722656,-0.171875 0.722656,-0.171875 0,0 0.722656,0.171875 0.722656,0.171875 z m 0,0"
           style="stroke:none" />
      </symbol>
      <symbol
         style="overflow:visible"
         id="glyph3-12"
         overflow="visible">
        <path
           id="path126"
           d="m 17.855469,-8.925781 c 0.230469,0 0.421875,0.191406 0.421875,0.425781 l 0,1.699219 c 0,0.042969 0,0.085937 -0.01953,0.125 l 0,0.023437 L 17.40625,-4.125 c -0.01953,0.085938 -0.125,0.214844 -0.210938,0.257812 l -1.699218,0.847657 c -0.04297,0.023437 -0.128906,0.042969 -0.191406,0.042969 l -1.703126,0 c -0.0625,0 -0.148437,-0.019532 -0.191406,-0.042969 l -1.699218,-0.847657 c -0.01953,0 -0.04297,-0.023437 -0.0625,-0.042968 l -3.378907,-2.53125 -1.574219,-0.785156 -1.488281,0 -1.488281,0.742187 -0.742188,1.488281 0,1.59375 c 0,0.234375 -0.191406,0.425782 -0.425781,0.425782 -0.234375,0 -0.425781,-0.191407 -0.425781,-0.425782 l 0,-1.699218 c 0,-0.042969 0,-0.085938 0.023438,-0.128907 l 0,-0.019531 0.847656,-2.527344 C 3.019531,-7.863281 3.125,-7.992188 3.210938,-8.035156 L 4.910156,-8.882812 C 4.953125,-8.90625 5.039062,-8.925781 5.101562,-8.925781 l 1.699219,0 c 0.0625,0 0.148438,0.019531 0.191407,0.042969 l 1.699218,0.847656 c 0.023438,0 0.042969,0.023437 0.066406,0.042968 l 3.378907,2.53125 1.574219,0.785157 1.484374,0 1.488282,-0.742188 0.746094,-1.488281 0,-1.59375 c 0,-0.234375 0.191406,-0.425781 0.425781,-0.425781 z m 0,0"
           style="stroke:none" />
      </symbol>
      <symbol
         style="overflow:visible"
         id="glyph5-0"
         overflow="visible">
        <path
           id="path129"
           d="m 0,-8.925781 c 0.0625,0 0.171875,0.019531 0.234375,0.0625 l 2.527344,1.699219 3.339843,1.660156 4.144532,0.828125 3.3125,0 4.144531,-0.828125 3.339844,-1.660156 2.527343,-1.699219 c 0.06641,-0.042969 0.171876,-0.0625 0.234376,-0.0625 0.234374,0 0.425781,0.191406 0.425781,0.425781 0,0.125 -0.08594,0.296875 -0.191407,0.359375 l -2.550781,1.699219 c -0.01953,0 -0.01953,0.023437 -0.04297,0.023437 l -3.398437,1.699219 c -0.02344,0.023438 -0.08594,0.042969 -0.109375,0.042969 l -4.25,0.851562 -3.570312,0 -4.25,-0.851562 c -0.023438,0 -0.085938,-0.019531 -0.105469,-0.042969 L 2.359375,-6.417969 c -0.019531,0 -0.019531,-0.023437 -0.042969,-0.023437 L -0.234375,-8.140625 C -0.339844,-8.203125 -0.425781,-8.375 -0.425781,-8.5 c 0,-0.234375 0.191406,-0.425781 0.425781,-0.425781 z m 0,0"
           style="stroke:none" />
      </symbol>
      <symbol
         style="overflow:visible"
         id="glyph5-1"
         overflow="visible">
        <path
           id="path132"
           d="m 10.203125,-8.078125 3.484375,0 4.25,0.851563 c 0.02344,0 0.08594,0.019531 0.109375,0.042968 l 3.398437,1.699219 c 0.02344,0 0.02344,0.023437 0.04297,0.023437 l 2.550781,1.699219 c 0.105469,0.0625 0.191407,0.234375 0.191407,0.359375 0,0.234375 -0.191407,0.425782 -0.425781,0.425782 -0.0625,0 -0.167969,-0.019532 -0.234376,-0.0625 l -2.527343,-1.699219 -3.339844,-1.660157 -4.144531,-0.828124 -3.3125,0 -4.144532,0.828124 -3.339843,1.660157 -2.527344,1.699219 C 0.171875,-2.996094 0.0625,-2.976562 0,-2.976562 c -0.234375,0 -0.425781,-0.191407 -0.425781,-0.425782 0,-0.125 0.085937,-0.296875 0.191406,-0.359375 l 2.550781,-1.699219 c 0.023438,0 0.023438,-0.023437 0.042969,-0.023437 L 5.761719,-7.183594 C 5.78125,-7.207031 5.84375,-7.226562 5.867188,-7.226562 l 4.25,-0.851563 z m 0,0"
           style="stroke:none" />
      </symbol>
    </g>
    <clipPath
       id="clip1">
      <path
         id="path135"
         d="m 29,29 2327,0 0,1626.3477 -2327,0 z m 0,0" />
    </clipPath>
  </defs>
  <g
     transform="translate(-780.89996,-82.127613)"
     id="surface1289"
     style="fill:#000000">
    <g
       transform="translate(173.10699,40.257442)"
       id="g142"
       style="fill:#000000;fill-opacity:1">
      <use
         style="fill:#000000;fill-opacity:1"
         height="100%"
         width="100%"
         id="use144"
         y="79.260796"
         x="610.75"
         xlink:href="#glyph0-0" />
    </g>
    <g
       id="g146"
       style="fill:#000000;fill-opacity:1">
      <use
         height="100%"
         width="100%"
         style="fill:#000000;fill-opacity:1"
         id="use148"
         y="126.52095"
         x="808.31195"
         xlink:href="#glyph1-0" />
    </g>
    <g
       id="g150"
       style="fill:#000000;fill-opacity:1">
      <use
         height="100%"
         width="100%"
         style="fill:#000000;fill-opacity:1"
         id="use152"
         y="126.52095"
         x="825.31567"
         xlink:href="#glyph1-0" />
    </g>
    <g
       id="g154"
       style="fill:#000000;fill-opacity:1">
      <use
         height="100%"
         width="100%"
         style="fill:#000000;fill-opacity:1"
         id="use156"
         y="117.51902"
         x="842.31537"
         xlink:href="#glyph2-0" />
    </g>
    <g
       id="g158"
       style="fill:#000000;fill-opacity:1">
      <use
         height="100%"
         width="100%"
         style="fill:#000000;fill-opacity:1"
         id="use160"
         y="117.51902"
         x="850.64606"
         xlink:href="#glyph2-1" />
    </g>
    <g
       id="g162"
       style="fill:#000000;fill-opacity:1">
      <use
         height="100%"
         width="100%"
         style="fill:#000000;fill-opacity:1"
         id="use164"
         y="126.52095"
         x="1003.7172"
         xlink:href="#glyph1-1" />
    </g>
    <g
       id="g166"
       style="fill:#000000;fill-opacity:1">
      <use
         height="100%"
         width="100%"
         style="fill:#000000;fill-opacity:1"
         id="use168"
         y="126.52095"
         x="1012.2191"
         xlink:href="#glyph1-2" />
    </g>
    <g
       id="g170"
       style="fill:#000000;fill-opacity:1">
      <use
         height="100%"
         width="100%"
         style="fill:#000000;fill-opacity:1"
         id="use172"
         y="126.52095"
         x="1030.9232"
         xlink:href="#glyph1-3" />
    </g>
    <g
       id="g174"
       style="fill:#000000;fill-opacity:1">
      <use
         height="100%"
         width="100%"
         style="fill:#000000;fill-opacity:1"
         id="use176"
         y="126.52095"
         x="1049.6272"
         xlink:href="#glyph1-4" />
    </g>
    <g
       id="g178"
       style="fill:#000000;fill-opacity:1">
      <use
         height="100%"
         width="100%"
         style="fill:#000000;fill-opacity:1"
         id="use180"
         y="126.52095"
         x="1066.631"
         xlink:href="#glyph1-5" />
    </g>
    <g
       id="g182"
       style="fill:#000000;fill-opacity:1">
      <use
         height="100%"
         width="100%"
         id="use184"
         y="126.52095"
         x="1214.6063"
         xlink:href="#glyph1-6"
         style="fill:#000000" />
    </g>
    <g
       id="g186"
       style="fill:#000000;fill-opacity:1">
      <use
         height="100%"
         width="100%"
         style="fill:#000000;fill-opacity:1"
         id="use188"
         y="126.52095"
         x="1228.203"
         xlink:href="#glyph1-2" />
    </g>
    <g
       id="g190"
       style="fill:#000000;fill-opacity:1">
      <use
         height="100%"
         width="100%"
         style="fill:#000000;fill-opacity:1"
         id="use192"
         y="126.52095"
         x="1246.907"
         xlink:href="#glyph1-7" />
    </g>
    <g
       id="g194"
       style="fill:#000000;fill-opacity:1">
      <use
         height="100%"
         width="100%"
         id="use196"
         y="126.52095"
         x="1262.2103"
         xlink:href="#glyph1-6"
         style="fill:#000000" />
    </g>
    <g
       id="g198"
       style="fill:#000000;fill-opacity:1">
      <use
         height="100%"
         width="100%"
         style="fill:#000000;fill-opacity:1"
         id="use200"
         y="126.52095"
         x="1389.7572"
         xlink:href="#glyph1-8" />
    </g>
    <g
       id="g202"
       style="fill:#000000;fill-opacity:1">
      <use
         height="100%"
         width="100%"
         id="use204"
         y="126.52095"
         x="1399.9594"
         xlink:href="#glyph1-6"
         style="fill:#000000" />
    </g>
    <g
       id="g206"
       style="fill:#000000;fill-opacity:1">
      <use
         height="100%"
         width="100%"
         id="use208"
         y="126.52095"
         x="1607.4329"
         xlink:href="#glyph1-6"
         style="fill:#000000" />
    </g>
    <g
       id="g210"
       style="fill:#000000;fill-opacity:1">
      <use
         height="100%"
         width="100%"
         style="fill:#000000;fill-opacity:1"
         id="use212"
         y="126.52095"
         x="1621.0295"
         xlink:href="#glyph1-4" />
    </g>
    <g
       id="g214"
       style="fill:#000000;fill-opacity:1">
      <use
         height="100%"
         width="100%"
         style="fill:#000000;fill-opacity:1"
         id="use216"
         y="126.52095"
         x="1638.0332"
         xlink:href="#glyph1-3" />
    </g>
    <g
       id="g218"
       style="fill:#000000;fill-opacity:1">
      <use
         height="100%"
         width="100%"
         style="fill:#000000;fill-opacity:1"
         id="use220"
         y="126.52095"
         x="1656.7373"
         xlink:href="#glyph1-9" />
    </g>
    <g
       id="g222"
       style="fill:#000000;fill-opacity:1">
      <use
         height="100%"
         width="100%"
         id="use224"
         y="126.52095"
         x="1675.4414"
         xlink:href="#glyph1-6"
         style="fill:#000000" />
    </g>
    <g
       id="g226"
       style="fill:#000000;fill-opacity:1">
      <use
         height="100%"
         width="100%"
         id="use228"
         y="126.52095"
         x="1802.9905"
         xlink:href="#glyph1-6"
         style="fill:#000000" />
    </g>
    <g
       id="g230"
       style="fill:#000000;fill-opacity:1">
      <use
         height="100%"
         width="100%"
         id="use232"
         y="126.52095"
         x="2000.2712"
         xlink:href="#glyph1-6"
         style="fill:#000000" />
    </g>
    <g
       id="g234"
       style="fill:#000000;fill-opacity:1">
      <use
         height="100%"
         width="100%"
         id="use236"
         y="126.52095"
         x="2158.438"
         xlink:href="#glyph1-6"
         style="fill:#000000" />
    </g>
    <g
       id="g246"
       style="fill:#000000;fill-opacity:1">
      <use
         height="100%"
         width="100%"
         id="use248"
         y="158.02773"
         x="1381.7791"
         xlink:href="#glyph3-2"
         style="fill:#000000" />
    </g>
    <g
       id="g254"
       style="fill:#000000;fill-opacity:1">
      <use
         height="100%"
         width="100%"
         id="use256"
         y="158.02773"
         x="1408.1348"
         xlink:href="#glyph3-2"
         style="fill:#000000" />
    </g>
    <g
       id="g266"
       style="fill:#000000;fill-opacity:1">
      <use
         height="100%"
         width="100%"
         id="use268"
         y="158.02773"
         x="1455.7451"
         xlink:href="#glyph3-2"
         style="fill:#000000" />
    </g>
    <g
       id="g290"
       style="fill:#000000;fill-opacity:1">
      <use
         height="100%"
         width="100%"
         id="use292"
         y="158.02773"
         x="1537.3629"
         xlink:href="#glyph3-2"
         style="fill:#000000" />
    </g>
    <g
       id="g310"
       style="fill:#000000;fill-opacity:1">
      <use
         height="100%"
         width="100%"
         id="use312"
         y="158.02773"
         x="1618.9783"
         xlink:href="#glyph3-2"
         style="fill:#000000" />
    </g>
    <g
       transform="translate(-12.077233,-90.579244)"
       id="g318"
       style="fill:#000000;fill-opacity:1">
      <use
         style="fill:#000000;fill-opacity:1"
         height="100%"
         width="100%"
         id="use320"
         y="238.29497"
         x="2181.4702"
         xlink:href="#glyph0-1" />
    </g>
    <g
       id="g326"
       style="fill:#000000;fill-opacity:1">
      <use
         height="100%"
         width="100%"
         id="use328"
         y="277.30334"
         x="1476.5767"
         xlink:href="#glyph1-6"
         style="fill:#000000" />
    </g>
    <g
       id="g334"
       style="fill:#000000;fill-opacity:1">
      <use
         height="100%"
         width="100%"
         id="use336"
         y="320.06253"
         x="610.75"
         xlink:href="#glyph1-6"
         style="fill:#000000" />
    </g>
    <g
       id="g338"
       style="fill:#000000;fill-opacity:1">
      <use
         height="100%"
         width="100%"
         id="use340"
         y="345.56802"
         x="610.75"
         xlink:href="#glyph1-6"
         style="fill:#000000" />
    </g>
    <g
       id="g342"
       style="fill:#000000;fill-opacity:1">
      <use
         height="100%"
         width="100%"
         id="use344"
         y="129.52159"
         x="862.54626"
         xlink:href="#glyph1-6"
         style="fill:#000000" />
    </g>
    <g
       id="g346"
       style="fill:#000000;fill-opacity:1">
      <use
         height="100%"
         width="100%"
         style="fill:#000000;fill-opacity:1"
         id="use348"
         y="128.77144"
         x="876.15466"
         xlink:href="#glyph1-1" />
    </g>
    <g
       id="g350"
       style="fill:#000000;fill-opacity:1">
      <use
         height="100%"
         width="100%"
         style="fill:#000000;fill-opacity:1"
         id="use352"
         y="127.27111"
         x="884.66431"
         xlink:href="#glyph1-3" />
    </g>
    <g
       id="g354"
       style="fill:#000000;fill-opacity:1">
      <use
         height="100%"
         width="100%"
         style="fill:#000000;fill-opacity:1"
         id="use356"
         y="126.52095"
         x="903.37146"
         xlink:href="#glyph1-10" />
    </g>
    <g
       id="g358"
       style="fill:#000000;fill-opacity:1">
      <use
         height="100%"
         width="100%"
         style="fill:#000000;fill-opacity:1"
         id="use360"
         y="126.52095"
         x="918.67944"
         xlink:href="#glyph1-11" />
    </g>
    <g
       id="g362"
       style="fill:#000000;fill-opacity:1">
      <use
         height="100%"
         width="100%"
         style="fill:#000000;fill-opacity:1"
         id="use364"
         y="126.52095"
         x="935.68701"
         xlink:href="#glyph1-12" />
    </g>
    <g
       id="g366"
       style="fill:#000000;fill-opacity:1">
      <use
         height="100%"
         width="100%"
         style="fill:#000000;fill-opacity:1"
         id="use368"
         y="127.27111"
         x="952.69458"
         xlink:href="#glyph1-3" />
    </g>
    <g
       id="g370"
       style="fill:#000000;fill-opacity:1">
      <use
         height="100%"
         width="100%"
         style="fill:#000000;fill-opacity:1"
         id="use372"
         y="128.02127"
         x="971.40173"
         xlink:href="#glyph1-4" />
    </g>
    <g
       id="g374"
       style="fill:#000000;fill-opacity:1">
      <use
         height="100%"
         width="100%"
         style="fill:#000000;fill-opacity:1"
         id="use376"
         y="129.52159"
         x="988.40924"
         xlink:href="#glyph1-10" />
    </g>
    <g
       id="g378"
       style="fill:#000000;fill-opacity:1">
      <use
         height="100%"
         width="100%"
         id="use380"
         y="129.52159"
         x="1080.2336"
         xlink:href="#glyph1-6"
         style="fill:#000000" />
    </g>
    <g
       id="g382"
       style="fill:#000000;fill-opacity:1">
      <use
         height="100%"
         width="100%"
         style="fill:#000000;fill-opacity:1"
         id="use384"
         y="128.02127"
         x="1093.8422"
         xlink:href="#glyph1-7" />
    </g>
    <g
       id="g386"
       style="fill:#000000;fill-opacity:1">
      <use
         height="100%"
         width="100%"
         style="fill:#000000;fill-opacity:1"
         id="use388"
         y="127.27111"
         x="1109.15"
         xlink:href="#glyph1-11" />
    </g>
    <g
       id="g390"
       style="fill:#000000;fill-opacity:1">
      <use
         height="100%"
         width="100%"
         style="fill:#000000;fill-opacity:1"
         id="use392"
         y="126.52095"
         x="1126.1576"
         xlink:href="#glyph1-13" />
    </g>
    <g
       id="g394"
       style="fill:#000000;fill-opacity:1">
      <use
         height="100%"
         width="100%"
         style="fill:#000000;fill-opacity:1"
         id="use396"
         y="126.52095"
         x="1143.1652"
         xlink:href="#glyph1-10" />
    </g>
    <g
       id="g398"
       style="fill:#000000;fill-opacity:1">
      <use
         height="100%"
         width="100%"
         style="fill:#000000;fill-opacity:1"
         id="use400"
         y="126.52095"
         x="1158.4731"
         xlink:href="#glyph1-1" />
    </g>
    <g
       id="g402"
       style="fill:#000000;fill-opacity:1">
      <use
         height="100%"
         width="100%"
         style="fill:#000000;fill-opacity:1"
         id="use404"
         y="126.52095"
         x="1166.9828"
         xlink:href="#glyph1-14" />
    </g>
    <g
       id="g406"
       style="fill:#000000;fill-opacity:1">
      <use
         height="100%"
         width="100%"
         style="fill:#000000;fill-opacity:1"
         id="use408"
         y="128.02127"
         x="1183.9904"
         xlink:href="#glyph1-4" />
    </g>
    <g
       id="g410"
       style="fill:#000000;fill-opacity:1">
      <use
         height="100%"
         width="100%"
         style="fill:#000000;fill-opacity:1"
         id="use412"
         y="129.52159"
         x="1200.9978"
         xlink:href="#glyph1-5" />
    </g>
    <g
       id="g414"
       style="fill:#000000;fill-opacity:1">
      <use
         height="100%"
         width="100%"
         style="fill:#000000;fill-opacity:1"
         id="use416"
         y="125.02063"
         x="1275.803"
         xlink:href="#glyph1-7" />
    </g>
    <g
       id="g418"
       style="fill:#000000;fill-opacity:1">
      <use
         height="100%"
         width="100%"
         style="fill:#000000;fill-opacity:1"
         id="use420"
         y="125.77079"
         x="1291.1111"
         xlink:href="#glyph1-4" />
    </g>
    <g
       id="g422"
       style="fill:#000000;fill-opacity:1">
      <use
         height="100%"
         width="100%"
         style="fill:#000000;fill-opacity:1"
         id="use424"
         y="126.52095"
         x="1308.1185"
         xlink:href="#glyph1-13" />
    </g>
    <g
       id="g426"
       style="fill:#000000;fill-opacity:1">
      <use
         height="100%"
         width="100%"
         style="fill:#000000;fill-opacity:1"
         id="use428"
         y="126.52095"
         x="1325.1262"
         xlink:href="#glyph1-15" />
    </g>
    <g
       id="g430"
       style="fill:#000000;fill-opacity:1">
      <use
         height="100%"
         width="100%"
         style="fill:#000000;fill-opacity:1"
         id="use432"
         y="126.52095"
         x="1343.8334"
         xlink:href="#glyph1-1" />
    </g>
    <g
       id="g434"
       style="fill:#000000;fill-opacity:1">
      <use
         height="100%"
         width="100%"
         style="fill:#000000;fill-opacity:1"
         id="use436"
         y="126.52095"
         x="1352.3429"
         xlink:href="#glyph1-2" />
    </g>
    <g
       id="g438"
       style="fill:#000000;fill-opacity:1">
      <use
         height="100%"
         width="100%"
         style="fill:#000000;fill-opacity:1"
         id="use440"
         y="125.02063"
         x="1371.05"
         xlink:href="#glyph1-3" />
    </g>
    <g
       id="g442"
       style="fill:#000000;fill-opacity:1">
      <use
         height="100%"
         width="100%"
         style="fill:#000000;fill-opacity:1"
         id="use444"
         y="131.77208"
         x="1413.5514"
         xlink:href="#glyph1-16" />
    </g>
    <g
       id="g446"
       style="fill:#000000;fill-opacity:1">
      <use
         height="100%"
         width="100%"
         style="fill:#000000;fill-opacity:1"
         id="use448"
         y="129.52159"
         x="1430.5588"
         xlink:href="#glyph1-15" />
    </g>
    <g
       id="g450"
       style="fill:#000000;fill-opacity:1">
      <use
         height="100%"
         width="100%"
         style="fill:#000000;fill-opacity:1"
         id="use452"
         y="128.02127"
         x="1449.266"
         xlink:href="#glyph1-2" />
    </g>
    <g
       id="g454"
       style="fill:#000000;fill-opacity:1">
      <use
         height="100%"
         width="100%"
         style="fill:#000000;fill-opacity:1"
         id="use456"
         y="127.27111"
         x="1467.9731"
         xlink:href="#glyph1-10" />
    </g>
    <g
       id="g458"
       style="fill:#000000;fill-opacity:1">
      <use
         height="100%"
         width="100%"
         style="fill:#000000;fill-opacity:1"
         id="use460"
         y="126.52095"
         x="1483.2812"
         xlink:href="#glyph1-2" />
    </g>
    <g
       id="g462"
       style="fill:#000000;fill-opacity:1">
      <use
         height="100%"
         width="100%"
         style="fill:#000000;fill-opacity:1"
         id="use464"
         y="126.52095"
         x="1501.9883"
         xlink:href="#glyph1-17" />
    </g>
    <g
       id="g466"
       style="fill:#000000;fill-opacity:1">
      <use
         height="100%"
         width="100%"
         style="fill:#000000;fill-opacity:1"
         id="use468"
         y="126.52095"
         x="1520.6954"
         xlink:href="#glyph1-12" />
    </g>
    <g
       id="g470"
       style="fill:#000000;fill-opacity:1">
      <use
         height="100%"
         width="100%"
         style="fill:#000000;fill-opacity:1"
         id="use472"
         y="127.27111"
         x="1537.703"
         xlink:href="#glyph1-4" />
    </g>
    <g
       id="g474"
       style="fill:#000000;fill-opacity:1">
      <use
         height="100%"
         width="100%"
         style="fill:#000000;fill-opacity:1"
         id="use476"
         y="128.02127"
         x="1554.7107"
         xlink:href="#glyph1-16" />
    </g>
    <g
       id="g478"
       style="fill:#000000;fill-opacity:1">
      <use
         height="100%"
         width="100%"
         style="fill:#000000;fill-opacity:1"
         id="use480"
         y="129.52159"
         x="1571.7181"
         xlink:href="#glyph1-15" />
    </g>
    <g
       id="g482"
       style="fill:#000000;fill-opacity:1">
      <use
         height="100%"
         width="100%"
         style="fill:#000000;fill-opacity:1"
         id="use484"
         y="131.77208"
         x="1590.4254"
         xlink:href="#glyph1-18" />
    </g>
    <g
       id="g486"
       style="fill:#000000;fill-opacity:1">
      <use
         height="100%"
         width="100%"
         style="fill:#000000;fill-opacity:1"
         id="use488"
         y="125.02063"
         x="1689.0364"
         xlink:href="#glyph1-7" />
    </g>
    <g
       id="g490"
       style="fill:#000000;fill-opacity:1">
      <use
         height="100%"
         width="100%"
         style="fill:#000000;fill-opacity:1"
         id="use492"
         y="125.77079"
         x="1704.3444"
         xlink:href="#glyph1-4" />
    </g>
    <g
       id="g494"
       style="fill:#000000;fill-opacity:1">
      <use
         height="100%"
         width="100%"
         style="fill:#000000;fill-opacity:1"
         id="use496"
         y="126.52095"
         x="1721.3519"
         xlink:href="#glyph1-13" />
    </g>
    <g
       id="g498"
       style="fill:#000000;fill-opacity:1">
      <use
         height="100%"
         width="100%"
         style="fill:#000000;fill-opacity:1"
         id="use500"
         y="126.52095"
         x="1738.3594"
         xlink:href="#glyph1-15" />
    </g>
    <g
       id="g502"
       style="fill:#000000;fill-opacity:1">
      <use
         height="100%"
         width="100%"
         style="fill:#000000;fill-opacity:1"
         id="use504"
         y="126.52095"
         x="1757.0665"
         xlink:href="#glyph1-1" />
    </g>
    <g
       id="g506"
       style="fill:#000000;fill-opacity:1">
      <use
         height="100%"
         width="100%"
         style="fill:#000000;fill-opacity:1"
         id="use508"
         y="126.52095"
         x="1765.5763"
         xlink:href="#glyph1-2" />
    </g>
    <g
       id="g510"
       style="fill:#000000;fill-opacity:1">
      <use
         height="100%"
         width="100%"
         style="fill:#000000;fill-opacity:1"
         id="use512"
         y="125.02063"
         x="1784.2834"
         xlink:href="#glyph1-3" />
    </g>
    <g
       id="g514"
       style="fill:#000000;fill-opacity:1">
      <use
         height="100%"
         width="100%"
         style="fill:#000000;fill-opacity:1"
         id="use516"
         y="131.02193"
         x="1816.5872"
         xlink:href="#glyph1-4" />
    </g>
    <g
       id="g518"
       style="fill:#000000;fill-opacity:1">
      <use
         height="100%"
         width="100%"
         style="fill:#000000;fill-opacity:1"
         id="use520"
         y="128.77144"
         x="1833.5947"
         xlink:href="#glyph1-19" />
    </g>
    <g
       id="g522"
       style="fill:#000000;fill-opacity:1">
      <use
         height="100%"
         width="100%"
         style="fill:#000000;fill-opacity:1"
         id="use524"
         y="128.02127"
         x="1852.3019"
         xlink:href="#glyph1-19" />
    </g>
    <g
       id="g526"
       style="fill:#000000;fill-opacity:1">
      <use
         height="100%"
         width="100%"
         style="fill:#000000;fill-opacity:1"
         id="use528"
         y="126.52095"
         x="1871.0089"
         xlink:href="#glyph1-11" />
    </g>
    <g
       id="g530"
       style="fill:#000000;fill-opacity:1">
      <use
         height="100%"
         width="100%"
         style="fill:#000000;fill-opacity:1"
         id="use532"
         y="126.52095"
         x="1888.0166"
         xlink:href="#glyph1-13" />
    </g>
    <g
       id="g534"
       style="fill:#000000;fill-opacity:1">
      <use
         height="100%"
         width="100%"
         style="fill:#000000;fill-opacity:1"
         id="use536"
         y="126.52095"
         x="1905.0242"
         xlink:href="#glyph1-13" />
    </g>
    <g
       id="g538"
       style="fill:#000000;fill-opacity:1">
      <use
         height="100%"
         width="100%"
         style="fill:#000000;fill-opacity:1"
         id="use540"
         y="126.52095"
         x="1922.0316"
         xlink:href="#glyph1-2" />
    </g>
    <g
       id="g542"
       style="fill:#000000;fill-opacity:1">
      <use
         height="100%"
         width="100%"
         style="fill:#000000;fill-opacity:1"
         id="use544"
         y="127.27111"
         x="1940.7388"
         xlink:href="#glyph1-12" />
    </g>
    <g
       id="g546"
       style="fill:#000000;fill-opacity:1">
      <use
         height="100%"
         width="100%"
         style="fill:#000000;fill-opacity:1"
         id="use548"
         y="128.02127"
         x="1957.7465"
         xlink:href="#glyph1-1" />
    </g>
    <g
       id="g550"
       style="fill:#000000;fill-opacity:1">
      <use
         height="100%"
         width="100%"
         style="fill:#000000;fill-opacity:1"
         id="use552"
         y="128.77144"
         x="1966.256"
         xlink:href="#glyph1-11" />
    </g>
    <g
       id="g554"
       style="fill:#000000;fill-opacity:1">
      <use
         height="100%"
         width="100%"
         style="fill:#000000;fill-opacity:1"
         id="use556"
         y="131.02193"
         x="1983.2635"
         xlink:href="#glyph1-13" />
    </g>
    <g
       id="g558"
       style="fill:#000000;fill-opacity:1">
      <use
         height="100%"
         width="100%"
         style="fill:#000000;fill-opacity:1"
         id="use560"
         y="122.77014"
         x="2013.8679"
         xlink:href="#glyph1-1" />
    </g>
    <g
       id="g562"
       style="fill:#000000;fill-opacity:1">
      <use
         height="100%"
         width="100%"
         style="fill:#000000;fill-opacity:1"
         id="use564"
         y="124.27046"
         x="2022.3774"
         xlink:href="#glyph1-3" />
    </g>
    <g
       id="g566"
       style="fill:#000000;fill-opacity:1">
      <use
         height="100%"
         width="100%"
         id="use568"
         y="125.77079"
         x="2041.0847"
         xlink:href="#glyph1-6"
         style="fill:#000000" />
    </g>
    <g
       id="g570"
       style="fill:#000000;fill-opacity:1">
      <use
         height="100%"
         width="100%"
         style="fill:#000000;fill-opacity:1"
         id="use572"
         y="126.52095"
         x="2054.6929"
         xlink:href="#glyph1-15" />
    </g>
    <g
       id="g574"
       style="fill:#000000;fill-opacity:1">
      <use
         height="100%"
         width="100%"
         style="fill:#000000;fill-opacity:1"
         id="use576"
         y="126.52095"
         x="2073.4001"
         xlink:href="#glyph1-18" />
    </g>
    <g
       id="g578"
       style="fill:#000000;fill-opacity:1">
      <use
         height="100%"
         width="100%"
         style="fill:#000000;fill-opacity:1"
         id="use580"
         y="126.52095"
         x="2090.4077"
         xlink:href="#glyph1-20" />
    </g>
    <g
       id="g582"
       style="fill:#000000;fill-opacity:1">
      <use
         height="100%"
         width="100%"
         style="fill:#000000;fill-opacity:1"
         id="use584"
         y="125.77079"
         x="2107.4153"
         xlink:href="#glyph1-12" />
    </g>
    <g
       id="g586"
       style="fill:#000000;fill-opacity:1">
      <use
         height="100%"
         width="100%"
         style="fill:#000000;fill-opacity:1"
         id="use588"
         y="125.02063"
         x="2124.4229"
         xlink:href="#glyph1-11" />
    </g>
    <g
       id="g590"
       style="fill:#000000;fill-opacity:1">
      <use
         height="100%"
         width="100%"
         style="fill:#000000;fill-opacity:1"
         id="use592"
         y="122.77014"
         x="2141.4304"
         xlink:href="#glyph1-13" />
    </g>
  </g>
</svg>
