<?xml version="1.0" encoding="UTF-8"?>
<svg xmlns="http://www.w3.org/2000/svg" xmlns:xlink="http://www.w3.org/1999/xlink" width="468pt" height="675pt" viewBox="0 0 468 675" version="1.1">
<defs>
<clipPath id="clip1">
  <path d="M 174.332031 237.046875 L 325.277344 237.046875 L 325.277344 438.308594 L 174.332031 438.308594 Z M 174.332031 237.046875 "/>
</clipPath>
<clipPath id="clip2">
  <path d="M 174.332031 237.046875 L 325.277344 237.046875 L 325.277344 438.308594 L 174.332031 438.308594 Z M 174.332031 237.046875 "/>
</clipPath>
</defs>
<g id="surface1">
<g clip-path="url(#clip1)" clip-rule="nonzero">
<path style=" stroke:none;fill-rule:nonzero;fill:rgb(100%,100%,100%);fill-opacity:1;" d="M 88.628906 507.726562 L 399.683594 507.726562 L 399.683594 171.238281 L 88.628906 171.238281 Z M 88.628906 507.726562 "/>
</g>
<path style=" stroke:none;fill-rule:nonzero;fill:rgb(13.729858%,12.159729%,12.548828%);fill-opacity:1;" d="M 210.363281 303.773438 C 211.222656 305.726562 211.566406 310.578125 211.445312 312.023438 C 211.316406 313.472656 209.90625 313.085938 209.773438 311.648438 C 209.640625 310.203125 208.972656 303.707031 207.585938 300.292969 C 206.195312 296.882812 204.351562 293.015625 204.148438 292.496094 C 203.9375 291.976562 205.164062 291.449219 205.503906 291.613281 C 205.84375 291.777344 207.050781 293.566406 207.4375 294.746094 C 207.824219 295.925781 209.628906 300.121094 211.441406 301.742188 C 214.691406 304.667969 216.636719 303.273438 217.886719 299.011719 C 219.136719 294.753906 220.160156 288.566406 220.847656 286.777344 C 221.527344 284.980469 223.847656 283.449219 225.339844 285.550781 C 226.824219 287.648438 228.699219 293.300781 228.699219 293.300781 C 228.699219 293.300781 229.128906 286.492188 229.421875 284.738281 C 230.015625 281.191406 231.515625 279.746094 232.871094 279.695312 C 234.222656 279.648438 235.890625 280.734375 236.976562 284.226562 C 238.0625 287.722656 238.523438 292.992188 241.949219 291.671875 C 245.371094 290.351562 249.535156 285.867188 250.398438 284.96875 C 251.8125 283.503906 253.519531 282.1875 254.453125 281.824219 C 256.742188 280.9375 259.5 281.664062 259.5 281.664062 C 259.5 281.664062 260.972656 274.414062 263.378906 270.734375 C 263.660156 270.308594 264.753906 271.007812 264.902344 271.539062 C 265.050781 272.078125 262.789062 276.355469 261.644531 282.363281 C 260.84375 286.578125 259.71875 292.542969 260.757812 293.914062 C 262.457031 296.148438 268.726562 290.355469 270.726562 287.429688 C 272.730469 284.503906 272.425781 284.816406 273.238281 285.171875 C 274.054688 285.527344 272.628906 288.417969 271.742188 290.910156 C 270.859375 293.402344 267.570312 301.175781 273.085938 301.464844 C 273.085938 301.464844 277.621094 299.007812 280.398438 298.695312 C 284.929688 298.1875 289.46875 299.429688 290.253906 301.589844 C 291.039062 303.75 289.503906 304.816406 281.886719 308.4375 C 281.886719 308.4375 280.25 309.144531 280.332031 311.113281 C 280.414062 313.082031 282.308594 315.710938 283.929688 316.617188 C 285.542969 317.527344 297.65625 322.691406 297.96875 324.085938 C 298.28125 325.476562 298.375 326.289062 291.636719 327.875 C 291.636719 327.875 300.167969 330.132812 299.625 333.015625 C 299.238281 335.089844 292.777344 335.402344 292.777344 335.402344 C 292.777344 335.402344 299.824219 338.738281 299.496094 340.886719 C 299.171875 343.03125 292.714844 342.804688 289.851562 343.074219 C 286.992188 343.339844 284.09375 343.925781 286.480469 347.65625 C 286.480469 347.65625 295.675781 359.488281 290.820312 362.832031 C 288.082031 364.71875 284.46875 359.472656 284.46875 359.472656 C 284.46875 359.472656 280.710938 356.554688 279.902344 356.777344 C 279.097656 357 278.789062 364.792969 280.191406 368.007812 C 280.191406 368.007812 286.566406 376.550781 287.683594 379.492188 C 289.261719 383.6875 287.351562 384.339844 284.101562 381.671875 C 281.339844 379.410156 279.484375 371.066406 278.691406 368.71875 C 278.488281 368.117188 276.09375 366.386719 275.445312 366.5625 C 274.800781 366.738281 274.628906 375.011719 272.886719 375.660156 C 271.152344 376.300781 267.113281 371.066406 265.816406 371.421875 C 264.519531 371.777344 262.6875 375.875 261.976562 377.101562 C 261.269531 378.320312 258.273438 386.765625 249.0625 386.324219 C 249.0625 386.324219 247.753906 388.695312 247.582031 392.511719 C 247.40625 396.328125 247.457031 396.828125 247.082031 397.359375 C 246.703125 397.894531 245.390625 398.507812 245.136719 397.890625 C 244.882812 397.277344 245.152344 392.378906 246.160156 389.21875 C 247.890625 383.78125 246.921875 380.46875 245.070312 379.023438 C 244.378906 378.480469 241.34375 379.703125 238.480469 381.425781 C 235.664062 383.121094 233.023438 385.304688 231.019531 386.335938 C 226.902344 388.445312 226.542969 386.1875 226.542969 386.1875 C 226.542969 386.1875 225.714844 386.800781 225 386.265625 C 224.246094 385.699219 227 382.121094 228.394531 379.597656 C 229.792969 377.074219 230.539062 374.386719 229.714844 373.925781 C 228.890625 373.46875 221.722656 378.085938 218.664062 382.175781 C 217.855469 382.84375 216.269531 381.902344 216.761719 381.167969 C 217.257812 380.429688 221.695312 374.300781 220.804688 372.511719 C 220.226562 371.339844 212.140625 378.898438 210.550781 379.855469 C 209.503906 380.480469 209.25 380.503906 208.550781 378.261719 C 207.804688 375.886719 204.78125 373.378906 202.238281 373.304688 C 201.867188 373.238281 201.632812 372.21875 201.867188 371.945312 C 202.386719 371.351562 208.691406 367.339844 210.242188 365.375 C 211.792969 363.40625 211.832031 360.03125 207.554688 361.265625 C 201.59375 362.988281 201.207031 363.808594 200.757812 363.125 C 200.3125 362.4375 200.386719 362.402344 201.898438 361.574219 C 203.414062 360.742188 212.007812 357.199219 213.199219 361.875 C 214.394531 366.550781 204.550781 371.898438 204.550781 371.898438 C 204.550781 371.898438 208.957031 372.75 210.765625 377.140625 C 210.765625 377.140625 217.199219 372.039062 219.25 370.964844 C 221.308594 369.890625 223.132812 369.558594 222.816406 372.558594 C 222.507812 375.554688 221.851562 376.335938 221.851562 376.335938 C 221.851562 376.335938 225.933594 372.820312 229.03125 372.054688 C 232.128906 371.296875 232.425781 374.300781 231.664062 376.90625 C 231.664062 376.90625 235.828125 374.652344 237.453125 375.835938 C 239.082031 377.015625 238.433594 379.425781 238.433594 379.425781 C 238.433594 379.425781 243.636719 376.800781 245.226562 377.226562 C 246.820312 377.644531 248.707031 382.011719 248.707031 382.011719 C 248.707031 382.011719 250.738281 377.347656 253.285156 375.535156 C 255.835938 373.726562 260.152344 372.972656 261.0625 375.035156 C 261.0625 375.035156 263.160156 371.472656 263.691406 370.554688 C 264.226562 369.636719 265.78125 369.070312 267.101562 369.761719 C 268.425781 370.453125 272.074219 373.308594 272.074219 373.308594 C 272.074219 373.308594 272.898438 370.597656 273.128906 368.566406 C 273.355469 366.535156 273.238281 362.796875 276.445312 364.492188 C 277.5 365.144531 278.089844 365.410156 278.089844 365.410156 C 278.089844 365.410156 277.972656 364.234375 277.796875 362.582031 C 277.402344 358.917969 277.730469 357.511719 278.015625 356.320312 C 278.296875 355.128906 279.628906 354.328125 280.949219 354.867188 C 282.046875 355.3125 283.878906 356.035156 283.878906 356.035156 C 283.878906 356.035156 281.234375 350.976562 281.613281 348.558594 C 281.996094 346.144531 284.4375 347.273438 284.4375 347.273438 C 284.4375 347.273438 283.203125 344.183594 284.648438 342.632812 C 285.722656 341.480469 290.296875 341.34375 292.855469 341.160156 C 295.410156 340.976562 297.414062 340.34375 297.414062 340.34375 C 297.414062 340.34375 294.335938 337.671875 291.226562 336.808594 C 288.125 335.941406 286.355469 336 285.925781 335.859375 C 285.496094 335.71875 285.253906 334.671875 285.609375 334.234375 C 285.96875 333.789062 287.40625 333.652344 289.527344 333.761719 C 291.640625 333.867188 297.164062 333.386719 297.429688 332.457031 C 297.699219 331.527344 289.929688 328.554688 286.023438 328.726562 C 285.109375 328.769531 284.730469 327.34375 285.234375 327.140625 C 286.792969 326.511719 296.117188 325.105469 295.898438 324.308594 C 295.679688 323.511719 287.660156 320.90625 283.140625 318.371094 C 278.625 315.839844 277.332031 309.523438 279.09375 308.011719 C 279.09375 308.011719 274.347656 306.863281 273.496094 305.359375 C 272.652344 303.855469 272.636719 302.847656 272.636719 302.847656 C 272.636719 302.847656 270.410156 303.152344 269.160156 301.898438 C 267.417969 300.148438 267.578125 295.476562 269.40625 291.976562 C 269.40625 291.976562 264.015625 297.390625 260.871094 296.710938 C 257.730469 296.03125 258.1875 290.078125 258.1875 290.078125 C 258.1875 290.078125 254.09375 295.40625 251.628906 295.984375 C 248.320312 296.757812 246.671875 292.796875 249.6875 287.605469 C 249.6875 287.605469 244.464844 292.675781 242.238281 293.453125 C 240.285156 294.140625 238.144531 294.230469 236.328125 288.6875 C 234.699219 283.738281 234.324219 280.882812 232.789062 281.777344 C 231.441406 282.554688 230.808594 288.226562 230.644531 292.382812 C 230.472656 296.542969 230.550781 297.132812 229.785156 297.511719 C 229.019531 297.890625 228.535156 298.359375 228.273438 297.402344 C 228.011719 296.445312 224.914062 287.351562 223.929688 286.9375 C 222.949219 286.523438 222.3125 288.324219 221.886719 290.578125 C 221.460938 292.839844 219.773438 302.890625 216.753906 304.574219 C 213.738281 306.257812 210.363281 303.773438 210.363281 303.773438 "/>
<path style=" stroke:none;fill-rule:nonzero;fill:rgb(13.729858%,12.159729%,12.548828%);fill-opacity:1;" d="M 278.339844 278.199219 C 277.964844 277.664062 276.941406 277.5 276.523438 277.839844 C 276.101562 278.179688 276.460938 279.21875 276.996094 279.574219 C 277.53125 279.9375 279.273438 279.558594 278.339844 278.199219 "/>
<path style=" stroke:none;fill-rule:nonzero;fill:rgb(13.729858%,12.159729%,12.548828%);fill-opacity:1;" d="M 197.425781 287.320312 C 198.023438 286.710938 202.492188 288.347656 201.542969 289.976562 C 200.601562 291.605469 196.136719 288.648438 197.425781 287.320312 "/>
<path style=" stroke:none;fill-rule:nonzero;fill:rgb(13.729858%,12.159729%,12.548828%);fill-opacity:1;" d="M 196.949219 376.617188 C 198.195312 375.777344 201.238281 379.433594 199.742188 379.84375 C 198.242188 380.253906 197.613281 379.039062 197.226562 378.363281 C 196.839844 377.683594 196.402344 376.984375 196.949219 376.617188 "/>
<g clip-path="url(#clip2)" clip-rule="nonzero">
<path style="fill:none;stroke-width:24.454;stroke-linecap:butt;stroke-linejoin:miter;stroke:rgb(100%,100%,100%);stroke-opacity:1;stroke-miterlimit:10;" d="M 1414.492188 4392.03125 L 886.289062 4392.03125 M 3468.632812 4392.03125 L 3996.835938 4392.03125 M 1414.492188 2318.320312 L 886.289062 2318.320312 M 3468.632812 2318.320312 L 3996.835938 2318.320312 M 1531.875 4509.414062 L 1531.875 5037.617188 M 1531.875 2200.9375 L 1531.875 1672.734375 M 3351.25 4509.414062 L 3351.25 5037.617188 M 3351.25 2200.9375 L 3351.25 1672.734375 " transform="matrix(0.1,0,0,-0.1,0,675)"/>
<path style="fill:none;stroke-width:4.8908;stroke-linecap:butt;stroke-linejoin:miter;stroke:rgb(13.729858%,12.159729%,12.548828%);stroke-opacity:1;stroke-miterlimit:10;" d="M 1414.492188 4392.03125 L 886.289062 4392.03125 M 3468.632812 4392.03125 L 3996.835938 4392.03125 M 1414.492188 2318.320312 L 886.289062 2318.320312 M 3468.632812 2318.320312 L 3996.835938 2318.320312 M 1531.875 4509.414062 L 1531.875 5037.617188 M 1531.875 2200.9375 L 1531.875 1672.734375 M 3351.25 4509.414062 L 3351.25 5037.617188 M 3351.25 2200.9375 L 3351.25 1672.734375 " transform="matrix(0.1,0,0,-0.1,0,675)"/>
</g>
</g>
</svg>
