{
  "fontname": "timesir",
  "height": 40,
  "data-date": "la date",
  "chars": [
    {
      "dec": "80",
      "width": "22",
      "d": "M9,1 L3,22 M10,1 L4,22 M6,1 L18,1 21,2 22,4 22,6 21,9 19,11 15,12 7,12 M18,1 L20,2 21,4 21,6 20,9 18,11 15,12 M0,22 L7,22"
    },
    {
      "dec": "90",
      "width": "22",
      "d": "M20,1 L1,22 M21,1 L2,22 M8,1 L5,7 7,1 21,1 M1,22 L15,22 17,16 14,22"
    },
    {
      "dec": "120",
      "width": "20",
      "d": "M3,12 L5,9 7,8 10,8 11,10 11,13 M9,8 L10,10 10,13 9,17 8,19 6,21 4,22 3,22 2,21 2,20 3,19 4,20 3,21 M9,17 L9,20 10,22 13,22 15,21 17,18 M17,9 L16,10 17,11 18,10 18,9 17,8 16,8 14,9 12,11 11,13 10,17 10,20 11,22"
    },
    {
      "dec": "109",
      "width": "32",
      "d": "M1,12 L2,10 4,8 7,8 8,9 8,11 7,15 5,22 M6,8 L7,9 7,11 6,15 4,22 M7,15 L9,11 11,9 13,8 15,8 17,9 18,10 18,12 15,22 M15,8 L17,10 17,12 14,22 M17,15 L19,11 21,9 23,8 25,8 27,9 28,10 28,12 26,18 26,21 27,22 M25,8 L27,10 27,12 25,18 25,21 26,22 29,22 31,20 32,18"
    },
    {
      "dec": "60",
      "width": "24",
      "d": "M 21,4 4,13 19,22"
    },
    {
      "dec": "8211",
      "width": "14",
      "d": "M 2,14 H 12"
    },
    {
      "dec": "36",
      "width": "22",
      "d": "M12,-3 L4,26 M17,-3 L9,26 M18,5 L17,6 18,7 19,6 19,5 18,3 17,2 14,1 10,1 7,2 5,4 5,6 6,8 7,9 14,13 16,15 M5,6 L7,8 14,12 15,13 16,15 16,18 15,20 14,21 11,22 7,22 4,21 3,20 2,18 2,17 3,16 4,17 3,18"
    },
    {
      "dec": "94",
      "width": "22",
      "d": "M3,15 L11,10 19,15 M3,15 L11,11 19,15"
    },
    {
      "dec": "101",
      "width": "18",
      "d": "M4,17 L8,16 11,15 14,13 15,11 14,9 12,8 9,8 6,9 4,12 3,15 3,18 4,20 5,21 7,22 9,22 12,21 14,19 M9,8 L7,9 5,12 4,15 4,19 5,21"
    },
    {
      "dec": "8216",
      "width": "7",
      "d": "M 3,7 4,6 5,7 4,8 3,7 V 5 L 5,3"
    },
    {
      "dec": "114",
      "width": "16",
      "d": "M1,12 L2,10 4,8 7,8 8,9 8,11 7,15 5,22 M6,8 L7,9 7,11 6,15 4,22 M7,15 L9,11 11,9 13,8 15,8 16,9 16,10 15,11 14,10 15,9"
    },
    {
      "dec": "47",
      "width": "22",
      "d": "M20,-3 L2,29"
    },
    {
      "dec": "8221",
      "width": "14",
      "d": "M 11,4 10,5 9,4 10,3 11,4 V 6 L 9,8 M 5,4 4,5 3,4 4,3 5,4 V 6 L 3,8"
    },
    {
      "dec": "108",
      "width": "14",
      "d": "M8,1 L4,15 3,19 3,21 4,22 7,22 9,20 10,18 M9,1 L5,15 4,19 4,21 5,22 M5,1 L9,1"
    },
    {
      "dec": "126",
      "width": "24",
      "d": "M3,16 L3,14 4,11 6,10 8,10 10,11 14,14 16,15 18,15 20,14 21,12 M3,14 L4,12 6,11 8,11 10,12 14,15 16,16 18,16 20,15 21,12 21,10"
    },
    {
      "dec": "339",
      "width": "29",
      "d": "m 15,17 4,-1 3,-1 3,-2 1,-2 -1,-2 -2,-1 h -3 l -3,1 -2,3 -1,3 v 3 l 1,2 1,1 2,1 h 2 l 3,-1 2,-2 m -5,-11 -2,1 -2,3 -1,3 v 4 l 1,2 M 9,8.0000004 l -3,1 L 4,12 3,15 v 3 l 1,2 1,1 2,1 h 2 l 3,-1 2,-3 1,-3 v -3 l -1,-2 -1,-0.9999996 -2,-1 H 9 m 0,0 -2,1 L 5,12 4,15 v 4 l 1,2 m 4,1 2,-1 2,-3 1,-3 V 11 L 13,9.0000004"
    },
    {
      "dec": "184",
      "width": "5",
      "d": "M 2,26 H 3 L 4,25 3,24 H 2 l 2,-2"
    },
    {
      "dec": "68",
      "width": "22",
      "d": "M9,1 L3,22 M10,1 L4,22 M6,1 L15,1 18,2 19,3 20,6 20,10 19,14 17,18 15,20 13,21 9,22 0,22 M15,1 L17,2 18,3 19,6 19,10 18,14 16,18 14,20 12,21 9,22"
    },
    {
      "dec": "121",
      "width": "20",
      "d": "M1,12 L2,10 4,8 7,8 8,9 8,12 6,18 6,20 8,22 M6,8 L7,9 7,12 5,18 5,20 6,21 8,22 10,22 12,21 14,19 16,15 M19,8 L15,22 14,25 12,28 9,29 6,29 4,28 3,27 3,26 4,25 5,26 4,27 M18,8 L14,22 13,25 11,28 9,29"
    },
    {
      "dec": "8217",
      "width": "7",
      "d": "M 5,4 4,5 3,4 4,3 5,4 V 6 L 3,8"
    },
    {
      "dec": "70",
      "width": "20",
      "d": "M9,1 L3,22 M10,1 L4,22 M14,7 L12,15 M6,1 L21,1 20,7 20,1 M7,11 L13,11 M0,22 L7,22"
    },
    {
      "dec": "59",
      "width": "12",
      "d": "M6,8 L5,9 6,10 7,9 6,8 M3,22 L2,21 3,20 4,21 4,22 3,24 1,26"
    },
    {
      "dec": "83",
      "width": "24",
      "d": "M19,3 L20,3 21,1 20,7 20,5 19,3 18,2 15,1 11,1 8,2 6,4 6,6 7,8 8,9 15,13 17,15 M6,6 L8,8 15,12 16,13 17,15 17,18 16,20 15,21 12,22 8,22 5,21 4,20 3,18 3,16 2,22 3,20 4,20"
    },
    {
      "dec": "55",
      "width": "22",
      "d": "M6,1 L4,7 M19,1 L18,4 16,7 11,13 9,16 8,18 7,22 M16,7 L10,13 8,16 7,18 6,22 M5,4 L8,1 10,1 15,4 M6,3 L8,2 10,2 15,4 17,4 18,3 19,1"
    },
    {
      "dec": "8230",
      "width": "14",
      "d": "m 11,17 -1,1 1,1 1,-1 -1,-1 m -4,0 -1,1 1,1 1,-1 -1,-1 m -4,0 -1,1 1,1 1,-1 -1,-1"
    },
    {
      "dec": "112",
      "width": "20",
      "d": "M1,12 L2,10 4,8 7,8 8,9 8,11 7,15 3,29 M6,8 L7,9 7,11 6,15 2,29 M7,15 L8,12 10,9 12,8 14,8 16,9 17,10 18,12 18,15 17,18 15,21 12,22 10,22 8,21 7,18 7,15 M16,9 L17,11 17,15 16,18 14,21 12,22 M-1,29 L6,29"
    },
    {
      "dec": "41",
      "width": "14",
      "d": "M9,-3 L10,-1 11,2 12,7 12,11 11,16 9,20 7,23 4,26 0,29 M9,-3 L10,0 11,5 11,10 10,15 9,18 7,22 4,26"
    },
    {
      "dec": "74",
      "width": "18",
      "d": "M15,1 L10,18 9,20 8,21 6,22 4,22 2,21 1,19 1,17 2,16 3,17 2,18 M14,1 L9,18 8,20 6,22 M11,1 L18,1"
    },
    {
      "dec": "116",
      "width": "14",
      "d": "M9,1 L5,15 4,19 4,21 5,22 8,22 10,20 11,18 M10,1 L6,15 5,19 5,21 6,22 M3,8 L12,8"
    },
    {
      "dec": "180",
      "width": "12",
      "d": "M 8,1 3,7 M 8,1 9,2 3,7"
    },
    {
      "dec": "38",
      "width": "26",
      "d": "M21,9 L20,10 21,11 22,10 22,9 21,8 20,8 19,9 18,11 16,16 14,19 12,21 10,22 7,22 4,21 3,19 3,16 4,14 10,10 12,8 13,6 13,4 12,2 10,1 8,2 7,4 7,6 8,9 10,12 15,19 17,21 20,22 21,22 22,21 22,20 M7,22 L5,21 4,19 4,16 5,14 7,12 M7,6 L8,8 16,19 18,21 20,22"
    },
    {
      "dec": "171",
      "width": "12",
      "d": "M 6,20 1,14 7,8 M 6,20 2,14 7,8 M 10,20 5,14 11,8 M 10,20 6,14 11,8"
    },
    {
      "dec": "106",
      "width": "14",
      "d": "M10,1 L9,2 10,3 11,2 10,1 M2,12 L3,10 5,8 8,8 9,9 9,12 6,22 5,25 4,27 3,28 1,29 -1,29 -2,28 -2,27 -1,26 0,27 -1,28 M7,8 L8,9 8,12 5,22 4,25 3,27 1,29"
    },
    {
      "dec": "630",
      "width": "30",
      "d": "M 19,1.0000002 13,22 M 20,1.0000002 14,22 M 24,7.0000002 22,15 M 13,1.0000002 h 18 l -1,6 v -6 M 17,11 h 6 M 8,22 h 17 l 2,-5 -3,5 M 11,1.0000001 l -3,1 -2,2 -2,3 L 3,10 2,14 v 3 l 1,3 1,1 2,1 H 9 M 14,1.0000001 h -3 m 0,0 -2,1 -2,2 -2,3 L 4,10 3,14 v 3 l 1,3 2,2"
    },
    {
      "dec": "104",
      "width": "22",
      "d": "M8,1 L2,22 M9,1 L3,22 M5,15 L7,11 9,9 11,8 13,8 15,9 16,10 16,12 14,18 14,21 15,22 M13,8 L15,10 15,12 13,18 13,21 14,22 17,22 19,20 20,18 M5,1 L9,1"
    },
    {
      "dec": "63",
      "width": "22",
      "d": "M7,5 L8,6 7,7 6,6 6,5 7,3 8,2 11,1 15,1 18,2 19,4 19,6 18,8 17,9 11,11 9,12 9,14 10,15 12,15 M15,1 L17,2 18,4 18,6 17,8 16,9 14,10 M8,20 L7,21 8,22 9,21 8,20"
    },
    {
      "dec": "37",
      "width": "24",
      "d": "M21,1 L3,22 M8,1 L10,3 10,5 9,7 7,8 5,8 3,6 3,4 4,2 6,1 8,1 10,2 13,3 16,3 19,2 21,1 M17,15 L15,16 14,18 14,20 16,22 18,22 20,21 21,19 21,17 19,15 17,15"
    },
    {
      "dec": "91",
      "width": "14",
      "d": "M4,-3 L4,29 M5,-3 L5,29 M4,-3 L11,-3 M4,29 L11,29"
    },
    {
      "dec": "110",
      "width": "22",
      "d": "M1,12 L2,10 4,8 7,8 8,9 8,11 7,15 5,22 M6,8 L7,9 7,11 6,15 4,22 M7,15 L9,11 11,9 13,8 15,8 17,9 18,10 18,12 16,18 16,21 17,22 M15,8 L17,10 17,12 15,18 15,21 16,22 19,22 21,20 22,18"
    },
    {
      "dec": "64",
      "width": "28",
      "d": "M18,9 L17,7 15,6 12,6 10,7 9,8 8,11 8,14 9,16 11,17 14,17 16,16 17,14 M12,6 L10,8 9,11 9,14 10,16 11,17 M18,6 L17,14 17,16 19,17 21,17 23,15 24,12 24,10 23,7 22,5 20,3 18,2 15,1 12,1 9,2 7,3 5,5 4,7 3,10 3,13 4,16 5,18 7,20 9,21 12,22 15,22 18,21 20,20 21,19 M19,6 L18,14 18,16 19,17"
    },
    {
      "dec": "85",
      "width": "26",
      "d": "M8,1 L5,12 4,16 4,19 5,21 8,22 12,22 15,21 17,19 18,16 22,1 M9,1 L6,12 5,16 5,19 6,21 8,22 M5,1 L12,1 M19,1 L25,1"
    },
    {
      "dec": "57",
      "width": "22",
      "d": "M17,8 L16,10 14,12 12,13 9,13 7,12 6,11 5,9 5,6 6,4 8,2 11,1 14,1 16,2 17,3 18,5 18,9 17,13 16,16 14,19 12,21 9,22 6,22 4,21 3,19 3,18 4,17 5,18 4,19 M7,12 L6,10 6,6 7,4 9,2 11,1 M16,2 L17,4 17,9 16,13 15,16 13,19 11,21 9,22"
    },
    {
      "dec": "48",
      "width": "22",
      "d": "M12,1 L9,2 7,4 5,7 4,10 3,14 3,17 4,20 5,21 7,22 9,22 12,21 14,19 16,16 17,13 18,9 18,6 17,3 16,2 14,1 12,1 M12,1 L10,2 8,4 6,7 5,10 4,14 4,17 5,20 7,22 M9,22 L11,21 13,19 15,16 16,13 17,9 17,6 16,3 14,1"
    },
    {
      "dec": "35",
      "width": "22",
      "d": "M11,-3 L4,29 M17,-3 L10,29 M4,10 L18,10 M3,16 L17,16"
    },
    {
      "dec": "169",
      "width": "23",
      "d": "M 7,3 5,4 3,6 2,8 1,12 v 3 l 1,4 1,2 3,3 4,1 h 3 l 4,-1 3,-3 1,-2 1,-4 V 12 L 21,8 20,6 18,4 16,3 13,2 H 10 L 7,3 M 18,10 17,8 15,6 13,5 H 10 L 8,6 6,8 5,11 v 5 l 1,3 2,2 2,1 h 3 l 2,-1 2,-2 1,-2"
    },
    {
      "dec": "113",
      "width": "20",
      "d": "M16,8 L10,29 M17,8 L11,29 M14,15 L14,12 13,9 11,8 9,8 6,9 4,12 3,15 3,18 4,20 5,21 7,22 9,22 11,21 13,18 14,15 M9,8 L7,9 5,12 4,15 4,19 5,21 M7,29 L14,29"
    },
    {
      "dec": "95",
      "width": "20",
      "d": "M0,29 L20,29"
    },
    {
      "dec": "54",
      "width": "22",
      "d": "M17,4 L16,5 17,6 18,5 18,4 17,2 15,1 12,1 9,2 7,4 5,7 4,10 3,14 3,18 4,20 5,21 7,22 10,22 13,21 15,19 16,17 16,14 15,12 14,11 12,10 9,10 7,11 5,13 4,15 M12,1 L10,2 8,4 6,7 5,10 4,14 4,19 5,21 M10,22 L12,21 14,19 15,17 15,13 14,11"
    },
    {
      "dec": "58",
      "width": "12",
      "d": "M6,8 L5,9 6,10 7,9 6,8 M3,20 L2,21 3,22 4,21"
    },
    {
      "dec": "187",
      "width": "12",
      "d": "M 4,20 11,14 6,8 M 4,20 10,14 6,8 M 0,20 7,14 2,8 M 0,20 6,14 2,8"
    },
    {
      "dec": "111",
      "width": "18",
      "d": "M9,8 L6,9 4,12 3,15 3,18 4,20 5,21 7,22 9,22 12,21 14,18 15,15 15,12 14,10 13,9 11,8 9,8 M9,8 L7,9 5,12 4,15 4,19 5,21 M9,22 L11,21 13,18 14,15 14,11 13,9"
    },
    {
      "dec": "97",
      "width": "22",
      "d": "M16,8 L14,15 13,19 13,21 14,22 17,22 19,20 20,18 M17,8 L15,15 14,19 14,21 15,22 M14,15 L14,12 13,9 11,8 9,8 6,9 4,12 3,15 3,18 4,20 5,21 7,22 9,22 11,21 13,18 14,15 M9,8 L7,9 5,12 4,15 4,19 5,21"
    },
    {
      "dec": "122",
      "width": "20",
      "d": "M17,8 L16,10 14,12 6,18 4,20 3,22 M4,12 L5,10 7,8 10,8 14,10 M5,10 L7,9 10,9 14,10 16,10 M4,20 L6,20 10,21 13,21 15,20 M6,20 L10,22 13,22 15,20 16,18"
    },
    {
      "dec": "105",
      "width": "14",
      "d": "M9,1 L8,2 9,3 10,2 9,1 M1,12 L2,10 4,8 7,8 8,9 8,12 6,18 6,21 7,22 M6,8 L7,9 7,12 5,18 5,21 6,22 9,22 11,20 12,18"
    },
    {
      "dec": "88",
      "width": "22",
      "d": "M7,1 L14,22 M8,1 L15,22 M21,1 L1,22 M5,1 L11,1 M17,1 L23,1 M-1,22 L5,22 M11,22 L17,22"
    },
    {
      "dec": "107",
      "width": "20",
      "d": "M8,1 L2,22 M9,1 L3,22 M16,9 L15,10 16,11 17,10 17,9 16,8 15,8 13,9 9,13 7,14 5,14 M7,14 L9,15 11,21 12,22 M7,14 L8,15 10,21 11,22 13,22 15,21 17,18 M5,1 L9,1"
    },
    {
      "dec": "89",
      "width": "22",
      "d": "M6,1 L10,11 7,22 M7,1 L11,11 8,22 M21,1 L11,11 M4,1 L10,1 M17,1 L23,1 M4,22 L11,22"
    },
    {
      "dec": "75",
      "width": "22",
      "d": "M9,1 L3,22 M10,1 L4,22 M23,1 L6,14 M13,10 L17,22 M12,10 L16,22 M6,1 L13,1 M19,1 L25,1 M0,22 L7,22 M13,22 L19,22"
    },
    {
      "dec": "127",
      "width": "16",
      "d": "M0,1 L0,22 1,22 1,1 2,1 2,22 3,22 3,1 4,1 4,22 5,22 5,1 6,1 6,22 7,22 7,1 8,1 8,22 9,22 9,1 10,1 10,22 11,22 11,1 12,1 12,22 13,22 13,1 14,1 14,22 15,22 15,1 16,1 16,22"
    },
    {
      "dec": "76",
      "width": "20",
      "d": "M9,1 L3,22 M10,1 L4,22 M6,1 L13,1 M0,22 L15,22 17,16 14,22"
    },
    {
      "dec": "46",
      "width": "12",
      "d": "M3,20 L2,21 3,22 4,21 3,20"
    },
    {
      "dec": "84",
      "width": "22",
      "d": "M13,1 L7,22 M14,1 L8,22 M7,1 L4,7 6,1 21,1 20,7 20,1 M4,22 L11,22"
    },
    {
      "dec": "45",
      "width": "9",
      "d": "M 1,14 H 8"
    },
    {
      "dec": "72",
      "width": "26",
      "d": "M9,1 L3,22 M10,1 L4,22 M22,1 L16,22 M23,1 L17,22 M6,1 L13,1 M19,1 L26,1 M7,11 L19,11 M0,22 L7,22 M13,22 L20,22"
    },
    {
      "dec": "82",
      "width": "24",
      "d": "M9,1 L3,22 M10,1 L4,22 M6,1 L17,1 20,2 21,4 21,6 20,9 19,10 16,11 7,11 M17,1 L19,2 20,4 20,6 19,9 18,10 16,11 M12,11 L14,12 15,13 16,21 17,22 19,22 20,20 20,19 M15,13 L17,20 18,21 19,21 20,20 M0,22 L7,22"
    },
    {
      "dec": "79",
      "width": "22",
      "d": "M12,1 L9,2 7,4 5,7 4,10 3,14 3,17 4,20 5,21 7,22 10,22 13,21 15,19 17,16 18,13 19,9 19,6 18,3 17,2 15,1 12,1 M12,1 L10,2 8,4 6,7 5,10 4,14 4,17 5,20 7,22 M10,22 L12,21 14,19 16,16 17,13 18,9 18,6 17,3 15,1"
    },
    {
      "dec": "96",
      "width": "12",
      "d": "M4,1 L9,7 M4,1 L3,2 9,7"
    },
    {
      "dec": "50",
      "width": "22",
      "d": "M7,5 L8,6 7,7 6,6 6,5 7,3 8,2 11,1 14,1 17,2 18,4 18,6 17,8 15,10 12,12 8,14 5,16 3,18 1,22 M14,1 L16,2 17,4 17,6 16,8 14,10 8,14 M2,20 L3,19 5,19 10,21 13,21 15,20 16,18 M5,19 L10,22 13,22 15,21 16,18"
    },
    {
      "dec": "8212",
      "width": "20",
      "d": "M 0,14 H 20"
    },
    {
      "dec": "65",
      "width": "20",
      "d": "M13,1 L0,22 M13,1 L14,22 M12,3 L13,22 M4,16 L13,16 M-2,22 L4,22 M10,22 L16,22"
    },
    {
      "dec": "33",
      "width": "12",
      "d": "M8,1 L7,2 5,14 M8,2 L5,14 M8,1 L9,2 5,14 M3,20 L2,21 3,22 4,21 3,20"
    },
    {
      "dec": "61",
      "width": "26",
      "d": "M4,10 L22,10 M4,16 L22,16"
    },
    {
      "dec": "98",
      "width": "18",
      "d": "M8,1 L4,14 4,17 5,20 6,21 M9,1 L5,14 M5,14 L6,11 8,9 10,8 12,8 14,9 15,10 16,12 16,15 15,18 13,21 10,22 8,22 6,21 5,18 5,14 M14,9 L15,11 15,15 14,18 12,21 10,22 M5,1 L9,1"
    },
    {
      "dec": "56",
      "width": "22",
      "d": "M11,1 L8,2 7,3 6,5 6,8 7,10 9,11 12,11 16,10 17,9 18,7 18,4 17,2 14,1 11,1 M11,1 L9,2 8,3 7,5 7,8 8,10 9,11 M12,11 L15,10 16,9 17,7 17,4 16,2 14,1 M9,11 L5,12 3,14 2,16 2,19 3,21 6,22 10,22 14,21 15,20 16,18 16,15 15,13 14,12 12,11 M9,11 L6,12 4,14 3,16 3,19 4,21 6,22 M10,22 L13,21 14,20 15,18 15,14 14,12"
    },
    {
      "dec": "43",
      "width": "26",
      "d": "M13,4 L13,22 M4,13 L22,13"
    },
    {
      "dec": "51",
      "width": "22",
      "d": "M7,5 L8,6 7,7 6,6 6,5 7,3 8,2 11,1 14,1 17,2 18,4 18,6 17,8 14,10 11,11 M14,1 L16,2 17,4 17,6 16,8 14,10 M9,11 L11,11 14,12 15,13 16,15 16,18 15,20 14,21 11,22 7,22 4,21 3,20 2,18 2,17 3,16 4,17 3,18 M11,11 L13,12 14,13 15,15 15,18 14,20 13,21 11,22"
    },
    {
      "dec": "119",
      "width": "28",
      "d": "M1,12 L2,10 4,8 7,8 8,9 8,12 6,18 6,20 8,22 M6,8 L7,9 7,12 5,18 5,20 6,21 8,22 10,22 12,21 14,19 15,17 M17,8 L15,17 15,20 16,21 18,22 20,22 22,21 24,19 25,17 26,13 26,8 25,8 26,10 M18,8 L16,17 16,20 18,22"
    },
    {
      "dec": "53",
      "width": "22",
      "d": "M9,1 L4,11 M9,1 L19,1 M9,2 L14,2 19,1 M4,11 L5,10 8,9 11,9 14,10 15,11 16,13 16,16 15,19 13,21 10,22 7,22 4,21 3,20 2,18 2,17 3,16 4,17 3,18 M11,9 L13,10 14,11 15,13 15,16 14,19 12,21 10,22"
    },
    {
      "dec": "49",
      "width": "22",
      "d": "M12,5 L7,22 M14,1 L8,22 M14,1 L11,4 8,6 6,7 M13,4 L9,6 6,7"
    },
    {
      "dec": "115",
      "width": "18",
      "d": "M14,10 L14,11 15,11 15,10 14,9 11,8 8,8 5,9 4,10 4,12 5,13 12,17 13,18 M4,11 L5,12 12,16 13,17 13,20 12,21 9,22 6,22 3,21 2,20 2,19 3,19 3,20"
    },
    {
      "dec": "86",
      "width": "20",
      "d": "M6,1 L7,22 M7,1 L8,20 M20,1 L7,22 M4,1 L10,1 M16,1 L22,1"
    },
    {
      "dec": "73",
      "width": "14",
      "d": "M9,1 L3,22 M10,1 L4,22 M6,1 L13,1 M0,22 L7,22"
    },
    {
      "dec": "92",
      "width": "14",
      "d": "M0,1 L14,25"
    },
    {
      "dec": "69",
      "width": "22",
      "d": "M9,1 L3,22 M10,1 L4,22 M14,7 L12,15 M6,1 L21,1 20,7 20,1 M7,11 L13,11 M0,22 L15,22 17,17 14,22"
    },
    {
      "dec": "40",
      "width": "16",
      "d": "M15,-3 L11,0 8,3 6,6 4,10 3,15 3,19 4,24 5,27 6,29 M11,0 L8,4 6,8 5,11 4,16 4,21 5,26 6,29"
    },
    {
      "dec": "103",
      "width": "20",
      "d": "M17,8 L13,22 12,25 10,28 7,29 4,29 2,28 1,27 1,26 2,25 3,26 2,27 M16,8 L12,22 11,25 9,28 7,29 M14,15 L14,12 13,9 11,8 9,8 6,9 4,12 3,15 3,18 4,20 5,21 7,22 9,22 11,21 13,18 14,15 M9,8 L7,9 5,12 4,15 4,19 5,21"
    },
    {
      "dec": "52",
      "width": "22",
      "d": "M16,2 L10,22 M17,1 L11,22 M17,1 L2,16 18,16"
    },
    {
      "dec": "118",
      "width": "20",
      "d": "M1,12 L2,10 4,8 7,8 8,9 8,12 6,18 6,20 8,22 M6,8 L7,9 7,12 5,18 5,20 6,21 8,22 9,22 12,21 14,19 16,16 17,12 17,8 16,8 17,10"
    },
    {
      "dec": "78",
      "width": "26",
      "d": "M9,1 L3,22 M9,1 L16,19 M9,4 L16,22 M22,1 L16,22 M6,1 L9,1 M19,1 L25,1 M0,22 L6,22"
    },
    {
      "dec": "123",
      "width": "14",
      "d": "M9,-3 L7,-2 6,-1 5,1 5,3 6,5 7,6 8,8 8,10 6,12 M7,-2 L6,0 6,2 7,4 8,5 9,7 9,9 8,11 4,13 8,15 9,17 9,19 8,21 7,22 6,24 6,26 7,28 M6,14 L8,16 8,18 7,20 6,21 5,23 5,25 6,27 7,28 9,29"
    },
    {
      "dec": "102",
      "width": "16",
      "d": "M15,2 L14,3 15,4 16,3 16,2 15,1 13,1 11,2 10,3 9,5 8,8 5,22 4,26 3,28 M13,1 L11,3 10,5 9,9 7,18 6,22 5,25 4,27 3,28 1,29 -1,29 -2,28 -2,27 -1,26 0,27 -1,28 M4,8 L14,8"
    },
    {
      "dec": "81",
      "width": "22",
      "d": "M12,1 L9,2 7,4 5,7 4,10 3,14 3,17 4,20 5,21 7,22 10,22 13,21 15,19 17,16 18,13 19,9 19,6 18,3 17,2 15,1 12,1 M12,1 L10,2 8,4 6,7 5,10 4,14 4,17 5,20 7,22 M10,22 L12,21 14,19 16,16 17,13 18,9 18,6 17,3 15,1 M5,20 L5,19 6,17 8,16 9,16 11,17 12,19 12,26 13,27 15,27 16,25 16,24 M12,19 L13,25 14,26 15,26 16,25"
    },
    {
      "dec": "87",
      "width": "26",
      "d": "M8,1 L6,22 M9,1 L7,20 M16,1 L6,22 M16,1 L14,22 M17,1 L15,20 M24,1 L14,22 M5,1 L12,1 M21,1 L27,1"
    },
    {
      "dec": "34",
      "width": "18",
      "d": "M7,1 L5,8 M8,1 L5,8 M16,1 L14,8 M17,1 L14,8"
    },
    {
      "dec": "66",
      "width": "24",
      "d": "M9,1 L3,22 M10,1 L4,22 M6,1 L17,1 20,2 21,4 21,6 20,9 19,10 16,11 M17,1 L19,2 20,4 20,6 19,9 18,10 16,11 M7,11 L16,11 18,12 19,14 19,16 18,19 16,21 12,22 0,22 M16,11 L17,12 18,14 18,16 17,19 15,21 12,22"
    },
    {
      "dec": "67",
      "width": "22",
      "d": "M18,3 L19,3 20,1 19,7 19,5 18,3 17,2 15,1 12,1 9,2 7,4 5,7 4,10 3,14 3,17 4,20 5,21 8,22 11,22 13,21 15,19 16,17 M12,1 L10,2 8,4 6,7 5,10 4,14 4,17 5,20 6,21 8,22"
    },
    {
      "dec": "62",
      "width": "24",
      "d": "M 5,4 20,13 3,22"
    },
    {
      "dec": "71",
      "width": "24",
      "d": "M18,3 L19,3 20,1 19,7 19,5 18,3 17,2 15,1 12,1 9,2 7,4 5,7 4,10 3,14 3,17 4,20 5,21 8,22 10,22 13,21 15,19 17,15 M12,1 L10,2 8,4 6,7 5,10 4,14 4,17 5,20 6,21 8,22 M10,22 L12,21 14,19 16,15 M13,15 L20,15"
    },
    {
      "dec": "42",
      "width": "16",
      "d": "M8,7 L8,19 M3,10 L13,16 M13,10 L3,16"
    },
    {
      "dec": "124",
      "width": "8",
      "d": "M4,-3 L4,29"
    },
    {
      "dec": "8208",
      "width": "26",
      "d": "M 4,14 H 22"
    },
    {
      "dec": "93",
      "width": "14",
      "d": "M9,-3 L9,29 M10,-3 L10,29 M3,-3 L10,-3 M3,29 L10,29"
    },
    {
      "dec": "168",
      "width": "15",
      "d": "M 4 3 L 3 4 L 4 5 L 5 4 L 4 3 z M 11 3 L 10 4 L 11 5 L 12 4 L 11 3 z "
    },
    {
      "dec": "77",
      "width": "28",
      "d": "M9,1 L3,22 M9,1 L10,22 M10,1 L11,20 M23,1 L10,22 M23,1 L17,22 M24,1 L18,22 M6,1 L10,1 M23,1 L27,1 M0,22 L6,22 M14,22 L21,22"
    },
    {
      "dec": "100",
      "width": "22",
      "d": "M18,1 L14,15 13,19 13,21 14,22 17,22 19,20 20,18 M19,1 L15,15 14,19 14,21 15,22 M14,15 L14,12 13,9 11,8 9,8 6,9 4,12 3,15 3,18 4,20 5,21 7,22 9,22 11,21 13,18 14,15 M9,8 L7,9 5,12 4,15 4,19 5,21 M15,1 L19,1"
    },
    {
      "dec": "8220",
      "width": "14",
      "d": "M 3,7 4,6 5,7 4,8 3,7 V 5 L 5,3 M 9,7 10,6 11,7 10,8 9,7 V 5 l 2,-2"
    },
    {
      "dec": "117",
      "width": "22",
      "d": "M1,12 L2,10 4,8 7,8 8,9 8,12 6,18 6,20 8,22 M6,8 L7,9 7,12 5,18 5,20 6,21 8,22 10,22 12,21 14,19 16,15 M18,8 L16,15 15,19 15,21 16,22 19,22 21,20 22,18 M19,8 L17,15 16,19 16,21 17,22"
    },
    {
      "dec": "39",
      "width": "10",
      "d": "M7,1 L5,8 M8,1 L5,8"
    },
    {
      "dec": "44",
      "width": "12",
      "d": "M3,22 L2,21 3,20 4,21 4,22 3,24 1,26"
    },
    {
      "dec": "99",
      "width": "18",
      "d": "M14,11 L14,12 15,12 15,11 14,9 12,8 9,8 6,9 4,12 3,15 3,18 4,20 5,21 7,22 9,22 12,21 14,18 M9,8 L7,9 5,12 4,15 4,19 5,21"
    },
    {
      "dec": "125",
      "width": "14",
      "d": "M5,-3 L7,-2 8,-1 9,1 9,3 8,5 7,6 6,8 6,10 8,12 M7,-2 L8,0 8,2 7,4 6,5 5,7 5,9 6,11 10,13 6,15 5,17 5,19 6,21 7,22 8,24 8,26 7,28 M8,14 L6,16 6,18 7,20 8,21 9,23 9,25 8,27 7,28 5,29"
    }
  ]
}